{
  "data_features": {
    "feature": [
      {
        "data_type": "nominal",
        "index": "0",
        "is_ignore": "false",
        "is_row_identifier": "true",
        "is_target": "false",
        "name": "molecule_id",
        "nominal_value": [
          "CHEMBL105792",
          "CHEMBL105820",
          "CHEMBL105823",
          "CHEMBL105830",
          "CHEMBL106261",
          "CHEMBL107404",
          "CHEMBL107413",
          "CHEMBL108318",
          "CHEMBL108319",
          "CHEMBL108352",
          "CHEMBL108788",
          "CHEMBL110498",
          "CHEMBL110705",
          "CHEMBL110789",
          "CHEMBL227744",
          "CHEMBL256147",
          "CHEMBL317459",
          "CHEMBL320547",
          "CHEMBL322085",
          "CHEMBL323117",
          "CHEMBL447832",
          "CHEMBL69446"
        ],
        "number_of_missing_values": "0"
      },
      {
        "data_type": "numeric",
        "index": "1",
        "is_ignore": "false",
        "is_row_identifier": "false",
        "is_target": "false",
        "name": "AMW",
        "number_of_missing_values": "0"
      },
      {
        "data_type": "numeric",
        "index": "2",
        "is_ignore": "false",
        "is_row_identifier": "false",
        "is_target": "false",
        "name": "C.",
        "number_of_missing_values": "0"
      },
      {
        "data_type": "numeric",
        "index": "3",
        "is_ignore": "false",
        "is_row_identifier": "false",
        "is_target": "true",
        "name": "pXC50",
        "number_of_missing_values": "0"
      }
    ]
  }
}