{
  "data_features": {
    "feature": [
      {
        "data_type": "nominal",
        "index": "0",
        "is_ignore": "false",
        "is_row_identifier": "true",
        "is_target": "false",
        "name": "molecule_id",
        "nominal_value": [
          "CHEMBL1190869",
          "CHEMBL1192517",
          "CHEMBL1201257",
          "CHEMBL1231",
          "CHEMBL1235119",
          "CHEMBL1275666",
          "CHEMBL1275667",
          "CHEMBL1275668",
          "CHEMBL1275705",
          "CHEMBL1275706",
          "CHEMBL1275727",
          "CHEMBL1275728",
          "CHEMBL1275789",
          "CHEMBL1277562",
          "CHEMBL1277563",
          "CHEMBL1277655",
          "CHEMBL1277748",
          "CHEMBL1767018",
          "CHEMBL1767019",
          "CHEMBL1767020",
          "CHEMBL1767021",
          "CHEMBL1767022",
          "CHEMBL1767025",
          "CHEMBL1767026",
          "CHEMBL1767028",
          "CHEMBL45868",
          "CHEMBL505",
          "CHEMBL602178"
        ],
        "number_of_missing_values": "0"
      },
      {
        "data_type": "numeric",
        "index": "1",
        "is_ignore": "false",
        "is_row_identifier": "false",
        "is_target": "false",
        "name": "AMW",
        "number_of_missing_values": "0"
      },
      {
        "data_type": "numeric",
        "index": "2",
        "is_ignore": "false",
        "is_row_identifier": "false",
        "is_target": "false",
        "name": "C.",
        "number_of_missing_values": "0"
      },
      {
        "data_type": "numeric",
        "index": "3",
        "is_ignore": "false",
        "is_row_identifier": "false",
        "is_target": "false",
        "name": "H.",
        "number_of_missing_values": "0"
      },
      {
        "data_type": "numeric",
        "index": "4",
        "is_ignore": "false",
        "is_row_identifier": "false",
        "is_target": "false",
        "name": "Me",
        "number_of_missing_values": "0"
      },
      {
        "data_type": "numeric",
        "index": "5",
        "is_ignore": "false",
        "is_row_identifier": "false",
        "is_target": "true",
        "name": "pXC50",
        "number_of_missing_values": "0"
      }
    ]
  }
}