"molecule_id","AMW","C.","H.","Me","pXC50"
{1 6.266,2 41.9,3 53.5,4 0.98,5 4.041}
{0 CHEMBL1192517,1 6.266,2 41.9,3 53.5,4 0.98,5 4.041}
{0 CHEMBL1201257,1 6.305,2 45.5,3 52.3,4 0.973,5 4.215}
{0 CHEMBL1231,1 6.273,2 38.6,3 54.4,4 0.988,5 4}
{0 CHEMBL1235119,1 8.457,2 37.5,3 50,4 0.995,5 5.222}
{0 CHEMBL1275666,1 5.82,2 38.1,3 57.1,4 0.974,5 4.745}
{0 CHEMBL1275667,1 7.319,2 43.6,3 48.7,4 0.986,5 4.854}
{0 CHEMBL1275668,1 8.871,2 37.8,3 48.6,4 1.007,5 4}
{0 CHEMBL1275705,1 6.036,2 35.1,3 56.8,4 0.989,5 4}
{0 CHEMBL1275706,1 6.716,2 36.1,3 55.6,4 0.989,5 4.018}
{0 CHEMBL1275727,1 6.889,2 34.1,3 53.7,4 0.994,5 4.77}
{0 CHEMBL1275728,1 8.072,2 32.5,3 50,4 1.015,5 4}
{0 CHEMBL1275789,1 6.509,2 36.6,3 56.1,4 0.982,5 4.161}
{0 CHEMBL1277562,1 6.572,2 39.6,3 52.1,4 0.993,5 4.076}
{0 CHEMBL1277563,1 7.362,2 43.9,3 48.8,4 0.99,5 4}
{0 CHEMBL1277655,1 9.447,2 39.2,3 43.1,4 1.015,5 4.284}
{0 CHEMBL1277748,1 6.885,2 31.3,3 54.2,4 1.004,5 4}
{0 CHEMBL1767018,1 6.567,2 34.4,3 52.5,4 0.996,5 4}
{0 CHEMBL1767019,1 6.478,2 34.4,3 53.1,4 0.994,5 4}
{0 CHEMBL1767020,1 6.398,2 34.3,3 53.7,4 0.993,5 4.108}
{0 CHEMBL1767021,1 6.48,2 35.3,3 52.9,4 0.993,5 4.432}
{0 CHEMBL1767022,1 8.102,2 35.7,3 52.4,4 0.993,5 4.461}
{0 CHEMBL1767025,1 8.531,2 34.1,3 52.3,4 0.997,5 4.602}
{0 CHEMBL1767026,1 8.285,2 34,3 53.2,4 0.995,5 4}
{0 CHEMBL1767028,1 8.94,2 34.1,3 50,4 1.009,5 4.292}
{0 CHEMBL45868,1 5.631,2 37.9,3 58.6,4 0.971,5 4.167}
{0 CHEMBL505,1 7.232,2 42.1,3 50,4 0.986,5 4.387}
{0 CHEMBL602178,1 6.396,2 40.9,3 52.3,4 0.98,5 4.678}
