"molecule_id","AMW","C.","H.","Me","Mi","Mp","Mv","MW","N.","nAB","nAT","nB","nBM","nBO","nBR","nBT","nC","nCL","nCsp","nCsp2","nCsp3","nDB","nF","nH","nHet","nHM","nI","nN","nO","nP","nS","nSK","nTB","nX","O.","RBF","RBN","SCBO","Se","Si","Sp","Sv","X.","pXC50"
{1 8.82,2 33.3,3 41.7,4 1.02,5 1.153,6 0.674,7 0.646,8 211.68,9 20.8,10 6,11 24,13 8,14 14,16 24,17 8,18 1,20 8,22 2,24 10,25 6,26 1,28 5,32 14,34 1,36 0.167,37 4,38 19,39 24.484,40 27.681,41 16.171,42 15.515,43 4.2,44 5.8}
{0 CHEMBL13791,1 7.385,2 33.3,3 45.8,4 1.007,5 1.156,6 0.638,7 0.612,8 177.24,9 20.8,10 6,11 24,13 8,14 13,16 24,17 8,20 8,22 2,24 11,25 5,28 5,32 13,36 0.167,37 4,38 18,39 24.16,40 27.737,41 15.313,42 14.687,44 4.1}
{0 CHEMBL1628595,1 7.557,2 36.6,3 48.8,4 1.006,5 1.136,6 0.65,7 0.611,8 309.83,9 7.3,10 6,11 41,13 7,14 23,16 43,17 15,18 1,20 7,21 8,22 1,24 20,25 6,26 1,28 3,29 2,32 21,34 1,35 4.9,36 0.07,37 3,38 27,39 41.236,40 46.595,41 26.637,42 25.063,43 2.4,44 8.699}
{0 CHEMBL1628632,1 7.226,2 43.2,3 45.9,4 0.995,5 1.125,6 0.67,7 0.634,8 267.36,9 8.1,10 15,11 37,13 16,14 22,16 39,17 16,20 12,21 4,22 1,24 17,25 4,28 3,29 1,32 20,35 2.7,36 0.103,37 4,38 30.5,39 36.818,40 41.611,41 24.801,42 23.467,44 8.585}
{0 CHEMBL1628633,1 6.648,2 38.3,3 51.1,4 0.991,5 1.135,6 0.64,7 0.597,8 312.46,9 8.5,10 10,11 47,13 11,14 26,16 50,17 18,20 8,21 10,22 1,24 24,25 5,28 4,29 1,32 23,35 2.1,36 0.04,37 2,38 32,39 46.571,40 53.355,41 30.091,42 28.068,44 8.921}
{0 CHEMBL1628655,1 7.352,2 44.7,3 44.7,4 0.995,5 1.121,6 0.679,7 0.644,8 279.37,9 7.9,10 15,11 38,13 16,14 24,16 41,17 17,20 12,21 5,22 1,24 17,25 4,28 3,29 1,32 21,35 2.6,36 0.049,37 2,38 32.5,39 37.818,40 42.611,41 25.801,42 24.467,44 9.824}
{0 CHEMBL266591,1 6.795,2 39.3,3 50,4 0.994,5 1.132,6 0.644,7 0.604,8 190.27,9 7.1,10 10,11 28,13 10,14 15,16 29,17 11,20 8,21 3,24 14,25 3,28 2,29 1,32 14,35 3.6,36 0.069,37 2,38 20,39 27.833,40 31.697,41 18.034,42 16.918,44 5.6}
{0 CHEMBL289469,1 6.648,2 38.3,3 51.1,4 0.991,5 1.135,6 0.64,7 0.597,8 312.46,9 8.5,10 10,11 47,13 11,14 26,16 50,17 18,20 8,21 10,22 1,24 24,25 5,28 4,29 1,32 23,35 2.1,36 0.04,37 2,38 32,39 46.571,40 53.355,41 30.091,42 28.068,44 8.801}
{0 CHEMBL28992,1 7.557,2 36.6,3 48.8,4 1.006,5 1.136,6 0.65,7 0.611,8 309.83,9 7.3,10 6,11 41,13 7,14 23,16 43,17 15,18 1,20 7,21 8,22 1,24 20,25 6,26 1,28 3,29 2,32 21,34 1,35 4.9,36 0.07,37 3,38 27,39 41.236,40 46.595,41 26.637,42 25.063,43 2.4,44 9}
{0 CHEMBL46,1 7.156,2 43.9,3 46.3,4 0.993,5 1.123,6 0.672,7 0.634,8 293.4,9 7.3,10 15,11 41,13 16,14 25,16 44,17 18,20 12,21 6,22 1,24 19,25 4,28 3,29 1,32 22,35 2.4,36 0.045,37 2,38 33.5,39 40.702,40 46.026,41 27.563,42 25.993,44 8.3}
{0 CHEMBL56564,1 6.936,2 41.5,3 48.8,4 0.995,5 1.126,6 0.653,7 0.615,8 284.39,9 4.9,10 10,11 41,13 11,14 24,16 44,17 17,20 9,21 8,22 1,24 20,25 4,28 2,29 2,32 21,35 4.9,36 0.068,37 3,38 30,39 40.811,40 46.152,41 26.773,42 25.214,44 8.801}
