{
  "data_features": {
    "feature": [
      {
        "data_type": "nominal",
        "index": "0",
        "is_ignore": "false",
        "is_row_identifier": "true",
        "is_target": "false",
        "name": "molecule_id",
        "nominal_value": [
          "CHEMBL10",
          "CHEMBL101253",
          "CHEMBL102765",
          "CHEMBL102766",
          "CHEMBL103667",
          "CHEMBL103838",
          "CHEMBL105442",
          "CHEMBL1081198",
          "CHEMBL1085511",
          "CHEMBL112172",
          "CHEMBL112263",
          "CHEMBL112346",
          "CHEMBL112518",
          "CHEMBL112561",
          "CHEMBL112623",
          "CHEMBL113185",
          "CHEMBL115220",
          "CHEMBL1173655",
          "CHEMBL119385",
          "CHEMBL1230020",
          "CHEMBL1236107",
          "CHEMBL1240703",
          "CHEMBL1241674",
          "CHEMBL1242977",
          "CHEMBL1243200",
          "CHEMBL1243326",
          "CHEMBL124660",
          "CHEMBL1258913",
          "CHEMBL1270230",
          "CHEMBL1287853",
          "CHEMBL1289926",
          "CHEMBL129842",
          "CHEMBL130106",
          "CHEMBL130109",
          "CHEMBL130401",
          "CHEMBL130871",
          "CHEMBL130931",
          "CHEMBL131086",
          "CHEMBL131229",
          "CHEMBL131256",
          "CHEMBL131361",
          "CHEMBL131773",
          "CHEMBL131944",
          "CHEMBL132006",
          "CHEMBL132007",
          "CHEMBL132963",
          "CHEMBL133185",
          "CHEMBL133511",
          "CHEMBL1336",
          "CHEMBL133644",
          "CHEMBL133929",
          "CHEMBL134004",
          "CHEMBL134030",
          "CHEMBL134042",
          "CHEMBL134243",
          "CHEMBL141247",
          "CHEMBL1421",
          "CHEMBL14762",
          "CHEMBL1614701",
          "CHEMBL162",
          "CHEMBL1651521",
          "CHEMBL1721885",
          "CHEMBL1738710",
          "CHEMBL1738758",
          "CHEMBL1765781",
          "CHEMBL1789941",
          "CHEMBL180022",
          "CHEMBL1834657",
          "CHEMBL1835071",
          "CHEMBL189338",
          "CHEMBL1908391",
          "CHEMBL1908392",
          "CHEMBL1908393",
          "CHEMBL1908394",
          "CHEMBL1908395",
          "CHEMBL1908396",
          "CHEMBL1908397",
          "CHEMBL191003",
          "CHEMBL1929238",
          "CHEMBL1945559",
          "CHEMBL197603",
          "CHEMBL2012519",
          "CHEMBL2046643",
          "CHEMBL2048912",
          "CHEMBL205386",
          "CHEMBL209148",
          "CHEMBL2148053",
          "CHEMBL215152",
          "CHEMBL215803",
          "CHEMBL215943",
          "CHEMBL221959",
          "CHEMBL223360",
          "CHEMBL225088",
          "CHEMBL225519",
          "CHEMBL230011",
          "CHEMBL2309006",
          "CHEMBL2309609",
          "CHEMBL231568",
          "CHEMBL2326002",
          "CHEMBL2333365",
          "CHEMBL2348417",
          "CHEMBL246356",
          "CHEMBL247468",
          "CHEMBL247866",
          "CHEMBL24828",
          "CHEMBL249697",
          "CHEMBL255863",
          "CHEMBL259084",
          "CHEMBL260861",
          "CHEMBL261641",
          "CHEMBL261849",
          "CHEMBL264257",
          "CHEMBL27085",
          "CHEMBL274654",
          "CHEMBL276711",
          "CHEMBL278041",
          "CHEMBL281957",
          "CHEMBL288441",
          "CHEMBL296468",
          "CHEMBL300138",
          "CHEMBL300936",
          "CHEMBL306498",
          "CHEMBL310313",
          "CHEMBL316967",
          "CHEMBL318300",
          "CHEMBL319179",
          "CHEMBL319210",
          "CHEMBL319467",
          "CHEMBL31965",
          "CHEMBL320372",
          "CHEMBL321079",
          "CHEMBL322066",
          "CHEMBL323755",
          "CHEMBL324576",
          "CHEMBL325912",
          "CHEMBL334539",
          "CHEMBL334891",
          "CHEMBL334979",
          "CHEMBL335284",
          "CHEMBL335628",
          "CHEMBL336314",
          "CHEMBL336644",
          "CHEMBL336864",
          "CHEMBL336949",
          "CHEMBL336958",
          "CHEMBL336975",
          "CHEMBL336978",
          "CHEMBL337253",
          "CHEMBL337451",
          "CHEMBL337459",
          "CHEMBL337737",
          "CHEMBL339077",
          "CHEMBL340977",
          "CHEMBL344319",
          "CHEMBL373882",
          "CHEMBL377300",
          "CHEMBL379218",
          "CHEMBL384304",
          "CHEMBL386051",
          "CHEMBL386661",
          "CHEMBL386760",
          "CHEMBL386787",
          "CHEMBL402548",
          "CHEMBL407143",
          "CHEMBL407391",
          "CHEMBL410295",
          "CHEMBL411163",
          "CHEMBL411491",
          "CHEMBL419539",
          "CHEMBL419757",
          "CHEMBL420672",
          "CHEMBL423330",
          "CHEMBL424449",
          "CHEMBL428690",
          "CHEMBL439120",
          "CHEMBL440084",
          "CHEMBL443592",
          "CHEMBL445162",
          "CHEMBL445813",
          "CHEMBL450786",
          "CHEMBL451450",
          "CHEMBL453217",
          "CHEMBL453737",
          "CHEMBL455428",
          "CHEMBL457519",
          "CHEMBL458788",
          "CHEMBL458806",
          "CHEMBL458973",
          "CHEMBL459146",
          "CHEMBL459147",
          "CHEMBL459850",
          "CHEMBL463876",
          "CHEMBL464043",
          "CHEMBL464552",
          "CHEMBL465098",
          "CHEMBL465099",
          "CHEMBL465107",
          "CHEMBL465462",
          "CHEMBL465463",
          "CHEMBL465464",
          "CHEMBL465471",
          "CHEMBL470175",
          "CHEMBL470780",
          "CHEMBL471727",
          "CHEMBL471776",
          "CHEMBL471819",
          "CHEMBL471901",
          "CHEMBL47203",
          "CHEMBL472478",
          "CHEMBL472590",
          "CHEMBL472840",
          "CHEMBL473229",
          "CHEMBL473240",
          "CHEMBL474582",
          "CHEMBL475180",
          "CHEMBL475249",
          "CHEMBL475251",
          "CHEMBL475254",
          "CHEMBL475371",
          "CHEMBL475575",
          "CHEMBL475609",
          "CHEMBL475882",
          "CHEMBL476537",
          "CHEMBL476741",
          "CHEMBL477165",
          "CHEMBL477772",
          "CHEMBL478642",
          "CHEMBL47940",
          "CHEMBL479617",
          "CHEMBL479820",
          "CHEMBL479821",
          "CHEMBL480014",
          "CHEMBL481182",
          "CHEMBL481381",
          "CHEMBL481397",
          "CHEMBL481973",
          "CHEMBL482175",
          "CHEMBL483321",
          "CHEMBL484350",
          "CHEMBL485204",
          "CHEMBL485730",
          "CHEMBL485731",
          "CHEMBL486751",
          "CHEMBL491473",
          "CHEMBL494089",
          "CHEMBL500086",
          "CHEMBL505177",
          "CHEMBL505896",
          "CHEMBL508242",
          "CHEMBL509032",
          "CHEMBL509161",
          "CHEMBL511670",
          "CHEMBL511811",
          "CHEMBL511829",
          "CHEMBL511977",
          "CHEMBL512172",
          "CHEMBL512190",
          "CHEMBL512319",
          "CHEMBL513909",
          "CHEMBL513915",
          "CHEMBL514365",
          "CHEMBL515054",
          "CHEMBL515757",
          "CHEMBL516852",
          "CHEMBL517011",
          "CHEMBL519131",
          "CHEMBL519448",
          "CHEMBL519777",
          "CHEMBL520608",
          "CHEMBL520669",
          "CHEMBL520842",
          "CHEMBL520945",
          "CHEMBL521851",
          "CHEMBL522892",
          "CHEMBL525191",
          "CHEMBL534948",
          "CHEMBL535",
          "CHEMBL553",
          "CHEMBL554",
          "CHEMBL557101",
          "CHEMBL558752",
          "CHEMBL558969",
          "CHEMBL559787",
          "CHEMBL564829",
          "CHEMBL564940",
          "CHEMBL565612",
          "CHEMBL572508",
          "CHEMBL572562",
          "CHEMBL572878",
          "CHEMBL572881",
          "CHEMBL573019",
          "CHEMBL573026",
          "CHEMBL573339",
          "CHEMBL573483",
          "CHEMBL573484",
          "CHEMBL573488",
          "CHEMBL573719",
          "CHEMBL573959",
          "CHEMBL574385",
          "CHEMBL574599",
          "CHEMBL574738",
          "CHEMBL574839",
          "CHEMBL574841",
          "CHEMBL575046",
          "CHEMBL575048",
          "CHEMBL575052",
          "CHEMBL575252",
          "CHEMBL575266",
          "CHEMBL576982",
          "CHEMBL578450",
          "CHEMBL583042",
          "CHEMBL583791",
          "CHEMBL584148",
          "CHEMBL584170",
          "CHEMBL584570",
          "CHEMBL584758",
          "CHEMBL589630",
          "CHEMBL591325",
          "CHEMBL597754",
          "CHEMBL599224",
          "CHEMBL599428",
          "CHEMBL601719",
          "CHEMBL607707",
          "CHEMBL608154",
          "CHEMBL69129",
          "CHEMBL76904",
          "CHEMBL91829",
          "CHEMBL939",
          "CHEMBL941",
          "CHEMBL99125"
        ],
        "number_of_missing_values": "0"
      },
      {
        "data_type": "numeric",
        "index": "1",
        "is_ignore": "false",
        "is_row_identifier": "false",
        "is_target": "false",
        "name": "Chi1_EA.dm.",
        "number_of_missing_values": "0"
      },
      {
        "data_type": "numeric",
        "index": "2",
        "is_ignore": "false",
        "is_row_identifier": "false",
        "is_target": "false",
        "name": "PW4",
        "number_of_missing_values": "0"
      },
      {
        "data_type": "numeric",
        "index": "3",
        "is_ignore": "false",
        "is_row_identifier": "false",
        "is_target": "false",
        "name": "SssNH",
        "number_of_missing_values": "0"
      },
      {
        "data_type": "numeric",
        "index": "4",
        "is_ignore": "false",
        "is_row_identifier": "false",
        "is_target": "false",
        "name": "MCD",
        "number_of_missing_values": "0"
      },
      {
        "data_type": "numeric",
        "index": "5",
        "is_ignore": "false",
        "is_row_identifier": "false",
        "is_target": "false",
        "name": "piPC09",
        "number_of_missing_values": "0"
      },
      {
        "data_type": "numeric",
        "index": "6",
        "is_ignore": "false",
        "is_row_identifier": "false",
        "is_target": "false",
        "name": "SssO",
        "number_of_missing_values": "0"
      },
      {
        "data_type": "numeric",
        "index": "7",
        "is_ignore": "false",
        "is_row_identifier": "false",
        "is_target": "false",
        "name": "piPC10",
        "number_of_missing_values": "0"
      },
      {
        "data_type": "numeric",
        "index": "8",
        "is_ignore": "false",
        "is_row_identifier": "false",
        "is_target": "false",
        "name": "P_VSA_LogP_1",
        "number_of_missing_values": "0"
      },
      {
        "data_type": "numeric",
        "index": "9",
        "is_ignore": "false",
        "is_row_identifier": "false",
        "is_target": "false",
        "name": "C.005",
        "number_of_missing_values": "0"
      },
      {
        "data_type": "numeric",
        "index": "10",
        "is_ignore": "false",
        "is_row_identifier": "false",
        "is_target": "false",
        "name": "nArOR",
        "number_of_missing_values": "0"
      },
      {
        "data_type": "numeric",
        "index": "11",
        "is_ignore": "false",
        "is_row_identifier": "false",
        "is_target": "false",
        "name": "NssO",
        "number_of_missing_values": "0"
      },
      {
        "data_type": "numeric",
        "index": "12",
        "is_ignore": "false",
        "is_row_identifier": "false",
        "is_target": "false",
        "name": "NaasC",
        "number_of_missing_values": "0"
      },
      {
        "data_type": "numeric",
        "index": "13",
        "is_ignore": "false",
        "is_row_identifier": "false",
        "is_target": "false",
        "name": "CATS2D_08_DA",
        "number_of_missing_values": "0"
      },
      {
        "data_type": "numeric",
        "index": "14",
        "is_ignore": "false",
        "is_row_identifier": "false",
        "is_target": "false",
        "name": "PCD",
        "number_of_missing_values": "0"
      },
      {
        "data_type": "numeric",
        "index": "15",
        "is_ignore": "false",
        "is_row_identifier": "false",
        "is_target": "false",
        "name": "GATS3i",
        "number_of_missing_values": "0"
      },
      {
        "data_type": "numeric",
        "index": "16",
        "is_ignore": "false",
        "is_row_identifier": "false",
        "is_target": "false",
        "name": "GATS2v",
        "number_of_missing_values": "0"
      },
      {
        "data_type": "numeric",
        "index": "17",
        "is_ignore": "false",
        "is_row_identifier": "false",
        "is_target": "false",
        "name": "nArNHR",
        "number_of_missing_values": "0"
      },
      {
        "data_type": "numeric",
        "index": "18",
        "is_ignore": "false",
        "is_row_identifier": "false",
        "is_target": "false",
        "name": "Eig01_EA.bo.",
        "number_of_missing_values": "0"
      },
      {
        "data_type": "numeric",
        "index": "19",
        "is_ignore": "false",
        "is_row_identifier": "false",
        "is_target": "false",
        "name": "SM11_AEA.ri.",
        "number_of_missing_values": "0"
      },
      {
        "data_type": "numeric",
        "index": "20",
        "is_ignore": "false",
        "is_row_identifier": "false",
        "is_target": "false",
        "name": "SpMax_EA.bo.",
        "number_of_missing_values": "0"
      },
      {
        "data_type": "numeric",
        "index": "21",
        "is_ignore": "false",
        "is_row_identifier": "false",
        "is_target": "false",
        "name": "SaaN",
        "number_of_missing_values": "0"
      },
      {
        "data_type": "numeric",
        "index": "22",
        "is_ignore": "false",
        "is_row_identifier": "false",
        "is_target": "false",
        "name": "nPyrimidines",
        "number_of_missing_values": "0"
      },
      {
        "data_type": "numeric",
        "index": "23",
        "is_ignore": "false",
        "is_row_identifier": "false",
        "is_target": "false",
        "name": "SpMax7_Bh.s.",
        "number_of_missing_values": "0"
      },
      {
        "data_type": "numeric",
        "index": "24",
        "is_ignore": "false",
        "is_row_identifier": "false",
        "is_target": "false",
        "name": "CATS2D_05_DL",
        "number_of_missing_values": "0"
      },
      {
        "data_type": "numeric",
        "index": "25",
        "is_ignore": "false",
        "is_row_identifier": "false",
        "is_target": "false",
        "name": "CATS2D_04_DD",
        "number_of_missing_values": "0"
      },
      {
        "data_type": "numeric",
        "index": "26",
        "is_ignore": "false",
        "is_row_identifier": "false",
        "is_target": "false",
        "name": "GNar",
        "number_of_missing_values": "0"
      },
      {
        "data_type": "numeric",
        "index": "27",
        "is_ignore": "false",
        "is_row_identifier": "false",
        "is_target": "false",
        "name": "SaaO",
        "number_of_missing_values": "0"
      },
      {
        "data_type": "numeric",
        "index": "28",
        "is_ignore": "false",
        "is_row_identifier": "false",
        "is_target": "false",
        "name": "GATS1p",
        "number_of_missing_values": "0"
      },
      {
        "data_type": "numeric",
        "index": "29",
        "is_ignore": "false",
        "is_row_identifier": "false",
        "is_target": "false",
        "name": "MATS2p",
        "number_of_missing_values": "0"
      },
      {
        "data_type": "numeric",
        "index": "30",
        "is_ignore": "false",
        "is_row_identifier": "false",
        "is_target": "false",
        "name": "X2A",
        "number_of_missing_values": "0"
      },
      {
        "data_type": "numeric",
        "index": "31",
        "is_ignore": "false",
        "is_row_identifier": "false",
        "is_target": "false",
        "name": "N.",
        "number_of_missing_values": "0"
      },
      {
        "data_type": "numeric",
        "index": "32",
        "is_ignore": "false",
        "is_row_identifier": "false",
        "is_target": "false",
        "name": "ATSC2e",
        "number_of_missing_values": "0"
      },
      {
        "data_type": "numeric",
        "index": "33",
        "is_ignore": "false",
        "is_row_identifier": "false",
        "is_target": "false",
        "name": "MATS2e",
        "number_of_missing_values": "0"
      },
      {
        "data_type": "numeric",
        "index": "34",
        "is_ignore": "false",
        "is_row_identifier": "false",
        "is_target": "false",
        "name": "SM15_EA.bo.",
        "number_of_missing_values": "0"
      },
      {
        "data_type": "numeric",
        "index": "35",
        "is_ignore": "false",
        "is_row_identifier": "false",
        "is_target": "false",
        "name": "SM14_EA.bo.",
        "number_of_missing_values": "0"
      },
      {
        "data_type": "numeric",
        "index": "36",
        "is_ignore": "false",
        "is_row_identifier": "false",
        "is_target": "false",
        "name": "SM03_EA.dm.",
        "number_of_missing_values": "0"
      },
      {
        "data_type": "numeric",
        "index": "37",
        "is_ignore": "false",
        "is_row_identifier": "false",
        "is_target": "false",
        "name": "N.073",
        "number_of_missing_values": "0"
      },
      {
        "data_type": "numeric",
        "index": "38",
        "is_ignore": "false",
        "is_row_identifier": "false",
        "is_target": "false",
        "name": "P_VSA_p_4",
        "number_of_missing_values": "0"
      },
      {
        "data_type": "numeric",
        "index": "39",
        "is_ignore": "false",
        "is_row_identifier": "false",
        "is_target": "false",
        "name": "GATS2e",
        "number_of_missing_values": "0"
      },
      {
        "data_type": "numeric",
        "index": "40",
        "is_ignore": "false",
        "is_row_identifier": "false",
        "is_target": "false",
        "name": "X3A",
        "number_of_missing_values": "0"
      },
      {
        "data_type": "numeric",
        "index": "41",
        "is_ignore": "false",
        "is_row_identifier": "false",
        "is_target": "false",
        "name": "MATS2v",
        "number_of_missing_values": "0"
      },
      {
        "data_type": "numeric",
        "index": "42",
        "is_ignore": "false",
        "is_row_identifier": "false",
        "is_target": "false",
        "name": "CATS2D_05_NL",
        "number_of_missing_values": "0"
      },
      {
        "data_type": "numeric",
        "index": "43",
        "is_ignore": "false",
        "is_row_identifier": "false",
        "is_target": "false",
        "name": "MATS4s",
        "number_of_missing_values": "0"
      },
      {
        "data_type": "numeric",
        "index": "44",
        "is_ignore": "false",
        "is_row_identifier": "false",
        "is_target": "false",
        "name": "NaaO",
        "number_of_missing_values": "0"
      },
      {
        "data_type": "numeric",
        "index": "45",
        "is_ignore": "false",
        "is_row_identifier": "false",
        "is_target": "false",
        "name": "Eig02_EA.dm.",
        "number_of_missing_values": "0"
      },
      {
        "data_type": "numeric",
        "index": "46",
        "is_ignore": "false",
        "is_row_identifier": "false",
        "is_target": "false",
        "name": "HNar",
        "number_of_missing_values": "0"
      },
      {
        "data_type": "numeric",
        "index": "47",
        "is_ignore": "false",
        "is_row_identifier": "false",
        "is_target": "false",
        "name": "CATS2D_04_DA",
        "number_of_missing_values": "0"
      },
      {
        "data_type": "numeric",
        "index": "48",
        "is_ignore": "false",
        "is_row_identifier": "false",
        "is_target": "false",
        "name": "SM05_EA.dm.",
        "number_of_missing_values": "0"
      },
      {
        "data_type": "numeric",
        "index": "49",
        "is_ignore": "false",
        "is_row_identifier": "false",
        "is_target": "false",
        "name": "PW3",
        "number_of_missing_values": "0"
      },
      {
        "data_type": "numeric",
        "index": "50",
        "is_ignore": "false",
        "is_row_identifier": "false",
        "is_target": "false",
        "name": "piPC06",
        "number_of_missing_values": "0"
      },
      {
        "data_type": "numeric",
        "index": "51",
        "is_ignore": "false",
        "is_row_identifier": "false",
        "is_target": "false",
        "name": "PCR",
        "number_of_missing_values": "0"
      },
      {
        "data_type": "numeric",
        "index": "52",
        "is_ignore": "false",
        "is_row_identifier": "false",
        "is_target": "false",
        "name": "SpMin7_Bh.s.",
        "number_of_missing_values": "0"
      },
      {
        "data_type": "numeric",
        "index": "53",
        "is_ignore": "false",
        "is_row_identifier": "false",
        "is_target": "false",
        "name": "CATS2D_01_LL",
        "number_of_missing_values": "0"
      },
      {
        "data_type": "numeric",
        "index": "54",
        "is_ignore": "false",
        "is_row_identifier": "false",
        "is_target": "false",
        "name": "MATS5e",
        "number_of_missing_values": "0"
      },
      {
        "data_type": "numeric",
        "index": "55",
        "is_ignore": "false",
        "is_row_identifier": "false",
        "is_target": "false",
        "name": "SM13_EA.bo.",
        "number_of_missing_values": "0"
      },
      {
        "data_type": "numeric",
        "index": "56",
        "is_ignore": "false",
        "is_row_identifier": "false",
        "is_target": "false",
        "name": "SM07_EA.dm.",
        "number_of_missing_values": "0"
      },
      {
        "data_type": "numeric",
        "index": "57",
        "is_ignore": "false",
        "is_row_identifier": "false",
        "is_target": "false",
        "name": "piPC08",
        "number_of_missing_values": "0"
      },
      {
        "data_type": "numeric",
        "index": "58",
        "is_ignore": "false",
        "is_row_identifier": "false",
        "is_target": "false",
        "name": "SpMax6_Bh.s.",
        "number_of_missing_values": "0"
      },
      {
        "data_type": "numeric",
        "index": "59",
        "is_ignore": "false",
        "is_row_identifier": "false",
        "is_target": "false",
        "name": "ATSC1s",
        "number_of_missing_values": "0"
      },
      {
        "data_type": "numeric",
        "index": "60",
        "is_ignore": "false",
        "is_row_identifier": "false",
        "is_target": "false",
        "name": "X0A",
        "number_of_missing_values": "0"
      },
      {
        "data_type": "numeric",
        "index": "61",
        "is_ignore": "false",
        "is_row_identifier": "false",
        "is_target": "false",
        "name": "P_VSA_s_6",
        "number_of_missing_values": "0"
      },
      {
        "data_type": "numeric",
        "index": "62",
        "is_ignore": "false",
        "is_row_identifier": "false",
        "is_target": "false",
        "name": "Eig01_AEA.bo.",
        "number_of_missing_values": "0"
      },
      {
        "data_type": "numeric",
        "index": "63",
        "is_ignore": "false",
        "is_row_identifier": "false",
        "is_target": "false",
        "name": "SpMax_AEA.bo.",
        "number_of_missing_values": "0"
      },
      {
        "data_type": "numeric",
        "index": "64",
        "is_ignore": "false",
        "is_row_identifier": "false",
        "is_target": "false",
        "name": "TPSA.Tot.",
        "number_of_missing_values": "0"
      },
      {
        "data_type": "numeric",
        "index": "65",
        "is_ignore": "false",
        "is_row_identifier": "false",
        "is_target": "false",
        "name": "SpMaxA_EA.dm.",
        "number_of_missing_values": "0"
      },
      {
        "data_type": "numeric",
        "index": "66",
        "is_ignore": "false",
        "is_row_identifier": "false",
        "is_target": "false",
        "name": "piPC07",
        "number_of_missing_values": "0"
      },
      {
        "data_type": "numeric",
        "index": "67",
        "is_ignore": "false",
        "is_row_identifier": "false",
        "is_target": "false",
        "name": "P_VSA_p_2",
        "number_of_missing_values": "0"
      },
      {
        "data_type": "numeric",
        "index": "68",
        "is_ignore": "false",
        "is_row_identifier": "false",
        "is_target": "false",
        "name": "P_VSA_v_2",
        "number_of_missing_values": "0"
      },
      {
        "data_type": "numeric",
        "index": "69",
        "is_ignore": "false",
        "is_row_identifier": "false",
        "is_target": "true",
        "name": "pXC50",
        "number_of_missing_values": "0"
      }
    ]
  }
}