"molecule_id","AMW","C.","H.","Me","Mi","Mp","Mv","MW","N.","nAB","nAT","nB","nBM","nBO","nBR","nBT","nC","nCL","nCsp","nCsp2","nCsp3","nDB","nF","nH","nHet","nHM","nI","nN","nO","nP","nS","nSK","nTB","nX","O.","RBF","RBN","SCBO","Se","Si","Sp","Sv","X.","pXC50"
{1 10.687,2 47.2,3 30.2,4 1.047,5 1.126,6 0.744,7 0.735,8 566.41,9 5.7,10 27,11 53,13 29,14 41,16 57,17 25,18 2,20 23,21 2,22 2,23 3,24 16,25 12,26 3,28 3,29 3,31 1,32 37,34 5,35 5.7,36 0.105,37 6,38 56.5,39 55.502,40 59.687,41 39.409,42 38.942,43 9.4,44 4.703}
{0 CHEMBL1083400,1 9.108,2 47.3,3 36.4,4 1.032,5 1.13,6 0.699,7 0.69,8 500.93,9 3.6,10 22,11 55,13 24,14 38,16 58,17 26,18 1,20 22,21 4,22 2,23 3,24 20,25 9,26 1,28 2,29 3,32 35,34 4,35 5.5,36 0.103,37 6,38 51,39 56.767,40 62.155,41 38.421,42 37.959,43 7.3,44 7}
{0 CHEMBL1083445,1 8.988,2 48.1,3 38.5,4 1.013,5 1.109,6 0.725,7 0.694,8 467.37,9 3.8,10 22,11 52,13 24,14 35,16 55,17 25,18 2,20 22,21 3,22 2,24 20,25 7,26 2,28 2,29 3,32 32,34 2,35 5.8,36 0.109,37 6,38 48,39 52.669,40 57.665,41 37.705,42 36.11,43 3.8,44 6.032}
{0 CHEMBL1084009,1 8.545,2 48.2,3 37.5,4 1.026,5 1.129,6 0.689,7 0.681,8 478.5,9 3.6,10 22,11 56,13 24,14 39,16 60,17 27,20 22,21 5,22 2,23 3,24 21,25 8,28 2,29 3,32 35,34 3,35 5.4,36 0.1,37 6,38 52,39 57.443,40 63.211,41 38.563,42 38.132,43 5.4,44 5.097}
{0 CHEMBL1084551,1 8.482,2 47.3,3 38.2,4 1.026,5 1.131,6 0.683,7 0.675,8 466.49,9 3.6,10 22,11 55,13 24,14 37,16 58,17 26,20 22,21 4,22 2,23 3,24 21,25 8,28 2,29 3,32 34,34 3,35 5.5,36 0.103,37 6,38 50,39 56.443,40 62.211,41 37.563,42 37.132,43 5.5,44 6.105}
{0 CHEMBL1084552,1 9.231,2 46.4,3 35.7,4 1.037,5 1.132,6 0.694,7 0.691,8 516.93,9 3.6,10 22,11 56,13 24,14 39,16 59,17 26,18 1,20 22,21 4,22 2,23 3,24 20,25 10,26 1,28 2,29 4,32 36,34 4,35 7.1,36 0.119,37 7,38 52,39 58.094,40 63.365,41 38.875,42 38.674,43 7.1,44 6.585}
{0 CHEMBL1084553,1 8.482,2 47.3,3 38.2,4 1.026,5 1.131,6 0.683,7 0.675,8 466.49,9 3.6,10 22,11 55,13 24,14 37,16 58,17 26,20 22,21 4,22 2,23 3,24 21,25 8,28 2,29 3,32 34,34 3,35 5.5,36 0.103,37 6,38 50,39 56.443,40 62.211,41 37.563,42 37.132,43 5.5,44 6.237}
{0 CHEMBL1085040,1 8.988,2 48.1,3 38.5,4 1.013,5 1.109,6 0.725,7 0.694,8 467.37,9 3.8,10 22,11 52,13 24,14 35,16 55,17 25,18 2,20 22,21 3,22 2,24 20,25 7,26 2,28 2,29 3,32 32,34 2,35 5.8,36 0.109,37 6,38 48,39 52.669,40 57.665,41 37.705,42 36.11,43 3.8,44 6.959}
{0 CHEMBL1085041,1 8.672,2 48.1,3 38.5,4 1.016,5 1.117,6 0.707,7 0.686,8 450.92,9 3.8,10 22,11 52,13 24,14 35,16 55,17 25,18 1,20 22,21 3,22 2,23 1,24 20,25 7,26 1,28 2,29 3,32 32,34 2,35 5.8,36 0.109,37 6,38 48,39 52.858,40 58.061,41 36.784,42 35.666,43 3.8,44 6.298}
{0 CHEMBL1085081,1 8.326,2 48.1,3 40.4,4 1.007,5 1.11,6 0.709,7 0.679,8 432.93,9 3.8,10 22,11 52,13 24,14 34,16 55,17 25,18 1,20 22,21 3,22 2,24 21,25 6,26 1,28 2,29 3,32 31,34 1,35 5.8,36 0.109,37 6,38 47,39 52.345,40 57.721,41 36.847,42 35.283,43 1.9,44 5.602}
{0 CHEMBL1086490,1 9.16,2 48.2,3 35.7,4 1.032,5 1.128,6 0.704,7 0.696,8 512.94,9 3.6,10 22,11 56,13 24,14 40,16 60,17 27,18 1,20 22,21 5,22 2,23 3,24 20,25 9,26 1,28 2,29 3,32 36,34 4,35 5.4,36 0.1,37 6,38 53,39 57.767,40 63.155,41 39.421,42 38.959,43 7.1,44 5.889}
{0 CHEMBL1093125,1 9.527,2 48.3,3 32.8,4 1.039,5 1.123,6 0.713,7 0.711,8 552.56,9 3.4,10 23,11 58,13 28,14 43,16 62,17 28,20 26,21 2,22 5,23 3,24 19,25 11,26 1,28 2,29 5,31 1,32 39,34 3,35 8.6,36 0.097,37 6,38 59.5,39 60.291,40 65.135,41 41.358,42 41.222,43 5.2,44 4.699}
{0 CHEMBL1093791,1 8.907,2 48.3,3 36.2,4 1.022,5 1.111,6 0.715,7 0.698,8 516.58,9 3.4,10 23,11 58,13 28,14 41,16 62,17 28,20 26,21 2,22 5,23 1,24 21,25 9,26 1,28 2,29 5,31 1,32 37,34 1,35 8.6,36 0.097,37 6,38 57.5,39 59.265,40 64.455,41 41.483,42 40.455,43 1.7,44 4.699}
{0 CHEMBL1093792,1 9.217,2 48.3,3 34.5,4 1.031,5 1.117,6 0.714,7 0.704,8 534.57,9 3.4,10 23,11 58,13 28,14 42,16 62,17 28,20 26,21 2,22 5,23 2,24 20,25 10,26 1,28 2,29 5,31 1,32 38,34 2,35 8.6,36 0.097,37 6,38 58.5,39 59.778,40 64.795,41 41.421,42 40.838,43 3.4,44 4.699}
{0 CHEMBL114395,1 8.876,2 41.3,3 41.3,4 1.019,5 1.125,6 0.695,7 0.665,8 408.31,9 6.5,10 12,11 46,13 14,14 29,16 48,17 19,18 2,20 14,21 5,22 2,24 19,25 8,26 2,28 3,29 3,32 27,34 2,35 6.5,36 0.083,37 4,38 37,39 46.887,40 51.748,41 31.949,42 30.605,43 4.3,44 6.2}
{0 CHEMBL1237295,1 7.255,2 49.1,3 45.3,4 0.992,5 1.106,6 0.689,7 0.65,8 384.5,10 18,11 53,13 21,14 31,16 55,17 26,20 23,21 3,22 3,24 24,25 3,29 3,32 29,35 5.7,36 0.145,37 8,38 43,39 52.585,40 58.611,41 36.5,42 34.466,44 6.163}
{0 CHEMBL1237296,1 7.578,2 49,3 43.1,4 1.001,5 1.106,6 0.69,7 0.66,8 386.47,10 18,11 51,13 21,14 31,16 53,17 25,20 23,21 2,22 3,24 22,25 4,29 4,32 29,35 7.8,36 0.151,37 8,38 43,39 51.029,40 56.405,41 35.193,42 33.654,44 5.276}
{0 CHEMBL1237297,1 7.409,2 50,3 44,4 0.994,5 1.104,6 0.695,7 0.659,8 370.47,10 18,11 50,13 21,14 30,16 52,17 25,20 23,21 2,22 3,24 22,25 3,29 3,32 28,35 6,36 0.154,37 8,38 42,39 49.702,40 55.195,41 34.739,42 32.939,44 6.167}
{0 CHEMBL1237298,1 7.409,2 50,3 44,4 0.994,5 1.104,6 0.695,7 0.659,8 370.47,10 18,11 50,13 21,14 30,16 52,17 25,20 23,21 2,22 3,24 22,25 3,29 3,32 28,35 6,36 0.154,37 8,38 42,39 49.702,40 55.195,41 34.739,42 32.939,44 7.745}
{0 CHEMBL1237299,1 7.255,2 49.1,3 45.3,4 0.992,5 1.106,6 0.689,7 0.65,8 384.5,10 18,11 53,13 21,14 31,16 55,17 26,20 23,21 3,22 3,24 24,25 3,29 3,32 29,35 5.7,36 0.145,37 8,38 43,39 52.585,40 58.611,41 36.5,42 34.466,44 6.201}
{0 CHEMBL1237300,1 7.255,2 49.1,3 45.3,4 0.992,5 1.106,6 0.689,7 0.65,8 384.5,10 18,11 53,13 21,14 31,16 55,17 26,20 23,21 3,22 3,24 24,25 3,29 3,32 29,35 5.7,36 0.145,37 8,38 43,39 52.585,40 58.611,41 36.5,42 34.466,44 5.77}
{0 CHEMBL1237301,1 7.316,2 49,3 44.9,4 0.994,5 1.106,6 0.689,7 0.652,8 358.46,10 18,11 49,13 20,14 29,16 51,17 24,20 21,21 3,22 2,24 22,25 3,29 3,32 27,35 6.1,36 0.137,37 7,38 40,39 48.702,40 54.195,41 33.739,42 31.939,44 5.149}
{0 CHEMBL1237302,1 7.163,2 48.1,3 46.2,4 0.992,5 1.108,6 0.683,7 0.644,8 372.49,10 18,11 52,13 20,14 30,16 54,17 25,20 21,21 4,22 2,24 24,25 3,29 3,32 28,35 5.8,36 0.148,37 8,38 41,39 51.585,40 57.611,41 35.5,42 33.466,44 5.538}
{0 CHEMBL1237303,1 7.5,2 49.1,3 43.6,4 0.998,5 1.106,6 0.69,7 0.658,8 412.51,10 18,11 55,13 22,14 33,16 57,17 27,20 24,21 3,22 4,24 24,25 4,29 4,32 31,35 7.3,36 0.158,37 9,38 46,39 54.912,40 60.82,41 37.955,42 36.181,44 5.06}
{0 CHEMBL1237304,1 7.584,2 51.1,3 42.6,4 0.996,5 1.102,6 0.702,7 0.668,8 356.44,10 18,11 47,13 21,14 29,16 49,17 24,20 23,21 1,22 3,24 20,25 3,29 3,32 27,35 6.4,36 0.143,37 7,38 41,39 46.818,40 51.78,41 32.978,42 31.412,44 6.959}
{0 CHEMBL1237305,1 8.692,2 48.1,3 40.7,4 1.01,5 1.106,6 0.716,7 0.682,8 469.38,10 18,11 54,13 21,14 34,16 56,17 26,18 2,20 23,21 3,22 3,24 22,25 6,26 2,29 4,32 32,34 2,35 7.4,36 0.161,37 9,38 46,39 54.56,40 59.708,41 38.671,42 36.836,43 3.7,44 5.602}
{0 CHEMBL1237315,1 7.343,2 50,3 44.4,4 0.992,5 1.104,6 0.694,7 0.657,8 264.34,10 12,11 36,13 15,14 21,16 37,17 18,20 17,21 1,22 3,24 16,25 2,29 2,32 20,35 5.6,36 0.135,37 5,38 30,39 35.723,40 39.74,41 25,42 23.644,44 5.854}
{0 CHEMBL1237316,1 7.359,2 47.5,3 45,4 0.998,5 1.109,6 0.68,7 0.647,8 294.37,10 12,11 40,13 15,14 23,16 41,17 19,20 17,21 2,22 3,24 18,25 3,29 3,32 22,35 7.5,36 0.146,37 6,38 32,39 39.934,40 44.365,41 27.216,42 25.886,44 5.602}
{0 CHEMBL1237317,1 7.417,2 48.1,3 44.4,4 0.998,5 1.108,6 0.684,7 0.651,8 400.5,10 18,11 54,13 21,14 32,16 56,17 26,20 23,21 3,22 3,24 24,25 4,29 4,32 30,35 7.4,36 0.161,37 9,38 44,39 53.912,40 59.82,41 36.955,42 35.181,44 6.125}
{0 CHEMBL123794,1 7.255,2 49.1,3 45.3,4 0.992,5 1.106,6 0.689,7 0.65,8 384.5,10 18,11 53,13 21,14 31,16 55,17 26,20 23,21 3,22 3,24 24,25 3,29 3,32 29,35 5.7,36 0.145,37 8,38 43,39 52.585,40 58.611,41 36.5,42 34.466,44 5.092}
{0 CHEMBL123844,1 7.586,2 51.9,3 42.3,4 0.994,5 1.1,6 0.707,7 0.672,8 394.49,10 24,11 52,13 25,14 33,16 55,17 27,20 25,21 2,22 1,24 22,25 3,29 3,32 30,35 5.8,36 0.127,37 7,38 46,39 51.702,40 57.195,41 36.739,42 34.939,44 5.444}
{0 CHEMBL123855,1 7.972,2 50,3 42.3,4 0.996,5 1.098,6 0.719,7 0.676,8 414.55,10 23,11 52,13 24,14 33,16 55,17 26,20 23,21 3,22 1,24 22,25 4,26 1,29 3,31 1,32 30,35 5.8,36 0.145,37 8,38 45.5,39 51.778,40 57.115,41 37.387,42 35.126,44 5.538}
{0 CHEMBL124199,1 7.218,2 47.9,3 45.8,4 0.994,5 1.108,6 0.682,7 0.645,8 346.45,10 18,11 48,13 19,14 28,16 50,17 23,20 19,21 4,22 1,24 22,25 3,29 3,32 26,35 6.3,36 0.16,37 8,38 38,39 47.702,40 53.195,41 32.739,42 30.939,44 6.824}
{0 CHEMBL124574,1 10.109,2 51.7,3 34.5,4 1.021,5 1.096,6 0.765,7 0.733,8 293.15,10 12,11 29,13 14,14 20,16 30,17 15,18 2,20 15,22 2,24 10,25 4,26 2,29 2,32 19,34 2,35 6.9,36 0.1,37 3,38 28,39 29.604,40 31.798,41 22.193,42 21.245,43 6.9,44 5.125}
{0 CHEMBL124675,1 8.148,2 49,3 41.2,4 1,5 1.102,6 0.718,7 0.679,8 415.54,9 2,10 23,11 51,13 24,14 33,16 54,17 25,20 23,21 2,22 1,24 21,25 5,26 1,28 1,29 3,31 1,32 30,35 5.9,36 0.148,37 8,38 45.5,39 50.996,40 56.199,41 36.631,42 34.621,44 5.602}
{0 CHEMBL124738,1 7.972,2 50,3 42.3,4 0.996,5 1.098,6 0.719,7 0.676,8 414.55,10 23,11 52,13 24,14 33,16 55,17 26,20 23,21 3,22 1,24 22,25 4,26 1,29 3,31 1,32 30,35 5.8,36 0.145,37 8,38 45.5,39 51.778,40 57.115,41 37.387,42 35.126,44 5.602}
{0 CHEMBL125087,1 8.68,2 50.9,3 40,4 1.004,5 1.1,6 0.731,7 0.693,8 477.4,10 24,11 55,13 25,14 36,16 58,17 28,18 2,20 25,21 3,22 1,24 22,25 5,26 2,29 3,32 33,34 2,35 5.5,36 0.138,37 8,38 49,39 55.233,40 60.499,41 40.216,42 38.121,43 3.6,44 5.337}
{0 CHEMBL125110,1 7.972,2 50,3 42.3,4 0.996,5 1.098,6 0.719,7 0.676,8 414.55,10 23,11 52,13 24,14 33,16 55,17 26,20 23,21 3,22 1,24 22,25 4,26 1,29 3,31 1,32 30,35 5.8,36 0.145,37 8,38 45.5,39 51.778,40 57.115,41 37.387,42 35.126,44 5.387}
{0 CHEMBL125269,1 7.285,2 50,3 44.8,4 0.991,5 1.104,6 0.694,7 0.655,8 422.55,10 24,11 58,13 25,14 35,16 61,17 29,20 25,21 4,22 1,24 26,25 3,29 3,32 32,35 5.2,36 0.148,37 9,38 48,39 57.469,40 64.026,41 40.262,42 37.993,44 5.456}
{0 CHEMBL125588,1 8.048,2 50.9,3 41.5,4 0.996,5 1.097,6 0.724,7 0.682,8 426.56,10 23,11 53,13 24,14 35,16 57,17 27,20 23,21 4,22 1,24 22,25 4,26 1,29 3,31 1,32 31,35 5.7,36 0.123,37 7,38 47.5,39 52.778,40 58.115,41 38.387,42 36.126,44 5.638}
{0 CHEMBL126472,1 7.375,2 51.2,3 43.9,4 0.99,5 1.101,6 0.702,7 0.663,8 302.39,10 18,11 41,13 19,14 25,16 43,17 21,20 19,21 2,22 1,24 18,25 2,29 2,32 23,35 4.9,36 0.116,37 5,38 35,39 40.607,40 45.156,41 28.762,42 27.171,44 5.092}
{0 CHEMBL1271476,1 8.125,2 44.7,3 42.6,4 1.005,5 1.119,6 0.694,7 0.661,8 381.89,9 6.4,10 12,11 47,13 16,14 29,16 49,17 21,18 1,20 18,21 3,22 4,24 20,25 6,26 1,28 3,29 2,32 27,34 1,35 4.3,36 0.102,37 5,38 39,39 47.236,40 52.595,41 32.637,42 31.063,43 2.1,44 5}
{0 CHEMBL127204,1 7.428,2 50.9,3 43.6,4 0.992,5 1.102,6 0.7,7 0.663,8 408.52,10 24,11 55,13 25,14 34,16 58,17 28,20 25,21 3,22 1,24 24,25 3,29 3,32 31,35 5.5,36 0.138,37 8,38 47,39 54.585,40 60.611,41 38.5,42 36.466,44 4.013}
{0 CHEMBL127482,1 7.428,2 50.9,3 43.6,4 0.992,5 1.102,6 0.7,7 0.663,8 408.52,10 24,11 55,13 25,14 34,16 58,17 28,20 25,21 3,22 1,24 24,25 3,29 3,32 31,35 5.5,36 0.138,37 8,38 47,39 54.585,40 60.611,41 38.5,42 36.466,44 5.538}
{0 CHEMBL1290413,1 8.729,2 42.1,3 40.4,4 1.036,5 1.141,6 0.669,7 0.657,8 497.55,9 1.8,10 16,11 57,13 19,14 37,16 60,17 24,20 15,21 9,22 3,23 4,24 23,25 10,26 1,28 1,29 4,31 1,32 34,34 4,35 7,36 0.083,37 5,38 48,39 59.025,40 65.012,41 38.12,42 37.449,43 7,44 5.644}
{0 CHEMBL132589,1 7.509,2 48.4,3 43.5,4 0.998,5 1.109,6 0.689,7 0.657,8 465.58,9 1.6,10 23,11 62,13 25,14 39,16 66,17 30,20 24,21 6,22 2,24 27,25 5,28 1,29 4,32 35,35 6.5,36 0.121,37 8,38 52.5,39 61.898,40 68.734,41 42.722,42 40.729,44 6}
{0 CHEMBL134546,1 6.242,2 31.7,3 58.3,4 0.992,5 1.137,6 0.611,7 0.55,8 374.51,11 60,13 3,14 25,16 60,17 19,20 4,21 15,22 3,24 35,25 6,26 1,29 5,30 1,32 25,35 8.3,36 0.2,37 12,38 28,39 59.516,40 68.244,41 36.66,42 32.98,44 5}
{0 CHEMBL14286,1 5.789,2 32.2,3 59.3,4 0.99,5 1.142,6 0.589,7 0.54,8 341.55,9 1.7,11 59,13 2,14 24,16 59,17 19,20 2,21 17,22 2,24 35,25 5,28 1,29 4,32 24,35 6.8,36 0.237,37 14,38 26,39 58.432,40 67.394,41 34.768,42 31.836,44 5.442}
{0 CHEMBL14334,1 5.957,2 33.3,3 57.9,4 0.992,5 1.14,6 0.597,7 0.549,8 339.53,9 1.8,11 57,13 3,14 24,16 57,17 19,20 4,21 15,22 3,24 33,25 5,28 1,29 4,32 24,35 7,36 0.228,37 13,38 27,39 56.549,40 64.979,41 34.006,42 31.309,44 5.175}
{0 CHEMBL14359,1 6.537,2 38.2,3 52.7,4 0.996,5 1.13,6 0.627,7 0.586,8 359.51,9 1.8,10 6,11 55,13 9,14 27,16 56,17 21,20 10,21 11,22 3,24 29,25 5,28 1,29 4,32 26,35 7.3,36 0.196,37 11,38 33,39 54.781,40 62.149,41 34.483,42 32.256,44 4.698}
{0 CHEMBL14439,1 6.992,2 37.5,3 51.8,4 0.997,5 1.126,6 0.645,7 0.597,8 391.58,9 1.8,10 6,11 56,13 9,14 28,16 57,17 21,20 10,21 11,22 3,24 29,25 6,26 1,28 1,29 4,31 1,32 27,35 7.1,36 0.211,37 12,38 34,39 55.858,40 63.069,41 36.131,42 33.443,44 4.886}
{0 CHEMBL14530,1 6.061,2 34.5,3 56.9,4 0.992,5 1.138,6 0.604,7 0.557,8 351.54,9 1.7,11 58,13 3,14 26,16 59,17 20,20 4,21 16,22 3,24 33,25 5,28 1,29 4,32 25,35 6.9,36 0.169,37 10,38 29,39 57.549,40 65.979,41 35.006,42 32.309,44 4.886}
{0 CHEMBL14600,1 7.453,2 36.5,3 48.1,4 1.001,5 1.134,6 0.658,7 0.615,8 387.56,9 9.6,10 11,11 52,13 13,14 29,16 54,17 19,20 10,21 9,22 2,24 25,25 8,26 1,28 5,29 2,31 1,32 27,35 3.8,36 0.185,37 10,38 36.5,39 52.076,40 58.982,41 34.199,42 31.992,44 4.886}
{0 CHEMBL14655,1 5.957,2 33.3,3 57.9,4 0.992,5 1.14,6 0.597,7 0.549,8 339.53,9 1.8,11 57,13 3,14 24,16 57,17 19,20 4,21 15,22 3,24 33,25 5,28 1,29 4,32 24,35 7,36 0.228,37 13,38 27,39 56.549,40 64.979,41 34.006,42 31.309,44 4.886}
{0 CHEMBL148449,1 9.245,2 41.5,3 37.7,4 1.031,5 1.12,6 0.7,7 0.681,8 489.97,9 5.7,10 17,11 53,13 21,14 36,16 56,17 22,18 1,20 18,21 4,22 4,24 20,25 11,26 2,28 3,29 6,31 1,32 33,34 1,35 11.3,36 0.107,37 6,38 48.5,39 54.622,40 59.352,41 37.102,42 36.109,43 1.9,44 6.6}
{0 CHEMBL15096,1 5.789,2 32.2,3 59.3,4 0.99,5 1.142,6 0.589,7 0.54,8 341.55,9 1.7,11 59,13 2,14 24,16 59,17 19,20 2,21 17,22 2,24 35,25 5,28 1,29 4,32 24,35 6.8,36 0.237,37 14,38 26,39 58.432,40 67.394,41 34.768,42 31.836,44 5.523}
{0 CHEMBL1628651,1 6.185,2 35.1,3 56.1,4 0.996,5 1.135,6 0.604,7 0.561,8 352.52,11 57,13 4,14 25,16 57,17 20,20 6,21 14,22 4,24 32,25 5,29 5,32 25,35 8.8,36 0.211,37 12,38 29,39 56.774,40 64.69,41 34.455,42 32.003,44 7.658}
{0 CHEMBL1644003,1 7.968,2 42,3 44.9,4 1.002,5 1.116,6 0.693,7 0.647,8 549.77,9 4.3,10 22,11 69,13 26,14 41,16 72,17 29,20 22,21 7,22 4,24 31,25 9,26 2,28 3,29 4,31 2,32 38,35 5.8,36 0.097,37 7,38 56,39 69.138,40 76.985,41 47.79,42 44.673,44 5.478}
{0 CHEMBL165010,1 7.9,2 47.2,3 44.4,4 0.994,5 1.102,6 0.712,7 0.662,8 284.4,10 12,11 36,13 14,14 21,16 37,17 17,20 15,21 2,22 2,24 16,25 3,26 1,29 2,31 1,32 20,35 5.6,36 0.135,37 5,38 29,39 35.8,40 39.66,41 25.648,42 23.831,44 4.367}
{0 CHEMBL166351,1 9.599,2 50,3 37.5,4 1.015,5 1.1,6 0.749,7 0.712,8 307.18,10 12,11 32,13 14,14 21,16 33,17 16,18 2,20 15,21 1,22 2,24 12,25 4,26 2,29 2,32 20,34 2,35 6.3,36 0.121,37 4,38 29,39 32.487,40 35.213,41 23.955,42 22.772,43 6.3,44 4.886}
{0 CHEMBL172250,1 7.364,2 35.4,3 50.8,4 1.018,5 1.146,6 0.622,7 0.591,8 478.63,10 6,11 65,13 7,14 33,16 66,17 23,20 7,21 16,22 1,23 3,24 33,25 9,26 1,29 5,31 1,32 32,34 3,35 7.7,36 0.197,37 13,38 37,39 66.156,40 74.46,41 40.438,42 38.393,43 4.6,44 5}
{0 CHEMBL173299,1 6.623,2 35.5,3 54.8,4 0.996,5 1.129,6 0.627,7 0.576,8 410.63,10 6,11 62,13 7,14 29,16 63,17 22,20 7,21 15,22 1,24 34,25 6,26 1,29 5,31 1,32 28,35 8.1,36 0.206,37 13,38 33,39 61.734,40 70.025,41 38.864,42 35.717,44 5}
{0 CHEMBL173499,1 6.913,2 35.5,3 53.2,4 1.004,5 1.135,6 0.626,7 0.582,8 428.62,10 6,11 62,13 7,14 30,16 63,17 22,20 7,21 15,22 1,23 1,24 33,25 7,26 1,29 5,31 1,32 29,34 1,35 8.1,36 0.206,37 13,38 34,39 62.247,40 70.365,41 38.801,42 36.1,43 1.6,44 5}
{0 CHEMBL173680,1 7.179,2 35.5,3 53.2,4 1.001,5 1.129,6 0.641,7 0.589,8 445.07,10 6,11 62,13 7,14 30,16 63,17 22,18 1,20 7,21 15,22 1,24 33,25 7,26 2,29 5,31 1,32 29,34 1,35 8.1,36 0.206,37 13,38 34,39 62.058,40 69.969,41 39.722,42 36.544,43 1.6,44 5.62}
{0 CHEMBL173811,1 7.201,2 32.8,3 53.4,4 1.003,5 1.131,6 0.638,7 0.584,8 417.65,9 1.7,10 5,11 58,13 6,14 28,16 59,17 19,20 4,21 15,22 1,24 31,25 8,26 2,28 1,29 5,31 2,32 27,35 8.6,36 0.22,37 13,38 31.5,39 58.145,40 65.613,41 36.995,42 33.872,44 5}
{0 CHEMBL176692,1 6.533,2 35.4,3 55.4,4 0.994,5 1.13,6 0.625,7 0.573,8 424.66,10 6,11 65,13 7,14 30,16 66,17 23,20 7,21 16,22 1,24 36,25 6,26 1,29 5,31 1,32 29,35 7.7,36 0.197,37 13,38 34,39 64.618,40 73.441,41 40.625,42 37.243,44 5}
{0 CHEMBL1770317,1 8.054,2 46.7,3 40,4 1.013,5 1.115,6 0.687,7 0.669,8 362.41,9 4.4,10 11,11 45,13 16,14 30,16 48,17 21,20 17,21 4,22 5,24 18,25 6,28 2,29 4,32 27,35 8.9,36 0.063,37 3,38 40.5,39 45.582,40 50.156,41 30.921,42 30.116,44 4.3}
{0 CHEMBL1794823,1 6.729,2 36.8,3 50.9,4 0.996,5 1.138,6 0.633,7 0.594,8 383.55,9 8.8,10 11,11 57,13 13,14 30,16 59,17 21,20 10,21 11,22 2,24 29,25 7,28 5,29 2,32 28,35 3.5,36 0.186,37 11,38 37.5,39 56.767,40 64.893,41 36.074,42 33.858,44 4.886}
{0 CHEMBL180089,1 7.594,2 49.1,3 43.4,4 1.002,5 1.112,6 0.688,7 0.658,8 402.49,10 18,11 53,13 21,14 32,16 55,17 26,20 23,21 3,22 3,23 1,24 23,25 4,29 3,32 30,34 1,35 5.7,36 0.145,37 8,38 44,39 53.098,40 58.95,41 36.438,42 34.849,43 1.9,44 5.387}
{0 CHEMBL180191,1 7.417,2 48.1,3 44.4,4 0.998,5 1.108,6 0.684,7 0.651,8 400.5,10 18,11 54,13 21,14 32,16 56,17 26,20 23,21 3,22 3,24 24,25 4,29 4,32 30,35 7.4,36 0.161,37 9,38 44,39 53.912,40 59.82,41 36.955,42 35.181,44 5.762}
{0 CHEMBL180343,1 6.816,2 45.6,3 49.1,4 0.989,5 1.113,6 0.667,7 0.623,8 388.54,10 18,11 57,13 19,14 31,16 59,17 26,20 19,21 7,22 1,24 28,25 3,29 3,32 29,35 5.3,36 0.169,37 10,38 41,39 56.352,40 63.441,41 38.023,42 35.52,44 6.027}
{0 CHEMBL180389,1 7.359,2 47.5,3 45,4 0.998,5 1.109,6 0.68,7 0.647,8 294.37,10 12,11 40,13 15,14 23,16 41,17 19,20 17,21 2,22 3,24 18,25 3,29 3,32 22,35 7.5,36 0.122,37 5,38 32,39 39.934,40 44.365,41 27.216,42 25.886,44 5.137}
{0 CHEMBL180742,1 8.692,2 48.1,3 40.7,4 1.01,5 1.106,6 0.716,7 0.682,8 469.38,10 18,11 54,13 21,14 34,16 56,17 26,18 2,20 23,21 3,22 3,24 22,25 6,26 2,29 4,32 32,34 2,35 7.4,36 0.143,37 8,38 46,39 54.56,40 59.708,41 38.671,42 36.836,43 3.7,44 5.678}
{0 CHEMBL180752,1 7.028,2 47.3,3 47.3,4 0.99,5 1.11,6 0.677,7 0.636,8 386.52,10 18,11 55,13 19,14 32,16 58,17 26,20 19,21 7,22 1,24 26,25 3,29 3,32 29,35 5.5,36 0.138,37 8,38 42,39 54.469,40 61.026,41 37.262,42 34.993,44 6.004}
{0 CHEMBL181035,1 7.584,2 51.1,3 42.6,4 0.996,5 1.102,6 0.702,7 0.668,8 356.44,10 18,11 47,13 21,14 29,16 49,17 24,20 23,21 1,22 3,24 20,25 3,29 3,32 27,35 6.4,36 0.143,37 7,38 41,39 46.818,40 51.78,41 32.978,42 31.412,44 8.097}
{0 CHEMBL181691,1 7.188,2 46.4,3 46.4,4 0.996,5 1.111,6 0.674,7 0.638,8 402.52,10 18,11 56,13 20,14 32,16 58,17 26,20 21,21 5,22 2,24 26,25 4,29 4,32 30,35 7.1,36 0.172,37 10,38 43,39 55.796,40 62.235,41 37.716,42 35.708,44 5.959}
{0 CHEMBL183919,1 8.554,2 49.1,3 41.5,4 1.004,5 1.104,6 0.721,7 0.682,8 453.38,10 18,11 53,13 21,14 33,16 55,17 26,18 2,20 23,21 3,22 3,24 22,25 5,26 2,29 3,32 31,34 2,35 5.7,36 0.145,37 8,38 45,39 53.233,40 58.499,41 38.216,42 36.121,43 3.8,44 5.268}
{0 CHEMBL190497,1 7.383,2 46.3,3 44.8,4 0.998,5 1.114,6 0.679,7 0.646,8 494.63,9 3,10 23,11 67,13 24,14 42,16 72,17 31,20 22,21 9,22 1,24 30,25 6,28 2,29 4,32 37,35 6,36 0.097,37 7,38 54.5,39 66.883,40 74.647,41 45.489,42 43.277,44 6}
{0 CHEMBL1910022,1 8.594,2 47.2,3 37.7,4 1.031,5 1.131,6 0.679,7 0.676,8 455.46,9 1.9,10 18,11 53,13 20,14 36,16 56,17 25,20 20,21 5,22 2,23 3,24 20,25 8,28 1,29 4,32 33,34 3,35 7.5,36 0.071,37 4,38 47,39 54.669,40 59.922,41 36.012,42 35.825,43 5.7,44 6}
{0 CHEMBL1910023,1 8.657,2 48.1,3 37,4 1.031,5 1.128,6 0.685,7 0.682,8 467.47,9 1.9,10 18,11 54,13 20,14 38,16 58,17 26,20 20,21 6,22 2,23 3,24 20,25 8,28 1,29 4,32 34,34 3,35 7.4,36 0.069,37 4,38 49,39 55.669,40 60.922,41 37.012,42 36.825,43 5.6,44 6}
{0 CHEMBL1910024,1 8.594,2 47.2,3 37.7,4 1.031,5 1.131,6 0.679,7 0.676,8 455.46,9 1.9,10 18,11 53,13 20,14 36,16 56,17 25,20 20,21 5,22 2,23 3,24 20,25 8,28 1,29 4,32 33,34 3,35 7.5,36 0.071,37 4,38 47,39 54.669,40 59.922,41 36.012,42 35.825,43 5.7,44 6}
{0 CHEMBL1910025,1 8.657,2 48.1,3 37,4 1.031,5 1.128,6 0.685,7 0.682,8 467.47,9 1.9,10 18,11 54,13 20,14 38,16 58,17 26,20 20,21 6,22 2,23 3,24 20,25 8,28 1,29 4,32 34,34 3,35 7.4,36 0.069,37 4,38 49,39 55.669,40 60.922,41 37.012,42 36.825,43 5.6,44 6}
{0 CHEMBL191638,1 7.85,2 48,3 42.7,4 0.998,5 1.106,6 0.705,7 0.667,8 588.77,9 2.7,10 29,11 75,13 33,14 48,16 80,17 36,20 30,21 6,22 4,24 32,25 7,26 1,28 2,29 4,31 1,32 43,35 5.3,36 0.113,37 9,38 66.5,39 74.843,40 82.982,41 52.898,42 49.991,44 5.523}
{0 CHEMBL191898,1 7.626,2 42.5,3 43.8,4 1.01,5 1.124,6 0.663,7 0.64,8 556.67,9 5.5,10 22,11 73,13 26,14 44,16 76,17 31,20 24,21 7,22 4,24 32,25 10,28 4,29 6,32 41,35 8.2,36 0.184,37 14,38 59,39 73.741,40 82.062,41 48.409,42 46.75,44 6}
{0 CHEMBL192613,1 7.509,2 50,3 43.1,4 0.995,5 1.105,6 0.698,7 0.664,8 435.55,9 1.7,10 23,11 58,13 25,14 37,16 62,17 29,20 24,21 5,22 2,24 25,25 4,28 1,29 3,32 33,35 5.2,36 0.097,37 6,38 50.5,39 57.687,40 64.109,41 40.506,42 38.487,44 5.523}
{0 CHEMBL192729,1 7.375,2 39.4,3 46.5,4 1.012,5 1.129,6 0.643,7 0.619,8 523.64,9 4.2,10 16,11 71,13 20,14 40,16 73,17 28,20 18,21 10,22 4,24 33,25 10,28 3,29 7,32 38,35 9.9,36 0.219,37 16,38 52,39 71.851,40 80.189,41 45.62,42 43.97,44 5}
{0 CHEMBL195456,1 7.856,2 44.1,3 42.4,4 1.017,5 1.118,6 0.667,7 0.65,8 463.52,9 1.7,10 18,11 59,13 20,14 37,16 62,17 26,20 20,21 6,22 2,24 25,25 8,28 1,29 7,32 34,35 11.9,36 0.129,37 8,38 48,39 59.996,40 65.947,41 39.324,42 38.347,44 6}
{0 CHEMBL196779,1 7.716,2 44.8,3 43.1,4 1.012,5 1.116,6 0.67,7 0.649,8 447.52,9 1.7,10 18,11 58,13 20,14 36,16 61,17 26,20 20,21 6,22 2,24 25,25 7,28 1,29 6,32 33,35 10.3,36 0.131,37 8,38 47,39 58.669,40 64.737,41 38.869,42 37.632,44 5}
{0 CHEMBL197319,1 7.571,2 45.6,3 43.9,4 1.006,5 1.115,6 0.674,7 0.648,8 431.52,9 1.8,10 18,11 57,13 20,14 35,16 60,17 26,20 20,21 6,22 2,24 25,25 6,28 1,29 5,32 32,35 8.8,36 0.133,37 8,38 46,39 57.342,40 63.528,41 38.415,42 36.917,44 6}
{0 CHEMBL207203,1 8.4,2 41.8,3 43.6,4 1.013,5 1.116,6 0.689,7 0.653,8 462,9 1.8,10 16,11 55,13 19,14 34,16 58,17 23,18 1,20 15,21 8,22 3,24 24,25 8,26 2,28 1,29 5,31 1,32 31,34 1,35 9.1,36 0.103,37 6,38 45,39 55.742,40 61.392,41 37.921,42 35.932,43 1.8,44 6.409}
{0 CHEMBL208260,1 8.663,2 46.7,3 40,4 1.021,5 1.127,6 0.695,7 0.674,8 389.85,9 2.2,10 16,11 45,13 17,14 30,16 48,17 21,18 1,20 15,21 6,22 1,23 2,24 18,25 6,26 1,28 1,29 2,32 27,34 3,35 4.4,36 0.083,37 4,38 39,39 45.942,40 50.693,41 31.262,42 30.313,43 6.7,44 5.337}
{0 CHEMBL2096894,1 6.464,2 40,3 52.7,4 0.99,5 1.126,6 0.637,7 0.592,8 355.52,9 1.8,10 6,11 55,13 10,14 27,16 56,17 22,20 12,21 10,22 4,24 29,25 4,28 1,29 3,32 26,35 5.5,36 0.161,37 9,38 34,39 54.454,40 61.939,41 35.029,42 32.541,44 6.096}
{0 CHEMBL2112332,1 7.558,2 45.3,3 45.3,4 0.987,5 1.114,6 0.703,7 0.652,8 400.59,9 7.5,10 23,11 53,13 23,14 32,16 56,17 24,20 19,21 5,24 24,25 5,26 1,28 4,31 1,32 29,36 0.161,37 9,38 43.5,39 52.32,40 59.065,41 37.284,42 34.541,44 7.201}
{0 CHEMBL213221,1 9.554,2 45.2,3 40.5,4 1.012,5 1.114,6 0.71,7 0.677,8 401.28,9 4.8,10 17,11 42,13 18,14 27,15 1,16 44,17 19,20 16,21 3,22 1,24 17,25 6,26 1,28 2,29 3,32 25,34 1,35 7.1,36 0.136,37 6,38 36.5,39 42.483,40 46.788,41 29.818,42 28.427,43 2.4,44 5.7}
{0 CHEMBL2164608,1 7.719,2 48.4,3 41.9,4 1.002,5 1.11,6 0.693,7 0.665,8 478.58,9 3.2,10 22,11 62,13 26,14 39,16 65,17 30,19 1,20 25,21 4,22 3,24 26,25 6,28 2,29 4,32 36,33 1,35 6.5,36 0.154,37 10,38 55,39 62.116,40 68.817,41 42.966,42 41.224,44 5.37}
{0 CHEMBL2164609,1 8.545,2 46.6,3 39.7,4 1.008,5 1.107,6 0.719,7 0.683,8 623.8,9 4.1,10 27,11 73,13 33,14 48,16 77,17 34,19 1,20 29,21 4,22 5,24 29,25 10,26 2,28 3,29 5,31 2,32 44,33 1,35 6.8,36 0.156,37 12,38 68.5,39 73.582,40 80.78,41 52.483,42 49.861,44 4.966}
{0 CHEMBL2164612,1 6.92,2 44.9,3 48.3,4 0.99,5 1.116,6 0.668,7 0.626,8 615.85,9 2.2,10 24,11 89,13 29,14 49,16 92,17 40,20 32,21 8,22 5,24 43,25 6,28 2,29 4,32 46,35 4.5,36 0.152,37 14,38 66,39 88.127,40 99.346,41 59.438,42 55.701,44 5.531}
{0 CHEMBL217941,1 9.18,2 48.6,3 40,4 1.006,5 1.102,6 0.728,7 0.688,8 642.6,9 1.4,10 29,11 70,13 33,14 46,15 1,16 74,17 34,20 31,21 3,22 4,24 28,25 8,26 2,28 1,29 5,31 1,32 42,34 1,35 7.1,36 0.135,37 10,38 64.5,39 70.414,40 77.12,41 50.938,42 48.183,43 1.4,44 4}
{0 CHEMBL217988,1 8.554,2 49.1,3 41.5,4 1.004,5 1.104,6 0.721,7 0.682,8 453.38,10 18,11 53,13 21,14 33,16 55,17 26,18 2,20 23,21 3,22 3,24 22,25 5,26 2,29 3,32 31,34 2,35 5.7,36 0.145,37 8,38 45,39 53.233,40 58.499,41 38.216,42 36.121,43 3.8,44 5.268}
{0 CHEMBL217991,1 8.567,2 49.2,3 39.7,4 1.003,5 1.098,6 0.734,7 0.692,8 539.71,9 1.6,10 28,11 63,13 32,14 42,16 67,17 31,20 29,21 2,22 4,24 25,25 7,26 2,28 1,29 4,31 2,32 38,35 6.3,36 0.134,37 9,38 60,39 63.167,40 69.158,41 46.256,42 43.576,44 5.097}
{0 CHEMBL218071,1 9.58,2 48.2,3 39.3,4 1.008,5 1.101,6 0.736,7 0.694,8 536.47,9 1.8,10 23,11 56,13 27,14 37,15 1,16 59,17 27,20 25,21 2,22 4,24 22,25 7,26 2,28 1,29 4,31 1,32 34,34 1,35 7.1,36 0.119,37 7,38 52.5,39 56.436,40 61.665,41 41.199,42 38.888,43 1.8,44 4.301}
{0 CHEMBL218123,1 7.255,2 49.1,3 45.3,4 0.992,5 1.106,6 0.689,7 0.65,8 384.5,10 18,11 53,13 21,14 31,16 55,17 26,20 23,21 3,22 3,24 24,25 3,29 3,32 29,35 5.7,36 0.145,37 8,38 43,39 52.585,40 58.611,41 36.5,42 34.466,44 6.066}
{0 CHEMBL218178,1 8.277,2 46.9,3 42.2,4 1.001,5 1.103,6 0.719,7 0.673,8 529.72,9 1.6,10 23,11 64,13 28,14 40,16 67,17 30,20 27,21 3,22 5,24 27,25 7,26 2,28 1,29 4,31 2,32 37,35 6.3,36 0.149,37 10,38 56.5,39 64.051,40 70.574,41 46.017,42 43.103,44 5.678}
{0 CHEMBL218179,1 8.277,2 46.9,3 42.2,4 1.001,5 1.103,6 0.719,7 0.673,8 529.72,9 1.6,10 23,11 64,13 28,14 40,16 67,17 30,20 27,21 3,22 5,24 27,25 7,26 2,28 1,29 4,31 2,32 37,35 6.3,36 0.149,37 10,38 56.5,39 64.051,40 70.574,41 46.017,42 43.103,44 5.678}
{0 CHEMBL218228,1 8.619,2 45.1,3 41.2,4 1.008,5 1.104,6 0.72,7 0.677,8 439.59,9 2,10 17,11 51,13 22,14 32,16 53,17 23,20 21,21 2,22 5,24 21,25 7,26 2,28 1,29 4,31 2,32 30,35 7.8,36 0.151,37 8,38 45.5,39 51.4,40 56.328,41 36.733,42 34.523,44 5.187}
{0 CHEMBL218229,1 8.619,2 45.1,3 41.2,4 1.008,5 1.104,6 0.72,7 0.677,8 439.59,9 2,10 17,11 51,13 22,14 32,16 53,17 23,20 21,21 2,22 5,24 21,25 7,26 2,28 1,29 4,31 2,32 30,35 7.8,36 0.151,37 8,38 45.5,39 51.4,40 56.328,41 36.733,42 34.523,44 5.187}
{0 CHEMBL218263,1 7.586,2 51.9,3 42.3,4 0.994,5 1.1,6 0.707,7 0.672,8 394.49,10 23,11 52,13 25,14 33,16 55,17 27,20 25,21 2,22 2,24 22,25 3,29 3,32 30,35 5.8,36 0.127,37 7,38 46.5,39 51.702,40 57.195,41 36.739,42 34.939,44 4.398}
{0 CHEMBL218280,1 8.396,2 46.2,3 41.5,4 1.006,5 1.104,6 0.715,7 0.674,8 545.72,9 1.5,10 23,11 65,13 28,14 41,16 68,17 30,20 27,21 3,22 5,24 27,25 8,26 2,28 1,29 5,31 2,32 38,35 7.7,36 0.162,37 11,38 57.5,39 65.378,40 71.783,41 46.472,42 43.818,44 5.06}
{0 CHEMBL218626,1 7.417,2 48.1,3 44.4,4 0.998,5 1.108,6 0.684,7 0.651,8 400.5,10 18,11 54,13 21,14 32,16 56,17 26,20 23,21 3,22 3,24 24,25 4,29 4,32 30,35 7.4,36 0.161,37 9,38 44,39 53.912,40 59.82,41 36.955,42 35.181,44 6.125}
{0 CHEMBL219590,1 7.359,2 47.5,3 45,4 0.998,5 1.109,6 0.68,7 0.647,8 294.37,10 12,11 40,13 15,14 23,16 41,17 19,20 17,21 2,22 3,24 18,25 3,29 3,32 22,35 7.5,36 0.146,37 6,38 32,39 39.934,40 44.365,41 27.216,42 25.886,44 5.602}
{0 CHEMBL220802,1 8.849,2 49,3 38.8,4 1.004,5 1.096,6 0.745,7 0.7,8 433.58,9 2,10 22,11 49,13 26,14 33,16 52,17 24,20 23,21 1,22 4,24 19,25 6,26 2,28 1,29 3,31 2,32 30,35 6.1,36 0.115,37 6,38 48,39 49.189,40 53.703,41 36.517,42 34.281,44 5.066}
{0 CHEMBL220820,1 6.816,2 45.6,3 49.1,4 0.989,5 1.113,6 0.667,7 0.623,8 388.54,10 18,11 57,13 19,14 31,16 59,17 26,20 19,21 7,22 1,24 28,25 3,29 3,32 29,35 5.3,36 0.169,37 10,38 41,39 56.352,40 63.441,41 38.023,42 35.52,44 6.027}
{0 CHEMBL220821,1 7.849,2 44.1,3 45.6,4 0.997,5 1.109,6 0.699,7 0.649,8 533.76,9 1.5,10 23,11 68,13 26,14 40,16 71,17 30,20 23,21 7,22 3,24 31,25 7,26 2,28 1,29 4,31 2,32 37,35 5.9,36 0.169,37 12,38 54.5,39 67.818,40 75.404,41 47.54,42 44.157,44 5.796}
{0 CHEMBL222677,1 7.57,2 44.6,3 46.2,4 1,5 1.116,6 0.679,7 0.64,8 492.05,9 1.5,10 18,11 65,13 20,14 38,16 68,17 29,18 1,20 20,21 9,22 2,24 30,25 6,26 1,28 1,29 4,32 35,34 1,35 6.2,36 0.132,37 9,38 49,39 64.989,40 72.508,41 44.103,42 41.61,43 1.5,44 5.292}
{0 CHEMBL222715,1 6.537,2 38.2,3 52.7,4 0.996,5 1.13,6 0.627,7 0.586,8 359.51,9 1.8,10 6,11 55,13 9,14 27,16 56,17 21,20 10,21 11,22 3,24 29,25 5,28 1,29 4,32 26,35 7.3,36 0.179,37 10,38 33,39 54.781,40 62.149,41 34.483,42 32.256,44 6.904}
{0 CHEMBL222782,1 6.634,2 39.3,3 51.8,4 0.996,5 1.128,6 0.634,7 0.594,8 371.52,9 1.8,10 6,11 56,13 9,14 29,16 58,17 22,20 10,21 12,22 3,24 29,25 5,28 1,29 4,32 27,35 7.1,36 0.155,37 9,38 35,39 55.781,40 63.149,41 35.483,42 33.256,44 7.125}
{0 CHEMBL222834,1 7.059,2 41.7,3 48.3,4 1.002,5 1.123,6 0.649,7 0.616,8 423.55,9 1.7,10 12,11 60,13 15,14 33,16 62,17 25,20 16,21 9,22 3,24 29,25 6,28 1,29 5,32 31,35 8.3,36 0.161,37 10,38 42,39 60.109,40 67.358,41 38.938,42 36.971,44 5.602}
{0 CHEMBL223151,1 6.501,2 32.7,3 56.4,4 0.995,5 1.136,6 0.616,7 0.563,8 357.57,9 1.8,11 55,13 3,14 24,16 55,17 18,20 4,21 14,22 3,24 31,25 6,26 1,28 1,29 4,31 1,32 24,35 7.3,36 0.236,37 13,38 27,39 54.741,40 62.484,41 33.892,42 30.97,44 5.328}
{0 CHEMBL223744,1 6.44,2 37.9,3 53.4,4 0.994,5 1.13,6 0.625,7 0.582,8 373.54,9 1.7,10 6,11 58,13 8,14 29,16 60,17 22,20 8,21 14,22 2,24 31,25 5,28 1,29 4,32 27,35 6.9,36 0.167,37 10,38 34,39 57.665,40 65.564,41 36.245,42 33.783,44 6.658}
{0 CHEMBL224970,1 7.03,2 36.5,3 51.9,4 1,5 1.128,6 0.642,7 0.595,8 365.54,9 1.9,10 5,11 52,13 8,14 26,16 53,17 19,20 8,21 11,22 3,24 27,25 6,26 1,28 1,29 4,31 1,32 25,35 7.7,36 0.189,37 10,38 31.5,39 51.974,40 58.654,41 33.37,42 30.916,44 5.432}
{0 CHEMBL245908,1 7.679,2 40,3 48.6,4 1.007,5 1.123,6 0.659,7 0.62,8 268.76,10 6,11 35,13 7,14 19,16 36,17 14,18 1,20 7,21 7,22 1,24 17,25 4,26 1,29 3,32 18,34 1,35 8.6,36 0.111,37 4,38 23,39 35.258,40 39.309,41 23.074,42 21.713,43 2.9,44 5.523}
{0 CHEMBL248678,1 6.467,2 40.7,3 52.5,4 0.989,5 1.125,6 0.641,7 0.594,8 381.56,9 1.7,10 6,11 59,13 10,14 30,16 61,17 24,20 12,21 12,22 4,24 31,25 4,28 1,29 3,32 28,35 5.1,36 0.131,37 8,38 37,39 58.338,40 66.355,41 37.79,42 35.068,44 7.222}
{0 CHEMBL248679,1 7.085,2 45.3,3 47.2,4 0.994,5 1.115,6 0.67,7 0.632,8 375.5,9 1.9,10 12,11 53,13 16,14 30,16 55,17 24,20 18,21 6,22 4,24 25,25 4,28 1,29 3,32 28,35 5.7,36 0.127,37 7,38 40,39 52.687,40 59.109,41 35.506,42 33.487,44 5}
{0 CHEMBL249136,1 6.474,2 35.7,3 53.6,4 0.998,5 1.137,6 0.616,7 0.576,8 362.52,9 3.6,10 6,11 56,13 8,14 27,16 57,17 20,20 8,21 12,22 2,24 30,25 6,28 2,29 4,32 26,35 7.1,36 0.193,37 11,38 32,39 55.883,40 63.647,41 34.489,42 32.277,44 5.658}
{0 CHEMBL249341,1 6.474,2 35.7,3 53.6,4 0.998,5 1.137,6 0.616,7 0.576,8 362.52,9 3.6,10 6,11 56,13 8,14 27,16 57,17 20,20 8,21 12,22 2,24 30,25 6,28 2,29 4,32 26,35 7.1,36 0.175,37 10,38 32,39 55.883,40 63.647,41 34.489,42 32.277,44 5.43}
{0 CHEMBL249342,1 7.083,2 40.7,3 48.1,4 1.002,5 1.126,6 0.648,7 0.615,8 382.5,9 3.7,10 12,11 54,13 14,14 30,16 56,17 22,20 14,21 8,22 2,24 26,25 6,28 2,29 4,32 28,35 7.4,36 0.161,37 9,38 38,39 54.116,40 60.817,41 34.966,42 33.224,44 5.208}
{0 CHEMBL249538,1 8.544,2 40.7,3 46.3,4 1.006,5 1.123,6 0.673,7 0.634,8 461.39,9 3.7,10 12,11 54,13 14,14 31,15 1,16 56,17 22,20 14,21 8,22 2,24 25,25 7,26 1,28 2,29 4,32 29,34 1,35 7.4,36 0.161,37 9,38 39,39 54.345,40 60.658,41 36.318,42 34.249,43 1.9,44 5.264}
{0 CHEMBL249539,1 8.043,2 39.7,3 43.1,4 1.032,5 1.146,6 0.638,7 0.631,8 466.5,9 3.4,10 12,11 58,13 14,14 35,16 60,17 23,20 14,21 9,22 2,23 3,24 25,25 10,28 2,29 5,32 33,34 3,35 8.6,36 0.167,37 10,38 43,39 59.865,40 66.46,41 36.995,42 36.615,43 5.2,44 5.548}
{0 CHEMBL249540,1 7.904,2 40.4,3 43.9,4 1.027,5 1.145,6 0.641,7 0.63,8 450.5,9 3.5,10 12,11 57,13 14,14 34,16 59,17 23,20 14,21 9,22 2,23 3,24 25,25 9,28 2,29 4,32 32,34 3,35 7,36 0.153,37 9,38 42,39 58.538,40 65.251,41 36.54,42 35.9,43 5.3,44 5.222}
{0 CHEMBL249744,1 7.721,2 40.7,3 46.3,4 1.008,5 1.125,6 0.663,7 0.631,8 416.94,9 3.7,10 12,11 54,13 14,14 31,16 56,17 22,18 1,20 14,21 8,22 2,24 25,25 7,26 1,28 2,29 4,32 29,34 1,35 7.4,36 0.161,37 9,38 39,39 54.44,40 60.761,41 35.824,42 34.051,43 1.9,44 5.245}
{0 CHEMBL249745,1 6.726,2 40.3,3 50.7,4 0.995,5 1.127,6 0.642,7 0.602,8 450.63,9 3,10 12,11 67,13 14,14 36,16 70,17 27,20 14,21 13,22 2,24 34,25 6,28 2,29 4,32 33,35 6,36 0.171,37 12,38 44,39 66.65,40 75.477,41 43.012,42 40.331,44 5.079}
{0 CHEMBL249952,1 7.083,2 40.7,3 48.1,4 1.002,5 1.126,6 0.648,7 0.615,8 382.5,9 3.7,10 12,11 54,13 14,14 30,16 56,17 22,20 14,21 8,22 2,24 26,25 6,28 2,29 4,32 28,35 7.4,36 0.161,37 9,38 38,39 54.116,40 60.817,41 34.966,42 33.224,44 5.036}
{0 CHEMBL249953,1 8.544,2 40.7,3 46.3,4 1.006,5 1.123,6 0.673,7 0.634,8 461.39,9 3.7,10 12,11 54,13 14,14 31,15 1,16 56,17 22,20 14,21 8,22 2,24 25,25 7,26 1,28 2,29 4,32 29,34 1,35 7.4,36 0.161,37 9,38 39,39 54.345,40 60.658,41 36.318,42 34.249,43 1.9,44 5.257}
{0 CHEMBL249954,1 6.382,2 35.6,3 54.2,4 0.996,5 1.137,6 0.614,7 0.573,8 376.55,9 3.4,10 6,11 59,13 8,14 28,16 60,17 21,20 8,21 13,22 2,24 32,25 6,28 2,29 4,32 27,35 6.8,36 0.2,37 12,38 33,39 58.767,40 67.062,41 36.25,42 33.804,44 5.75}
{0 CHEMBL250153,1 6.39,2 36.5,3 54,4 0.994,5 1.135,6 0.619,7 0.577,8 402.59,9 3.2,10 6,11 63,13 8,14 31,16 65,17 23,20 8,21 15,22 2,24 34,25 6,28 2,29 4,32 29,35 6.3,36 0.169,37 11,38 36,39 62.65,40 71.477,41 39.012,42 36.331,44 6.266}
{0 CHEMBL251294,1 6.644,2 38.5,3 51.9,4 0.998,5 1.129,6 0.629,7 0.591,8 345.48,9 1.9,10 6,11 52,13 9,14 26,16 53,17 20,20 10,21 10,22 3,24 27,25 5,28 1,29 4,32 25,35 7.7,36 0.17,37 9,38 32,39 51.898,40 58.734,41 32.722,42 30.729,44 6.637}
{0 CHEMBL251504,1 6.464,2 40,3 52.7,4 0.99,5 1.126,6 0.637,7 0.592,8 355.52,9 1.8,10 6,11 55,13 10,14 27,16 56,17 22,20 12,21 10,22 4,24 29,25 4,28 1,29 3,32 26,35 5.5,36 0.161,37 9,38 34,39 54.454,40 61.939,41 35.029,42 32.541,44 6.764}
{0 CHEMBL251505,1 6.464,2 40,3 52.7,4 0.99,5 1.126,6 0.637,7 0.592,8 355.52,9 1.8,10 6,11 55,13 10,14 27,16 56,17 22,20 12,21 10,22 4,24 29,25 4,28 1,29 3,32 26,35 5.5,36 0.161,37 9,38 34,39 54.454,40 61.939,41 35.029,42 32.541,44 7.339}
{0 CHEMBL251709,1 6.567,2 40.4,3 51.9,4 0.992,5 1.125,6 0.64,7 0.596,8 341.49,9 1.9,10 6,11 52,13 10,14 26,16 53,17 21,20 12,21 9,22 4,24 27,25 4,28 1,29 3,32 25,35 5.8,36 0.17,37 9,38 33,39 51.571,40 58.524,41 33.267,42 31.014,44 6.706}
{0 CHEMBL251710,1 6.683,2 40.8,3 51,4 0.994,5 1.125,6 0.643,7 0.602,8 327.46,9 2,10 6,11 49,13 10,14 25,16 50,17 20,20 12,21 8,22 4,24 25,25 4,28 1,29 3,32 24,35 6.1,36 0.14,37 7,38 32,39 48.687,40 55.109,41 31.506,42 29.487,44 6.762}
{0 CHEMBL257217,1 6.44,2 37.9,3 53.4,4 0.994,5 1.13,6 0.625,7 0.582,8 373.54,9 1.7,10 6,11 58,13 9,14 28,16 59,17 22,20 10,21 12,22 3,24 31,25 5,28 1,29 4,32 27,35 6.9,36 0.186,37 11,38 34,39 57.665,40 65.564,41 36.245,42 33.783,44 7.268}
{0 CHEMBL257658,1 6.354,2 37.7,3 54.1,4 0.993,5 1.131,6 0.623,7 0.579,8 387.57,9 1.6,10 6,11 61,13 9,14 29,16 62,17 23,20 10,21 13,22 3,24 33,25 5,28 1,29 4,32 28,35 6.6,36 0.161,37 10,38 35,39 60.549,40 68.979,41 38.006,42 35.309,44 6.851}
{0 CHEMBL258332,1 7.81,2 43.4,3 45.3,4 1.006,5 1.118,6 0.676,7 0.642,8 413.93,9 1.9,10 12,11 53,13 15,14 31,16 55,17 23,18 1,20 16,21 7,22 3,24 24,25 6,26 1,28 1,29 4,32 29,34 1,35 7.5,36 0.145,37 8,38 40,39 53.338,40 59.262,41 35.818,42 34.03,43 1.9,44 6.301}
{0 CHEMBL260672,1 10.494,2 46.5,3 30.2,4 1.051,5 1.12,6 0.727,7 0.729,8 451.25,9 4.7,10 12,11 43,13 16,14 33,16 46,17 20,18 2,20 16,21 4,22 4,23 1,24 13,25 10,26 2,28 2,29 5,32 30,34 3,35 11.6,36 0.087,37 4,38 43,39 45.185,40 48.178,41 31.267,42 31.343,43 7,44 4.523}
{0 CHEMBL260674,1 9.693,2 46.5,3 32.6,4 1.043,5 1.122,6 0.707,7 0.71,8 416.81,9 4.7,10 12,11 43,13 16,14 32,16 46,17 20,18 1,20 16,21 4,22 4,23 1,24 14,25 9,26 1,28 2,29 5,32 29,34 2,35 11.6,36 0.087,37 4,38 42,39 44.862,40 48.234,41 30.409,42 30.515,43 4.7,44 4.523}
{0 CHEMBL262690,1 8.163,2 48.6,3 40.3,4 1.002,5 1.106,6 0.714,7 0.68,8 587.74,9 4.2,10 30,11 72,13 34,14 48,16 77,17 35,20 32,21 3,22 4,24 29,25 8,26 1,28 3,29 4,31 1,32 43,35 5.6,36 0.078,37 6,38 67,39 72.178,40 79.65,41 51.381,42 48.959,44 4.796}
{0 CHEMBL271488,1 6.764,2 38.8,3 51,4 1,5 1.129,6 0.632,7 0.596,8 331.45,9 2,10 6,11 49,13 9,14 25,16 50,17 19,20 10,21 9,22 3,24 25,25 5,28 1,29 4,32 24,35 8.2,36 0.16,37 8,38 31,39 49.014,40 55.318,41 30.961,42 29.202,44 4.602}
{0 CHEMBL271896,1 5.922,2 34.8,3 58,4 0.99,5 1.136,6 0.601,7 0.552,8 408.64,11 69,13 3,14 30,16 70,17 24,20 4,21 20,22 3,24 40,25 5,29 5,32 29,35 7.2,36 0.2,37 14,38 33,39 68.309,40 78.351,41 41.5,42 38.11,44 6.959}
{0 CHEMBL272276,1 7.16,2 43.4,3 47.2,4 1,5 1.119,6 0.66,7 0.626,8 379.49,9 1.9,10 12,11 53,13 15,14 30,16 55,17 23,20 16,21 7,22 3,24 25,25 5,28 1,29 4,32 28,35 7.5,36 0.145,37 8,38 39,39 53.014,40 59.318,41 34.961,42 33.202,44 5.595}
{0 CHEMBL272277,1 6.445,2 38.7,3 53.2,4 0.993,5 1.129,6 0.629,7 0.586,8 399.58,9 1.6,10 6,11 62,13 9,14 31,16 64,17 24,20 10,21 14,22 3,24 33,25 5,28 1,29 4,32 29,35 6.5,36 0.156,37 10,38 37,39 61.549,40 69.979,41 39.006,42 36.309,44 7.678}
{0 CHEMBL272969,1 6.9,2 39.1,3 50,4 1.003,5 1.128,6 0.635,7 0.602,8 317.42,9 2.2,10 6,11 46,13 9,14 24,16 47,17 18,20 10,21 8,22 3,24 23,25 5,28 1,29 4,32 23,35 8.7,36 0.149,37 7,38 30,39 46.131,40 51.903,41 29.199,42 27.675,44 5}
{0 CHEMBL275245,1 6.509,2 37.1,3 53.2,4 0.998,5 1.132,6 0.62,7 0.581,8 403.57,9 1.6,10 6,11 62,13 9,14 30,16 63,17 23,20 10,21 13,22 3,24 33,25 6,28 1,29 5,32 29,35 8.1,36 0.206,37 13,38 36,39 61.876,40 70.189,41 38.461,42 36.024,44 4.886}
{0 CHEMBL275667,1 6.729,2 36.8,3 50.9,4 0.996,5 1.138,6 0.633,7 0.594,8 383.55,9 8.8,10 11,11 57,13 13,14 30,16 59,17 21,20 10,21 11,22 2,24 29,25 7,28 5,29 2,32 28,35 3.5,36 0.186,37 11,38 37.5,39 56.767,40 64.893,41 36.074,42 33.858,44 4.886}
{0 CHEMBL277158,1 6.992,2 37.5,3 51.8,4 0.997,5 1.126,6 0.645,7 0.597,8 391.58,9 1.8,10 6,11 56,13 9,14 28,16 57,17 21,20 10,21 11,22 3,24 29,25 6,26 1,28 1,29 4,31 1,32 27,35 7.1,36 0.211,37 12,38 34,39 55.858,40 63.069,41 36.131,42 33.443,44 4.886}
{0 CHEMBL278451,1 6.354,2 37.7,3 54.1,4 0.993,5 1.131,6 0.623,7 0.579,8 387.57,9 1.6,10 6,11 61,13 9,14 29,16 62,17 23,20 10,21 13,22 3,24 33,25 5,28 1,29 4,32 28,35 6.6,36 0.177,37 11,38 35,39 60.549,40 68.979,41 38.006,42 35.309,44 4.886}
{0 CHEMBL280223,1 6.535,2 39,3 52.5,4 0.994,5 1.128,6 0.631,7 0.59,8 385.55,9 1.7,10 6,11 59,13 9,14 30,16 61,17 23,20 10,21 13,22 3,24 31,25 5,28 1,29 4,32 28,35 6.8,36 0.18,37 11,38 36,39 58.665,40 66.564,41 37.245,42 34.783,44 4.886}
{0 CHEMBL280247,1 6.729,2 36.8,3 50.9,4 0.996,5 1.138,6 0.633,7 0.594,8 383.55,9 8.8,10 11,11 57,13 13,14 30,16 59,17 21,20 10,21 11,22 2,24 29,25 7,28 5,29 2,32 28,35 3.5,36 0.186,37 11,38 37.5,39 56.767,40 64.893,41 36.074,42 33.858,44 4.886}
{0 CHEMBL280442,1 6.44,2 37.9,3 53.4,4 0.994,5 1.13,6 0.625,7 0.582,8 373.54,9 1.7,10 6,11 58,13 9,14 28,16 59,17 22,20 10,21 12,22 3,24 31,25 5,28 1,29 4,32 27,35 6.9,36 0.203,37 12,38 34,39 57.665,40 65.564,41 36.245,42 33.783,44 4.886}
{0 CHEMBL290969,1 6.134,2 35.9,3 56.3,4 0.993,5 1.133,6 0.609,7 0.563,8 392.59,10 6,11 64,13 7,14 29,16 65,17 23,20 7,21 16,22 1,24 36,25 5,29 5,32 28,35 7.8,36 0.2,37 13,38 33,39 63.541,40 72.521,41 38.978,42 36.056,44 5.602}
{0 CHEMBL296715,1 6.671,2 39.7,3 51.5,4 0.996,5 1.127,6 0.636,7 0.596,8 453.63,9 1.5,10 12,11 68,13 14,14 35,16 70,17 27,20 14,21 13,22 2,24 35,25 6,28 1,29 5,32 33,35 7.4,36 0.171,37 12,38 43,39 67.76,40 76.604,41 43.222,42 40.551,44 4.585}
{0 CHEMBL297139,1 6.644,2 38.5,3 51.9,4 0.998,5 1.129,6 0.629,7 0.591,8 345.48,9 1.9,10 6,11 52,13 9,14 26,16 53,17 20,20 10,21 10,22 3,24 27,25 5,28 1,29 4,32 25,35 7.7,36 0.189,37 10,38 32,39 51.898,40 58.734,41 32.722,42 30.729,44 4.387}
{0 CHEMBL297578,1 7.355,2 41.9,3 48.4,4 1,5 1.121,6 0.663,7 0.623,8 456.02,9 1.6,10 12,11 62,13 15,14 34,16 64,17 26,18 1,20 16,21 10,22 3,24 30,25 6,26 1,28 1,29 4,32 32,34 1,35 6.5,36 0.172,37 11,38 43,39 61.989,40 69.508,41 41.103,42 38.61,43 1.6,44 4.377}
{0 CHEMBL298026,1 7.232,2 41.5,3 49.2,4 0.998,5 1.122,6 0.659,7 0.617,8 470.05,9 1.5,10 12,11 65,13 15,14 35,16 67,17 27,18 1,20 16,21 11,22 3,24 32,25 6,26 1,28 1,29 4,32 33,34 1,35 6.2,36 0.164,37 11,38 44,39 64.872,40 72.923,41 42.864,42 40.137,43 1.5,44 4}
{0 CHEMBL313266,1 8.854,2 42.9,3 42.9,4 1.003,5 1.102,6 0.735,7 0.674,8 557.83,9 1.6,10 23,11 63,13 27,14 39,16 66,17 27,20 22,21 5,22 4,24 27,25 9,26 4,28 1,29 4,31 4,32 36,35 6.3,36 0.182,37 12,38 54.5,39 63.203,40 69.414,41 46.313,42 42.477,44 5.523}
{0 CHEMBL313700,1 8.416,2 45.2,3 43.5,4 0.997,5 1.101,6 0.729,7 0.671,8 521.77,9 1.6,10 23,11 62,13 26,14 38,16 65,17 28,20 23,21 5,22 3,24 27,25 7,26 3,28 1,29 3,31 3,32 35,35 4.8,36 0.169,37 11,38 52.5,39 61.8,40 68.284,41 45.21,42 41.575,44 5.602}
{0 CHEMBL314200,1 7.968,2 43.5,3 44.9,4 1.002,5 1.11,6 0.696,7 0.65,8 549.76,9 1.4,10 23,11 69,13 26,14 41,16 72,17 30,20 23,21 7,22 3,24 31,25 8,26 2,28 1,29 5,31 2,32 38,35 7.2,36 0.167,37 12,38 55.5,39 69.145,40 76.613,41 47.995,42 44.872,44 5.538}
{0 CHEMBL314533,1 7.782,2 48.1,3 43,4 0.997,5 1.106,6 0.705,7 0.665,8 614.81,9 2.5,10 30,11 79,13 34,14 50,16 84,17 38,20 32,21 6,22 4,24 34,25 7,26 1,28 2,29 4,31 1,32 45,35 5.1,36 0.083,37 7,38 69,39 78.727,40 87.397,41 55.659,42 52.518,44 4.638}
{0 CHEMBL314616,1 9.443,2 50.8,3 35.6,4 1.008,5 1.094,6 0.765,7 0.723,8 557.12,9 3.4,10 28,11 59,13 33,14 42,16 63,17 30,18 1,20 30,22 5,24 21,25 8,26 3,28 2,29 3,31 2,32 38,34 1,35 5.1,36 0.111,37 7,38 61,39 59.498,40 64.561,41 45.142,42 42.657,43 1.7,44 4.155}
{0 CHEMBL314812,1 9.025,2 43.7,3 38,4 1.027,5 1.128,6 0.702,7 0.681,8 640.76,9 5.6,10 23,11 71,13 28,14 48,16 75,17 31,20 25,21 6,22 5,23 3,24 27,25 13,26 2,28 4,29 4,31 2,32 44,34 3,35 5.6,36 0.133,37 10,38 64.5,39 72.894,40 80.088,41 49.847,42 48.317,43 4.2,44 5}
{0 CHEMBL315391,1 7.669,2 47.6,3 43.9,4 0.995,5 1.107,6 0.7,7 0.659,8 628.84,9 2.4,10 30,11 82,13 34,14 51,16 87,17 39,20 32,21 7,22 4,24 36,25 7,26 1,28 2,29 4,31 1,32 46,35 4.9,36 0.092,37 8,38 70,39 81.61,40 90.813,41 57.421,42 54.045,44 4}
{0 CHEMBL315974,1 9.078,2 43.5,3 41.3,4 1.006,5 1.101,6 0.743,7 0.684,8 417.61,9 2.2,10 17,11 46,13 20,14 29,16 48,17 20,20 17,21 3,22 3,24 19,25 7,26 3,28 1,29 3,31 3,32 27,35 6.5,36 0.146,37 7,38 40.5,39 46.265,40 50.623,41 34.165,42 31.468,44 4.509}
{0 CHEMBL327596,1 7.776,2 46.9,3 43.2,4 0.998,5 1.11,6 0.7,7 0.661,8 629.83,9 3.7,10 30,11 81,13 34,14 51,16 86,17 38,20 32,21 6,22 4,24 35,25 8,26 1,28 3,29 4,31 1,32 46,35 4.9,36 0.093,37 8,38 70,39 80.829,40 89.896,41 56.665,42 53.539,44 4}
{0 CHEMBL327597,1 7.895,2 47.4,3 42.3,4 0.999,5 1.109,6 0.704,7 0.667,8 615.8,9 3.8,10 30,11 78,13 34,14 50,16 83,17 37,20 32,21 5,22 4,24 33,25 8,26 1,28 3,29 4,31 1,32 45,35 5.1,36 0.084,37 7,38 69,39 77.945,40 86.481,41 54.904,42 52.012,44 4.678}
{0 CHEMBL328067,1 8.038,2 49.3,3 41.1,4 0.999,5 1.104,6 0.714,7 0.678,8 586.75,9 2.7,10 30,11 73,13 34,14 48,16 78,17 36,20 32,21 4,22 4,24 30,25 7,26 1,28 2,29 4,31 1,32 43,35 5.5,36 0.09,37 7,38 67,39 72.96,40 80.567,41 52.137,42 49.464,44 4.854}
{0 CHEMBL328697,1 8.291,2 46.7,3 41.3,4 1.002,5 1.106,6 0.717,7 0.676,8 621.83,9 4,10 29,11 75,13 33,14 49,16 80,17 35,20 30,21 5,22 4,24 31,25 9,26 2,28 3,29 4,31 2,32 44,35 5.3,36 0.1,37 8,38 67.5,39 75.138,40 82.985,41 53.79,42 50.673,44 4}
{0 CHEMBL332446,1 7.792,2 49.1,3 43.6,4 0.994,5 1.101,6 0.712,7 0.666,8 428.58,10 23,11 55,13 24,14 34,16 58,17 27,20 23,21 4,22 1,24 24,25 4,26 1,29 3,31 1,32 31,35 5.5,36 0.138,37 8,38 46.5,39 54.662,40 60.531,41 39.148,42 36.653,44 5.337}
{0 CHEMBL338388,1 7.428,2 50.9,3 43.6,4 0.992,5 1.102,6 0.7,7 0.663,8 408.52,10 24,11 55,13 25,14 34,16 58,17 28,20 25,21 3,22 1,24 24,25 3,29 3,32 31,35 5.5,36 0.138,37 8,38 47,39 54.585,40 60.611,41 38.5,42 36.466,44 5.432}
{0 CHEMBL340501,1 7.67,2 52.8,3 41.5,4 0.994,5 1.098,6 0.712,7 0.678,8 406.5,10 24,11 53,13 26,14 34,16 56,17 28,20 27,21 1,22 2,24 22,25 3,29 3,32 31,35 5.7,36 0.125,37 7,38 48,39 52.702,40 58.195,41 37.739,42 35.939,44 6.081}
{0 CHEMBL350832,1 9.599,2 50,3 37.5,4 1.015,5 1.1,6 0.749,7 0.712,8 307.18,10 12,11 32,13 14,14 21,16 33,17 16,18 2,20 15,21 1,22 2,24 12,25 4,26 2,29 2,32 20,34 2,35 6.3,36 0.121,37 4,38 29,39 32.487,40 35.213,41 23.955,42 22.772,43 6.3,44 5.387}
{0 CHEMBL358653,1 8.98,2 43.1,3 39.2,4 1.019,5 1.116,6 0.71,7 0.68,8 457.97,9 5.9,10 17,11 51,13 19,14 34,16 54,17 22,18 1,20 18,21 4,22 2,24 20,25 9,26 2,28 3,29 4,31 1,32 31,34 1,35 7.8,36 0.111,37 6,38 44.5,39 51.967,40 56.933,41 36.193,42 34.679,43 2,44 8.1}
{0 CHEMBL359231,1 9.115,2 42.3,3 38.5,4 1.025,5 1.118,6 0.705,7 0.681,8 473.97,9 5.8,10 17,11 52,13 20,14 35,16 55,17 22,18 1,20 18,21 4,22 3,24 20,25 10,26 2,28 3,29 5,31 1,32 32,34 1,35 9.6,36 0.109,37 6,38 46.5,39 53.294,40 58.143,41 36.648,42 35.394,43 1.9,44 6.2}
{0 CHEMBL360290,1 8.692,2 48.1,3 40.7,4 1.01,5 1.106,6 0.716,7 0.682,8 469.38,10 18,11 54,13 21,14 34,16 56,17 26,18 2,20 23,21 3,22 3,24 22,25 6,26 2,29 4,32 32,34 2,35 7.4,36 0.143,37 8,38 46,39 54.56,40 59.708,41 38.671,42 36.836,43 3.7,44 5.409}
{0 CHEMBL36041,1 6.919,2 35.5,3 53.2,4 1.005,5 1.133,6 0.621,7 0.582,8 429,10 6,11 62,13 7,14 30,16 63,17 22,18 1,20 7,21 15,22 1,24 33,25 7,26 1,29 6,32 29,34 1,35 9.7,36 0.206,37 13,38 34,39 62.309,40 70.259,41 38.529,42 36.072,43 1.6,44 5.174}
{0 CHEMBL363800,1 7.644,2 47.6,3 42.9,4 1.004,5 1.11,6 0.685,7 0.658,8 481.58,9 1.6,10 23,11 63,13 24,14 41,16 68,17 30,20 22,21 8,22 1,24 27,25 6,28 1,29 5,32 36,35 7.9,36 0.118,37 8,38 53.5,39 63.225,40 69.943,41 43.176,42 41.444,44 5.854}
{0 CHEMBL36817,1 5.692,2 31.7,3 60.3,4 0.991,5 1.142,6 0.583,7 0.533,8 358.58,11 63,13 1,14 25,16 63,17 20,20 1,21 19,22 1,24 38,25 5,29 5,32 25,35 7.9,36 0.222,37 14,38 26,39 62.425,40 71.936,41 36.739,42 33.583,44 5.31}
{0 CHEMBL369797,1 7.062,2 33.9,3 54.2,4 0.999,5 1.128,6 0.64,7 0.583,8 416.66,10 5,11 59,13 6,14 28,16 60,17 20,20 5,21 15,22 1,24 32,25 7,26 2,29 5,31 2,32 27,35 8.5,36 0.217,37 13,38 31.5,39 58.927,40 66.53,41 37.75,42 34.377,44 5.886}
{0 CHEMBL371394,1 7.407,2 49.3,3 43.8,4 0.992,5 1.108,6 0.696,7 0.659,8 540.7,9 2.7,10 29,11 73,13 31,14 46,16 78,17 36,20 30,21 6,22 2,24 32,25 5,28 2,29 3,32 41,35 4.1,36 0.115,37 9,38 62.5,39 72.44,40 80.853,41 50.796,42 48.089,44 5.523}
{0 CHEMBL376053,1 7.255,2 49.1,3 45.3,4 0.992,5 1.106,6 0.689,7 0.65,8 384.5,10 18,11 53,13 21,14 31,16 55,17 26,20 23,21 3,22 3,24 24,25 3,29 3,32 29,35 5.7,36 0.145,37 8,38 43,39 52.585,40 58.611,41 36.5,42 34.466,44 6.066}
{0 CHEMBL376282,1 7.343,2 50,3 44.4,4 0.992,5 1.104,6 0.694,7 0.657,8 264.34,10 12,11 36,13 15,14 21,16 37,17 18,20 17,21 1,22 3,24 16,25 2,29 2,32 20,35 5.6,36 0.135,37 5,38 30,39 35.723,40 39.74,41 25,42 23.644,44 5.854}
{0 CHEMBL376347,1 6.343,2 36.8,3 54.4,4 0.994,5 1.133,6 0.618,7 0.575,8 361.53,9 1.8,10 6,11 57,13 8,14 27,16 58,17 21,20 8,21 13,22 2,24 31,25 5,28 1,29 4,32 26,35 7,36 0.19,37 11,38 32,39 56.665,40 64.564,41 35.245,42 32.783,44 7.456}
{0 CHEMBL37853,1 7.327,2 37.9,3 50,4 1.009,5 1.128,6 0.638,7 0.604,8 424.96,10 6,11 58,13 9,14 30,16 59,17 22,18 1,20 11,21 11,22 3,24 29,25 7,26 1,29 6,32 29,34 1,35 10.3,36 0.186,37 11,38 36,39 58.542,40 65.428,41 37.006,42 35.018,43 1.7,44 5.432}
{0 CHEMBL383484,1 8.679,2 43.4,3 41.5,4 1.016,5 1.113,6 0.701,7 0.668,8 459.98,9 1.9,10 16,11 53,13 20,14 34,16 56,17 23,18 1,20 16,21 7,22 4,24 22,25 8,26 2,28 1,29 5,31 1,32 31,34 1,35 9.4,36 0.107,37 6,38 46,39 53.858,40 58.977,41 37.159,42 35.405,43 1.9,44 6.638}
{0 CHEMBL384878,1 8.714,2 46.8,3 40.4,4 1.004,5 1.1,6 0.734,7 0.687,8 409.56,9 2.1,10 17,11 47,13 22,14 30,16 49,17 22,20 21,21 1,22 5,24 19,25 6,26 2,28 1,29 3,31 2,32 28,35 6.4,36 0.143,37 7,38 43.5,39 47.189,40 51.703,41 34.517,42 32.281,44 5.097}
{0 CHEMBL385126,1 8.508,2 46.8,3 40.4,4 1.016,5 1.118,6 0.697,7 0.673,8 399.87,9 2.1,10 16,11 47,13 18,14 31,16 50,17 22,18 1,20 16,21 6,22 2,23 1,24 19,25 6,26 1,28 1,29 3,32 28,34 2,35 6.4,36 0.1,37 5,38 41,39 47.756,40 52.562,41 32.779,42 31.645,43 4.3,44 6.509}
{0 CHEMBL385396,1 8.714,2 46.8,3 40.4,4 1.004,5 1.1,6 0.734,7 0.687,8 409.56,9 2.1,10 17,11 47,13 22,14 30,16 49,17 22,20 21,21 1,22 5,24 19,25 6,26 2,28 1,29 3,31 2,32 28,35 6.4,36 0.143,37 7,38 43.5,39 47.189,40 51.703,41 34.517,42 32.281,44 5.097}
{0 CHEMBL385955,1 8.396,2 46.2,3 41.5,4 1.006,5 1.104,6 0.715,7 0.674,8 545.72,9 1.5,10 23,11 65,13 28,14 41,16 68,17 30,20 27,21 3,22 5,24 27,25 8,26 2,28 1,29 5,31 2,32 38,35 7.7,36 0.162,37 11,38 57.5,39 65.378,40 71.783,41 46.472,42 43.818,44 5.339}
{0 CHEMBL398827,1 9.415,2 40.7,3 46.3,4 1.003,5 1.121,6 0.697,7 0.64,8 508.39,9 3.7,10 12,11 54,13 14,14 31,16 56,17 22,20 14,21 8,22 2,24 25,25 7,26 1,27 1,28 2,29 4,32 29,34 1,35 7.4,36 0.161,37 9,38 39,39 54.185,40 60.537,41 37.625,42 34.54,43 1.9,44 5.693}
{0 CHEMBL398947,1 6.814,2 41.3,3 50,4 0.996,5 1.124,6 0.647,7 0.608,8 313.43,9 2.2,10 6,11 46,13 10,14 24,16 47,17 19,20 12,21 7,22 4,24 23,25 4,28 1,29 3,32 23,35 6.5,36 0.128,37 6,38 31,39 45.803,40 51.694,41 29.745,42 27.961,44 5.733}
{0 CHEMBL398948,1 6.464,2 40,3 52.7,4 0.99,5 1.126,6 0.637,7 0.592,8 355.52,9 1.8,10 6,11 55,13 10,14 27,16 56,17 22,20 12,21 10,22 4,24 29,25 4,28 1,29 3,32 26,35 5.5,36 0.161,37 9,38 34,39 54.454,40 61.939,41 35.029,42 32.541,44 7.588}
{0 CHEMBL400404,1 7.927,2 45.9,3 41,4 1.011,5 1.117,6 0.683,7 0.663,8 483.56,9 4.9,10 23,11 61,13 26,14 39,16 64,17 28,20 24,21 4,22 3,24 25,25 8,28 3,29 5,32 36,35 8.2,36 0.141,37 9,38 53.5,39 61.662,40 68.109,41 41.665,42 40.433,44 4.495}
{0 CHEMBL400446,1 7.416,2 40.7,3 46.3,4 1.012,5 1.133,6 0.646,7 0.622,8 400.49,9 3.7,10 12,11 54,13 14,14 31,16 56,17 22,20 14,21 8,22 2,23 1,24 25,25 7,28 2,29 4,32 29,34 1,35 7.4,36 0.161,37 9,38 39,39 54.629,40 61.156,41 34.904,42 33.607,43 1.9,44 5.201}
{0 CHEMBL400447,1 6.732,2 43.1,3 50,4 0.989,5 1.121,6 0.657,7 0.613,8 484.69,9 2.8,10 18,11 72,13 20,14 39,16 75,17 31,20 20,21 11,22 2,24 36,25 5,28 2,29 3,32 36,35 4.2,36 0.16,37 12,38 50,39 71.207,40 80.683,41 47.319,42 44.143,44 6.252}
{0 CHEMBL402162,1 7.944,2 42.1,3 43.4,4 1.012,5 1.12,6 0.675,7 0.647,8 603.75,9 3.9,10 23,11 76,13 27,14 47,16 80,17 32,20 23,21 9,22 4,24 33,25 11,26 1,28 3,29 7,31 1,32 43,35 9.2,36 0.138,37 11,38 62.5,39 76.927,40 85.109,41 51.267,42 49.157,44 5.721}
{0 CHEMBL404199,1 9.14,2 41.7,3 36.9,4 1.049,5 1.145,6 0.665,7 0.669,8 767.76,9 3.6,10 23,11 84,13 27,14 58,16 89,17 35,20 23,21 12,22 4,23 6,24 31,25 18,26 1,28 3,29 8,31 1,32 53,34 6,35 9.5,36 0.135,37 12,38 73.5,39 88.098,40 96.187,41 55.87,42 56.225,43 7.1,44 6.523}
{0 CHEMBL404413,1 6.575,2 35.8,3 52.8,4 1,5 1.136,6 0.618,7 0.58,8 348.49,9 3.8,10 6,11 53,13 8,14 26,16 54,17 19,20 8,21 11,22 2,24 28,25 6,28 2,29 4,32 25,35 7.5,36 0.167,37 9,38 31,39 53,40 60.232,41 32.728,42 30.75,44 4.824}
{0 CHEMBL404414,1 9.415,2 40.7,3 46.3,4 1.003,5 1.121,6 0.697,7 0.64,8 508.39,9 3.7,10 12,11 54,13 14,14 31,16 56,17 22,20 14,21 8,22 2,24 25,25 7,26 1,27 1,28 2,29 4,32 29,34 1,35 7.4,36 0.161,37 9,38 39,39 54.185,40 60.537,41 37.625,42 34.54,43 1.9,44 5.627}
{0 CHEMBL411255,1 9.279,2 44,3 38,4 1.03,5 1.118,6 0.707,7 0.685,8 463.94,9 2,10 16,11 50,13 20,14 34,16 53,17 22,18 1,20 16,21 6,22 4,23 1,24 19,25 9,26 2,28 1,29 5,31 1,32 31,34 2,35 10,36 0.094,37 5,38 46,39 51.487,40 55.901,41 35.335,42 34.261,43 4,44 4.535}
{0 CHEMBL411315,1 10.076,2 46.5,3 32.6,4 1.039,5 1.113,6 0.729,7 0.72,8 433.26,9 4.7,10 12,11 43,13 16,14 32,16 46,17 20,18 2,20 16,21 4,22 4,24 14,25 9,26 2,28 2,29 5,32 29,34 2,35 11.6,36 0.087,37 4,38 42,39 44.673,40 47.838,41 31.33,42 30.959,43 4.7,44 4.523}
{0 CHEMBL412070,1 9.279,2 44,3 38,4 1.03,5 1.118,6 0.707,7 0.685,8 463.94,9 2,10 16,11 50,13 20,14 34,16 53,17 22,18 1,20 16,21 6,22 4,23 1,24 19,25 9,26 2,28 1,29 5,31 1,32 31,34 2,35 10,36 0.094,37 5,38 46,39 51.487,40 55.901,41 35.335,42 34.261,43 4,44 5.468}
{0 CHEMBL413509,1 6.313,2 33.9,3 55.4,4 1,5 1.139,6 0.602,7 0.562,8 353.51,9 1.8,11 56,13 4,14 25,16 56,17 19,20 6,21 13,22 4,24 31,25 6,28 1,29 5,32 25,35 8.9,36 0.214,37 12,38 29,39 55.992,40 63.773,41 33.699,42 31.497,44 8.194}
{0 CHEMBL415310,1 8.56,2 47.5,3 38.8,4 1.02,5 1.12,6 0.699,7 0.68,8 684.78,9 2.5,10 30,11 80,13 34,14 54,16 85,17 38,20 32,21 6,22 4,23 3,24 31,25 11,26 1,28 2,29 5,31 1,32 49,34 3,35 6.3,36 0.094,37 8,38 73,39 81.592,40 89.626,41 55.926,42 54.383,43 3.8,44 4.959}
{0 CHEMBL416262,1 6.137,2 34.5,3 56.4,4 0.994,5 1.138,6 0.604,7 0.56,8 337.51,9 1.8,11 55,13 3,14 25,16 56,17 19,20 4,21 15,22 3,24 31,25 5,28 1,29 4,32 24,35 7.3,36 0.196,37 11,38 28,39 54.665,40 62.564,41 33.245,42 30.783,44 4}
{0 CHEMBL417171,1 7.518,2 38.2,3 47.3,4 1.024,5 1.149,6 0.624,7 0.607,8 413.48,9 1.8,10 6,11 55,13 9,14 30,16 56,17 21,20 10,21 11,22 3,23 3,24 26,25 8,28 1,29 4,32 29,34 3,35 7.3,36 0.179,37 10,38 36,39 56.32,40 63.168,41 34.296,42 33.406,43 5.5,44 4.167}
{0 CHEMBL42027,1 5.957,2 33.3,3 57.9,4 0.992,5 1.14,6 0.597,7 0.549,8 339.53,9 1.8,11 57,13 3,14 24,16 57,17 19,20 4,21 15,22 3,24 33,25 5,28 1,29 4,32 24,35 7,36 0.228,37 13,38 27,39 56.549,40 64.979,41 34.006,42 31.309,44 5.347}
{0 CHEMBL42129,1 5.993,2 34.4,3 57.4,4 0.991,5 1.138,6 0.603,7 0.555,8 365.57,9 1.6,11 61,13 3,14 27,16 62,17 21,20 4,21 17,22 3,24 35,25 5,28 1,29 4,32 26,35 6.6,36 0.177,37 11,38 30,39 60.432,40 69.394,41 36.768,42 33.836,44 4.149}
{0 CHEMBL423815,1 7.588,2 52.6,3 42.1,4 0.993,5 1.098,6 0.711,7 0.675,8 288.36,10 17,11 38,13 19,14 24,16 40,17 20,20 19,21 1,22 2,24 16,25 2,29 2,32 22,35 5.3,36 0.1,37 4,38 34.5,39 37.723,40 41.74,41 27,42 25.644,44 4.921}
{0 CHEMBL424975,1 7.028,2 47.3,3 47.3,4 0.99,5 1.11,6 0.677,7 0.636,8 386.52,10 18,11 55,13 20,14 31,16 57,17 26,20 21,21 5,22 2,24 26,25 3,29 3,32 29,35 5.5,36 0.158,37 9,38 42,39 54.469,40 61.026,41 37.262,42 34.993,44 6.42}
{0 CHEMBL425681,1 6.364,2 35.5,3 54.8,4 1,5 1.134,6 0.608,7 0.568,8 394.56,10 6,11 62,13 7,14 29,16 63,17 22,20 7,21 15,22 1,24 34,25 6,29 6,32 28,35 9.7,36 0.206,37 13,38 33,39 61.985,40 70.315,41 37.671,42 35.244,44 5}
{0 CHEMBL426387,1 10.398,2 47.6,3 38.1,4 1.018,5 1.114,6 0.736,7 0.701,8 436.72,9 2.4,10 16,11 42,13 17,14 29,15 1,16 45,17 20,18 1,20 15,21 5,22 1,23 1,24 16,25 6,26 2,28 1,29 2,32 26,34 3,35 4.8,36 0.089,37 4,38 38,39 42.774,40 46.779,41 30.915,42 29.428,43 7.1,44 6.387}
{0 CHEMBL426559,1 9.082,2 43.8,3 39.6,4 1.024,5 1.119,6 0.706,7 0.678,8 435.93,9 2.1,10 16,11 48,13 19,14 32,16 51,17 21,18 1,20 15,21 6,22 3,23 1,24 19,25 8,26 2,28 1,29 4,31 1,32 29,34 2,35 8.3,36 0.098,37 5,38 43,39 49.16,40 53.692,41 33.881,42 32.547,43 4.2,44 6.866}
{0 CHEMBL428524,1 5.789,2 32.2,3 59.3,4 0.99,5 1.142,6 0.589,7 0.54,8 341.55,9 1.7,11 59,13 2,14 24,16 59,17 19,20 2,21 17,22 2,24 35,25 5,28 1,29 4,32 24,35 6.8,36 0.237,37 14,38 26,39 58.432,40 67.394,41 34.768,42 31.836,44 5.393}
{0 CHEMBL430121,1 7.302,2 36.4,3 49.1,4 0.999,5 1.135,6 0.654,7 0.609,8 401.59,9 9.1,10 11,11 55,13 13,14 30,16 57,17 20,20 10,21 10,22 2,24 27,25 8,26 1,28 5,29 2,31 1,32 28,35 3.6,36 0.193,37 11,38 37.5,39 54.96,40 62.398,41 35.961,42 33.519,44 4.886}
{0 CHEMBL430124,1 7.124,2 37.7,3 50.9,4 1,5 1.126,6 0.648,7 0.602,8 377.55,9 1.9,10 6,11 53,13 9,14 27,16 54,17 20,20 10,21 10,22 3,24 27,25 6,26 1,28 1,29 4,31 1,32 26,35 7.5,36 0.204,37 11,38 33,39 52.974,40 59.654,41 34.37,42 31.916,44 4.886}
{0 CHEMBL431612,1 8.416,2 45.2,3 43.5,4 0.997,5 1.101,6 0.729,7 0.671,8 521.77,9 1.6,10 23,11 62,13 26,14 38,16 65,17 28,20 23,21 5,22 3,24 27,25 7,26 3,28 1,29 3,31 3,32 35,35 4.8,36 0.169,37 11,38 52.5,39 61.8,40 68.284,41 45.21,42 41.575,44 5.42}
{0 CHEMBL432380,1 8.145,2 48.6,3 40.5,4 1.004,5 1.105,6 0.711,7 0.678,8 602.75,9 2.7,10 30,11 74,13 34,14 49,16 79,17 36,20 32,21 4,22 4,24 30,25 8,26 1,28 2,29 5,31 1,32 44,35 6.8,36 0.101,37 8,38 68,39 74.287,40 81.776,41 52.591,42 50.179,44 4.658}
{0 CHEMBL434002,1 6.44,2 37.9,3 53.4,4 0.994,5 1.13,6 0.625,7 0.582,8 373.54,9 1.7,10 6,11 58,13 9,14 28,16 59,17 22,20 10,21 12,22 3,24 31,25 5,28 1,29 4,32 27,35 6.9,36 0.186,37 11,38 34,39 57.665,40 65.564,41 36.245,42 33.783,44 4.886}
{0 CHEMBL434173,1 6.247,2 34.9,3 55.6,4 0.996,5 1.137,6 0.607,7 0.564,8 393.58,9 1.6,10 6,11 63,13 7,14 29,16 64,17 22,20 7,21 15,22 1,24 35,25 6,28 1,29 5,32 28,35 7.9,36 0.203,37 13,38 33,39 62.76,40 71.604,41 38.222,42 35.551,44 5}
{0 CHEMBL434247,1 7.285,2 50,3 44.8,4 0.991,5 1.104,6 0.694,7 0.655,8 422.55,10 24,11 58,13 25,14 35,16 61,17 29,20 25,21 4,22 1,24 26,25 3,29 3,32 32,35 5.2,36 0.131,37 8,38 48,39 57.469,40 64.026,41 40.262,42 37.993,44 5.444}
{0 CHEMBL434637,1 8.39,2 48.5,3 40.9,4 1.001,5 1.1,6 0.728,7 0.683,8 553.74,9 1.5,10 29,11 66,13 32,14 43,16 70,17 32,20 29,21 3,22 3,24 27,25 7,26 2,28 1,29 4,31 2,32 39,35 6.1,36 0.143,37 10,38 60.5,39 66.051,40 72.574,41 48.017,42 45.103,44 5.796}
{0 CHEMBL440164,1 6.847,2 35.5,3 53.2,4 0.999,5 1.13,6 0.635,7 0.583,8 424.52,10 6,11 62,13 9,14 30,16 63,17 22,20 10,21 12,22 3,24 33,25 7,26 1,29 6,30 1,32 29,35 9.7,36 0.175,37 11,38 36,39 61.96,40 70.039,41 39.353,42 36.168,44 5}
{0 CHEMBL442263,1 8.21,2 41.3,3 42.7,4 1.023,5 1.135,6 0.666,7 0.645,8 615.73,9 4,10 22,11 75,13 26,14 46,16 78,17 31,20 22,21 9,22 4,23 3,24 32,25 12,26 1,28 3,29 5,31 1,32 43,34 3,35 6.7,36 0.128,37 10,38 61,39 76.694,40 85.124,41 49.932,42 48.404,43 4,44 5}
{0 CHEMBL444574,1 6.843,2 40.9,3 50,4 0.998,5 1.124,6 0.643,7 0.606,8 451.61,9 1.5,10 12,11 66,13 15,14 35,16 68,17 27,20 16,21 11,22 3,24 33,25 6,28 1,29 5,32 33,35 7.6,36 0.162,37 11,38 44,39 65.876,40 74.189,41 42.461,42 40.024,44 4}
{0 CHEMBL445895,1 8.243,2 44.6,3 44.6,4 0.995,5 1.103,6 0.723,7 0.663,8 535.8,9 1.5,10 23,11 65,13 26,14 39,16 68,17 29,20 23,21 6,22 3,24 29,25 7,26 3,28 1,29 3,31 3,32 36,35 4.6,36 0.176,37 12,38 53.5,39 64.683,40 71.699,41 46.972,42 43.102,44 5.745}
{0 CHEMBL446098,1 7.792,2 49.1,3 43.6,4 0.994,5 1.101,6 0.712,7 0.666,8 428.58,10 23,11 55,13 24,14 34,16 58,17 27,20 23,21 4,22 1,24 24,25 4,26 1,29 3,31 1,32 31,35 5.5,36 0.138,37 8,38 46.5,39 54.662,40 60.531,41 39.148,42 36.653,44 5.26}
{0 CHEMBL45008,1 7.371,2 37.9,3 48.3,4 1.021,5 1.148,6 0.622,7 0.602,8 427.51,9 1.7,10 6,11 58,13 9,14 31,16 59,17 22,20 10,21 12,22 3,23 3,24 28,25 8,28 1,29 4,32 30,34 3,35 6.9,36 0.186,37 11,38 37,39 59.203,40 66.583,41 36.057,42 34.932,43 5.2,44 4.538}
{0 CHEMBL45418,1 7.758,2 36.5,3 46.2,4 1.034,5 1.153,6 0.615,7 0.608,8 403.44,9 1.9,10 5,11 52,13 8,14 29,16 53,17 19,20 8,21 11,22 3,23 3,24 24,25 9,28 1,29 5,32 28,34 3,35 9.6,36 0.189,37 10,38 34.5,39 53.763,40 59.962,41 31.989,42 31.594,43 5.8,44 4.237}
{0 CHEMBL459885,1 10.537,2 47.1,3 31.4,4 1.043,5 1.119,6 0.744,7 0.73,8 537.39,9 3.9,10 22,11 51,13 26,14 38,16 54,17 24,18 2,20 23,21 1,22 4,23 2,24 16,25 11,26 3,28 2,29 4,31 1,32 35,34 4,35 7.8,36 0.111,37 6,38 53,39 53.214,40 57.058,41 37.92,42 37.252,43 7.8,44 5.018}
{0 CHEMBL461390,1 10.215,2 47.1,3 31.4,4 1.047,5 1.127,6 0.725,7 0.722,8 520.94,9 3.9,10 22,11 51,13 26,14 38,16 54,17 24,18 1,20 23,21 1,22 4,23 3,24 16,25 11,26 2,28 2,29 4,31 1,32 35,34 4,35 7.8,36 0.111,37 6,38 53,39 53.403,40 57.454,41 37,42 36.808,43 7.8,44 5}
{0 CHEMBL46395,1 7.159,2 36.7,3 50,4 1.018,5 1.15,6 0.614,7 0.591,8 429.53,9 1.7,10 6,11 60,13 8,14 31,16 61,17 22,20 8,21 14,22 2,23 3,24 30,25 8,28 1,29 4,32 30,34 3,35 6.7,36 0.197,37 12,38 36,39 61.087,40 68.998,41 36.819,42 35.459,43 5,44 4.658}
{0 CHEMBL46671,1 7.355,2 41.9,3 48.4,4 1,5 1.121,6 0.663,7 0.623,8 456.02,9 1.6,10 12,11 62,13 15,14 34,16 64,17 26,18 1,20 16,21 10,22 3,24 30,25 6,26 1,28 1,29 4,32 32,34 1,35 6.5,36 0.172,37 11,38 43,39 61.989,40 69.508,41 41.103,42 38.61,43 1.6,44 5.377}
{0 CHEMBL467114,1 9.909,2 48.8,3 34.1,4 1.032,5 1.114,6 0.734,7 0.718,8 406.25,9 2.4,10 18,11 41,13 19,14 29,16 43,17 20,18 2,20 18,21 2,22 1,23 1,24 14,25 7,26 2,28 1,29 3,32 27,34 3,35 7.3,36 0.14,37 6,38 39,39 42.313,40 45.676,41 30.114,42 29.419,43 7.3,44 5.8}
{0 CHEMBL467632,1 10.292,2 47.2,3 34,4 1.024,5 1.1,6 0.768,7 0.73,8 545.49,9 3.8,10 26,11 53,13 29,14 39,16 57,17 25,18 2,20 23,21 2,22 3,24 18,25 10,26 4,28 2,29 4,31 2,32 35,34 2,35 7.5,36 0.123,37 7,38 55,39 54.265,40 58.299,41 40.693,42 38.672,43 3.8,44 4.911}
{0 CHEMBL47018,1 6.8,2 41.9,3 50,4 0.995,5 1.122,6 0.649,7 0.609,8 421.58,9 1.6,10 12,11 62,13 15,14 33,16 64,17 26,20 16,21 10,22 3,24 31,25 5,28 1,29 4,32 31,35 6.5,36 0.172,37 11,38 42,39 61.665,40 69.564,41 40.245,42 37.783,44 4.495}
{0 CHEMBL47138,1 7.355,2 41.9,3 48.4,4 1,5 1.121,6 0.663,7 0.623,8 456.02,9 1.6,10 12,11 62,13 15,14 34,16 64,17 26,18 1,20 16,21 10,22 3,24 30,25 6,26 1,28 1,29 4,32 32,34 1,35 6.5,36 0.172,37 11,38 43,39 61.989,40 69.508,41 41.103,42 38.61,43 1.6,44 4.071}
{0 CHEMBL472754,1 10.567,2 47.1,3 29.4,4 1.057,5 1.133,6 0.724,7 0.729,8 538.93,9 3.9,10 22,11 51,13 26,14 39,16 54,17 24,18 1,20 23,21 1,22 4,23 4,24 15,25 12,26 2,28 2,29 4,31 1,32 36,34 5,35 7.8,36 0.111,37 6,38 54,39 53.916,40 57.794,41 36.938,42 37.191,43 9.8,44 5}
{0 CHEMBL475152,1 10.215,2 47.1,3 31.4,4 1.047,5 1.127,6 0.725,7 0.722,8 520.94,9 3.9,10 22,11 51,13 26,14 38,16 54,17 24,18 1,20 23,21 1,22 4,23 3,24 16,25 11,26 2,28 2,29 4,31 1,32 35,34 4,35 7.8,36 0.111,37 6,38 53,39 53.403,40 57.454,41 37,42 36.808,43 7.8,44 5}
{0 CHEMBL475348,1 10.89,2 47.1,3 29.4,4 1.053,5 1.125,6 0.742,7 0.738,8 555.38,9 3.9,10 22,11 51,13 26,14 39,16 54,17 24,18 2,20 23,21 1,22 4,23 3,24 15,25 12,26 3,28 2,29 4,31 1,32 36,34 5,35 7.8,36 0.111,37 6,38 54,39 53.727,40 57.398,41 37.858,42 37.635,43 9.8,44 5.115}
{0 CHEMBL475349,1 10.89,2 47.1,3 29.4,4 1.053,5 1.125,6 0.742,7 0.738,8 555.38,9 3.9,10 22,11 51,13 26,14 39,16 54,17 24,18 2,20 23,21 1,22 4,23 3,24 15,25 12,26 3,28 2,29 4,31 1,32 36,34 5,35 7.8,36 0.111,37 6,38 54,39 53.727,40 57.398,41 37.858,42 37.635,43 9.8,44 5.032}
{0 CHEMBL479263,1 9.32,2 43.1,3 36.2,4 1.048,5 1.145,6 0.678,7 0.678,8 540.55,9 3.4,10 12,11 58,13 18,14 40,16 61,17 25,20 18,21 7,22 6,23 5,24 21,25 12,26 1,28 2,29 4,31 1,32 37,34 5,35 6.9,36 0.098,37 6,38 52,39 60.756,40 66.435,41 39.301,42 39.327,43 8.6,44 4.857}
{0 CHEMBL479664,1 9.01,2 43.1,3 37.9,4 1.039,5 1.14,6 0.679,7 0.671,8 522.56,9 3.4,10 12,11 58,13 18,14 39,16 61,17 25,20 18,21 7,22 6,23 4,24 22,25 11,26 1,28 2,29 4,31 1,32 36,34 4,35 6.9,36 0.098,37 6,38 51,39 60.243,40 66.095,41 39.364,42 38.944,43 6.9,44 5.638}
{0 CHEMBL483991,1 9.071,2 43.8,3 41.7,4 1.009,5 1.112,6 0.727,7 0.679,8 435.4,9 4.2,10 16,11 48,13 17,14 31,16 51,17 21,18 2,20 14,21 7,22 1,24 20,25 7,26 3,28 2,29 2,31 1,32 28,34 2,35 4.2,36 0.098,37 5,38 40,39 48.418,40 53.375,41 34.898,42 32.583,43 4.2,44 5.401}
{0 CHEMBL484778,1 9.071,2 43.8,3 41.7,4 1.009,5 1.112,6 0.727,7 0.679,8 435.4,9 4.2,10 16,11 48,13 17,14 31,16 51,17 21,18 2,20 14,21 7,22 1,24 20,25 7,26 3,28 2,29 2,31 1,32 28,34 2,35 4.2,36 0.098,37 5,38 40,39 48.418,40 53.375,41 34.898,42 32.583,43 4.2,44 5.135}
{0 CHEMBL489310,1 10.537,2 47.1,3 31.4,4 1.043,5 1.119,6 0.744,7 0.73,8 537.39,9 3.9,10 22,11 51,13 26,14 38,16 54,17 24,18 2,20 23,21 1,22 4,23 2,24 16,25 11,26 3,28 2,29 4,31 1,32 35,34 4,35 7.8,36 0.111,37 6,38 53,39 53.214,40 57.058,41 37.92,42 37.252,43 7.8,44 5.377}
{0 CHEMBL521609,1 9.098,2 49.1,3 35.1,4 1.025,5 1.116,6 0.719,7 0.704,8 518.57,9 3.5,10 27,11 57,13 31,14 41,16 61,17 28,20 27,21 1,22 4,23 2,24 20,25 9,26 1,28 2,29 4,31 1,32 37,34 2,35 7,36 0.098,37 6,38 58.5,39 58.451,40 63.586,41 40.966,42 40.124,43 3.5,44 4.903}
{0 CHEMBL521777,1 10.567,2 47.1,3 29.4,4 1.057,5 1.133,6 0.724,7 0.729,8 538.93,9 3.9,10 22,11 51,13 26,14 39,16 54,17 24,18 1,20 23,21 1,22 4,23 4,24 15,25 12,26 2,28 2,29 4,31 1,32 36,34 5,35 7.8,36 0.111,37 6,38 54,39 53.916,40 57.794,41 36.938,42 37.191,43 9.8,44 5}
{0 CHEMBL548,1 6.185,2 35.1,3 56.1,4 0.996,5 1.135,6 0.604,7 0.561,8 352.52,11 57,13 4,14 25,16 57,17 20,20 6,21 14,22 4,24 32,25 5,29 5,32 25,35 8.8,36 0.211,37 12,38 29,39 56.774,40 64.69,41 34.455,42 32.003,44 7.424}
{0 CHEMBL563480,1 9.895,2 43.2,3 36.4,4 1.022,5 1.117,6 0.741,7 0.706,8 435.36,9 9.1,10 17,11 44,13 18,14 31,16 47,17 19,18 2,20 15,21 4,22 1,24 16,25 9,26 3,28 4,29 2,31 1,32 28,34 2,35 4.5,36 0.085,37 4,38 40.5,39 44.971,40 49.126,41 32.625,42 31.045,43 4.5,44 5}
{0 CHEMBL563949,1 9.902,2 43.2,3 32.4,4 1.052,5 1.133,6 0.701,7 0.703,8 366.37,9 5.4,10 16,11 37,13 19,14 27,16 39,17 16,20 14,21 2,22 3,23 2,24 12,25 9,26 1,28 2,29 4,31 1,32 25,34 2,35 10.8,36 0.103,37 4,38 38,39 38.916,40 41.925,41 25.921,42 26.017,43 5.4,44 5}
{0 CHEMBL565591,1 11.847,2 46,3 30,4 1.042,5 1.106,6 0.798,7 0.76,8 592.34,9 4,10 21,11 50,13 25,14 38,16 53,17 23,18 4,20 21,21 2,22 4,23 1,24 15,25 12,26 6,28 2,29 3,31 2,32 35,34 5,35 6,36 0.113,37 6,38 52.5,39 52.098,40 55.317,41 39.892,42 37.996,43 10,44 5.38}
{0 CHEMBL565799,1 10.241,2 48.2,3 33.9,4 1.024,5 1.104,6 0.767,7 0.73,8 573.52,9 3.6,10 26,11 56,13 30,14 41,16 60,17 27,18 2,20 25,21 2,22 4,23 1,24 19,25 10,26 4,28 2,29 3,31 2,32 37,34 3,35 5.4,36 0.1,37 6,38 58,39 57.334,40 61.845,41 42.938,42 40.868,43 5.4,44 4.483}
{0 CHEMBL565992,1 12.289,2 43.5,3 28.3,4 1.049,5 1.106,6 0.802,7 0.767,8 565.3,9 6.5,10 21,11 46,13 24,14 36,16 49,17 20,18 4,20 18,21 2,22 3,24 13,25 13,26 6,28 3,29 4,31 2,32 33,34 4,35 8.7,36 0.143,37 7,38 49.5,39 48.247,40 50.855,41 36.892,42 35.295,43 8.7,44 5.316}
{0 CHEMBL585581,1 10.456,2 46.8,3 34,4 1.022,5 1.099,6 0.776,7 0.733,8 491.44,9 4.3,10 21,11 47,13 25,14 34,16 50,17 22,18 2,20 21,21 1,22 4,24 16,25 9,26 4,28 2,29 3,31 2,32 31,34 2,35 6.4,36 0.12,37 6,38 48.5,39 48.055,40 51.674,41 36.477,42 34.431,43 4.3,44 5}
{0 CHEMBL589973,1 9.086,2 40.6,3 40.6,4 1.027,5 1.12,6 0.695,7 0.668,8 581.51,9 3.1,10 18,11 64,13 22,14 40,16 66,17 26,18 2,20 20,21 6,22 4,24 26,25 12,26 3,28 2,29 7,31 1,32 38,34 2,35 10.9,36 0.182,37 12,38 53,39 65.705,40 71.668,41 44.455,42 42.737,43 3.1,44 4.357}
{0 CHEMBL591431,1 10.418,2 46.7,3 35.6,4 1.024,5 1.103,6 0.765,7 0.724,8 468.8,9 2.2,10 17,11 45,13 19,14 31,16 47,17 21,18 3,20 18,21 3,22 2,24 16,25 8,26 4,28 1,29 3,31 1,32 29,34 3,35 6.7,36 0.128,37 6,38 41.5,39 46.084,40 49.615,41 34.443,42 32.577,43 6.7,44 6.416}
{0 CHEMBL591666,1 8.997,2 47.8,3 37,4 1.026,5 1.116,6 0.706,7 0.692,8 413.85,9 2.2,10 18,11 46,13 20,14 31,16 48,17 22,18 1,20 20,21 2,22 2,23 1,24 17,25 7,26 1,28 1,29 4,32 29,34 2,35 8.7,36 0.125,37 6,38 42,39 47.2,40 51.356,41 32.472,42 31.833,43 4.3,44 6}
{0 CHEMBL597997,1 8.61,2 45.5,3 40,4 1.024,5 1.128,6 0.69,7 0.67,8 473.55,9 1.8,10 17,11 55,13 19,14 36,16 58,17 25,20 18,21 7,22 2,23 3,24 22,25 8,26 1,28 1,29 3,31 1,32 33,34 3,35 5.5,36 0.103,37 6,38 46.5,39 56.301,40 62.048,41 37.966,42 36.824,43 5.5,44 5.229}
{0 CHEMBL598198,1 8.73,2 43.9,3 38.6,4 1.023,5 1.137,6 0.694,7 0.674,8 497.59,9 8.8,10 22,11 57,13 23,14 39,16 61,17 25,20 18,21 7,22 1,23 3,24 22,25 10,26 1,28 5,29 1,31 1,32 35,34 3,35 1.8,36 0.098,37 6,38 51,39 58.287,40 64.792,41 39.557,42 38.427,43 5.3,44 4.537}
{0 CHEMBL599051,1 8.887,2 46.7,3 40,4 1.01,5 1.105,6 0.727,7 0.687,8 399.92,9 2.2,10 17,11 45,13 19,14 29,16 47,17 21,18 1,20 18,21 3,22 2,24 18,25 6,26 2,28 1,29 3,31 1,32 27,34 1,35 6.7,36 0.128,37 6,38 39.5,39 45.436,40 49.727,41 32.727,42 30.922,43 2.2,44 7.796}
{0 CHEMBL599052,1 10.418,2 46.7,3 35.6,4 1.024,5 1.103,6 0.765,7 0.724,8 468.8,9 2.2,10 17,11 45,13 19,14 31,16 47,17 21,18 3,20 18,21 3,22 2,24 16,25 8,26 4,28 1,29 3,31 1,32 29,34 3,35 6.7,36 0.128,37 6,38 41.5,39 46.084,40 49.615,41 34.443,42 32.577,43 6.7,44 6.127}
{0 CHEMBL599262,1 8.392,2 45.1,3 43.1,4 1.004,5 1.109,6 0.711,7 0.666,8 427.98,9 2,10 17,11 51,13 19,14 31,16 53,17 23,18 1,20 18,21 5,22 2,24 22,25 6,26 2,28 1,29 3,31 1,32 29,34 1,35 5.9,36 0.113,37 6,38 41.5,39 51.203,40 56.558,41 36.25,42 33.975,43 2,44 6.695}
{0 CHEMBL601299,1 10.828,2 47.6,3 33.3,4 1.029,5 1.1,6 0.778,7 0.739,8 454.77,9 2.4,10 17,11 42,13 19,14 30,16 44,17 20,18 3,20 18,21 2,22 2,24 14,25 8,26 4,28 1,29 3,31 1,32 28,34 3,35 7.1,36 0.136,37 6,38 40.5,39 43.2,40 46.2,41 32.682,42 31.05,43 7.1,44 7.367}
{0 CHEMBL603462,1 8.61,2 45.5,3 40,4 1.024,5 1.128,6 0.69,7 0.67,8 473.55,9 1.8,10 17,11 55,13 19,14 36,16 58,17 25,20 18,21 7,22 2,23 3,24 22,25 8,26 1,28 1,29 3,31 1,32 33,34 3,35 5.5,36 0.103,37 6,38 46.5,39 56.301,40 62.048,41 37.966,42 36.824,43 5.5,44 4.535}
{0 CHEMBL603690,1 8.547,2 44.4,3 40.7,4 1.024,5 1.131,6 0.685,7 0.663,8 461.54,9 1.9,10 17,11 54,13 19,14 34,16 56,17 24,20 18,21 6,22 2,23 3,24 22,25 8,26 1,28 1,29 3,31 1,32 32,34 3,35 5.6,36 0.107,37 6,38 44.5,39 55.301,40 61.048,41 36.966,42 35.824,43 5.6,44 5.923}
{0 CHEMBL604546,1 8.392,2 45.1,3 43.1,4 1.004,5 1.109,6 0.711,7 0.666,8 427.98,9 2,10 17,11 51,13 19,14 31,16 53,17 23,18 1,20 18,21 5,22 2,24 22,25 6,26 2,28 1,29 3,31 1,32 29,34 1,35 5.9,36 0.113,37 6,38 41.5,39 51.203,40 56.558,41 36.25,42 33.975,43 2,44 6.331}
{0 CHEMBL605330,1 8.547,2 44.4,3 40.7,4 1.024,5 1.131,6 0.685,7 0.663,8 461.54,9 1.9,10 17,11 54,13 19,14 34,16 56,17 24,20 18,21 6,22 2,23 3,24 22,25 8,26 1,28 1,29 3,31 1,32 32,34 3,35 5.6,36 0.107,37 6,38 44.5,39 55.301,40 61.048,41 36.966,42 35.824,43 5.6,44 6.097}
{0 CHEMBL64246,1 6.436,2 35.5,3 56.5,4 0.993,5 1.133,6 0.619,7 0.567,8 399.02,11 62,13 3,14 28,16 63,17 22,18 1,20 5,21 17,22 3,24 35,25 5,26 1,29 4,32 27,34 1,35 6.5,36 0.175,37 11,38 31,39 61.538,40 70.255,41 38.381,42 35.169,43 1.6,44 9.131}
{0 CHEMBL815,1 6.009,2 33.9,3 57.6,4 0.994,5 1.137,6 0.597,7 0.551,8 354.54,11 59,13 3,14 25,16 59,17 20,20 5,21 15,22 3,24 34,25 5,29 5,32 25,35 8.5,36 0.203,37 12,38 28,39 58.658,40 67.105,41 35.216,42 32.53,44 4}
{0 CHEMBL83450,1 9.166,2 49.2,3 37.7,4 1.006,5 1.098,6 0.753,7 0.708,8 559.14,9 3.3,10 28,11 61,13 32,14 42,16 65,17 30,18 1,20 28,21 2,22 4,24 23,25 8,26 3,28 2,29 3,31 2,32 38,34 1,35 4.9,36 0.123,37 8,38 60,39 61.382,40 66.976,41 45.904,42 43.184,43 1.6,44 4.796}
{0 CHEMBL83518,1 8.416,2 45.2,3 43.5,4 0.997,5 1.101,6 0.729,7 0.671,8 521.77,9 1.6,10 23,11 62,13 26,14 38,16 65,17 28,20 23,21 5,22 3,24 27,25 7,26 3,28 1,29 3,31 3,32 35,35 4.8,36 0.169,37 11,38 52.5,39 61.8,40 68.284,41 45.21,42 41.575,44 5.569}
{0 CHEMBL86799,1 7.383,2 47.1,3 47.1,4 0.987,5 1.104,6 0.7,7 0.646,8 376.55,10 18,11 51,13 19,14 29,16 53,17 24,20 19,21 5,22 1,24 24,25 3,26 1,29 2,31 1,32 27,35 3.9,36 0.17,37 9,38 39,39 50.334,40 56.321,41 35.694,42 32.938,44 6.854}
{0 CHEMBL86820,1 9.367,2 41.7,3 39.6,4 1.019,5 1.105,6 0.731,7 0.685,8 449.61,9 2.1,10 17,11 48,13 22,14 31,16 50,17 20,20 17,21 3,22 5,24 19,25 9,26 3,28 1,29 5,31 3,32 29,35 10.4,36 0.14,37 7,38 44.5,39 48.92,40 53.042,41 35.074,42 32.898,44 4}
{0 CHEMBL86886,1 8.606,2 45.8,3 42.4,4 0.999,5 1.099,6 0.736,7 0.679,8 507.74,9 1.7,10 23,11 59,13 26,14 37,16 62,17 27,20 23,21 4,22 3,24 25,25 7,26 3,28 1,29 3,31 3,32 34,35 5.1,36 0.161,37 10,38 51.5,39 58.916,40 64.869,41 43.449,42 40.049,44 6.229}
{0 CHEMBL86933,1 8.416,2 45.2,3 43.5,4 0.997,5 1.101,6 0.729,7 0.671,8 521.77,9 1.6,10 23,11 62,13 26,14 38,16 65,17 28,20 23,21 5,22 3,24 27,25 7,26 3,28 1,29 3,31 3,32 35,35 4.8,36 0.169,37 11,38 52.5,39 61.8,40 68.284,41 45.21,42 41.575,44 5.699}
{0 CHEMBL87263,1 8.117,2 43.9,3 43.9,4 1.004,5 1.109,6 0.701,7 0.657,8 535.73,9 1.5,10 23,11 66,13 26,14 40,16 69,17 29,20 23,21 6,22 3,24 29,25 8,26 2,28 1,29 5,31 2,32 37,35 7.6,36 0.174,37 12,38 54.5,39 66.262,40 73.198,41 46.233,42 43.345,44 5.538}
{0 CHEMBL87366,1 8.096,2 44.6,3 44.6,4 0.998,5 1.106,6 0.71,7 0.658,8 671.96,9 1.2,10 29,11 83,13 32,14 50,16 87,17 37,20 29,21 8,22 3,24 37,25 9,26 3,28 1,29 5,31 3,32 46,35 6,36 0.195,37 17,38 67.5,39 82.872,40 91.779,41 58.926,42 54.639,44 5.31}
{0 CHEMBL87371,1 10.959,2 47.5,3 32.5,4 1.027,5 1.094,6 0.793,7 0.747,8 438.37,9 2.5,10 17,11 40,13 21,14 29,16 42,17 19,18 2,20 19,22 4,24 13,25 8,26 4,28 1,29 3,31 2,32 27,34 2,35 7.5,36 0.119,37 5,38 41.5,39 41.069,40 43.761,41 31.71,42 29.883,43 5,44 4.569}
{0 CHEMBL87797,1 8.257,2 43.1,3 43.1,4 1.007,5 1.112,6 0.7,7 0.659,8 536.72,9 3.1,10 23,11 65,13 26,14 40,16 68,17 28,20 23,21 5,22 3,24 28,25 9,26 2,28 2,29 5,31 2,32 37,35 7.7,36 0.162,37 11,38 54.5,39 65.48,40 72.281,41 45.477,42 42.839,44 5.066}
{0 CHEMBL87816,1 8.402,2 43.8,3 42.2,4 1.011,5 1.109,6 0.702,7 0.665,8 537.7,9 1.6,10 23,11 64,13 26,14 40,16 67,17 28,20 23,21 5,22 3,24 27,25 9,26 2,28 1,29 6,31 2,32 37,35 9.4,36 0.179,37 12,38 54.5,39 64.705,40 70.992,41 44.926,42 42.533,44 5.678}
{0 CHEMBL87975,1 7.83,2 43.1,3 45.8,4 1,5 1.112,6 0.691,7 0.644,8 563.79,9 1.4,10 23,11 72,13 26,14 42,16 75,17 31,20 23,21 8,22 3,24 33,25 8,26 2,28 1,29 5,31 2,32 39,35 6.9,36 0.16,37 12,38 56.5,39 72.029,40 80.029,41 49.756,42 46.398,44 5.538}
{0 CHEMBL88154,1 7.672,2 44.6,3 44.6,4 0.999,5 1.115,6 0.688,7 0.649,8 567.76,9 4.1,10 24,11 74,13 28,14 45,16 78,17 33,20 26,21 7,22 4,24 33,25 8,26 1,28 3,29 4,31 1,32 41,35 5.4,36 0.077,37 6,38 61,39 73.945,40 82.481,41 50.904,42 48.012,44 4}
{0 CHEMBL90226,1 8.024,2 48,3 41.3,4 1.001,5 1.108,6 0.709,7 0.673,8 601.77,9 4,10 30,11 75,13 34,14 49,16 80,17 36,20 32,21 4,22 4,24 31,25 8,26 1,28 3,29 4,31 1,32 44,35 5.3,36 0.088,37 7,38 68,39 75.061,40 83.065,41 53.142,42 50.486,44 4}
{0 CHEMBL90227,1 7.905,2 48.7,3 42.1,4 0.998,5 1.105,6 0.709,7 0.671,8 600.78,9 2.6,10 30,11 76,13 34,14 49,16 81,17 37,20 32,21 5,22 4,24 32,25 7,26 1,28 2,29 4,31 1,32 44,35 5.3,36 0.099,37 8,38 68,39 75.843,40 83.982,41 53.898,42 50.991,44 4}
{0 CHEMBL90269,1 7.895,2 47.4,3 42.3,4 0.999,5 1.109,6 0.704,7 0.667,8 615.8,9 3.8,10 30,11 78,13 34,14 50,16 83,17 37,20 32,21 5,22 4,24 33,25 8,26 1,28 3,29 4,31 1,32 45,35 5.1,36 0.096,37 8,38 69,39 77.945,40 86.481,41 54.904,42 52.012,44 4}
{0 CHEMBL90491,1 7.905,2 48.7,3 42.1,4 0.998,5 1.105,6 0.709,7 0.671,8 600.78,9 2.6,10 30,11 76,13 34,14 49,16 81,17 37,20 32,21 5,22 4,24 32,25 7,26 1,28 2,29 4,31 1,32 44,35 5.3,36 0.086,37 7,38 68,39 75.843,40 83.982,41 53.898,42 50.991,44 4}
{0 CHEMBL90935,1 7.776,2 46.9,3 43.2,4 0.998,5 1.11,6 0.7,7 0.661,8 629.83,9 3.7,10 30,11 81,13 34,14 51,16 86,17 38,20 32,21 6,22 4,24 35,25 8,26 1,28 3,29 4,31 1,32 46,35 4.9,36 0.105,37 9,38 70,39 80.829,40 89.896,41 56.665,42 53.539,44 4}
{0 CHEMBL91063,1 8.145,2 48.6,3 40.5,4 1.004,5 1.105,6 0.711,7 0.678,8 602.75,9 2.7,10 30,11 74,13 34,14 49,16 79,17 36,20 32,21 4,22 4,24 30,25 8,26 1,28 2,29 5,31 1,32 44,35 6.8,36 0.101,37 8,38 68,39 74.287,40 81.776,41 52.591,42 50.179,44 4.959}
{0 CHEMBL91270,1 7.672,2 44.6,3 44.6,4 0.999,5 1.115,6 0.688,7 0.649,8 567.76,9 4.1,10 24,11 74,13 28,14 45,16 78,17 33,20 26,21 7,22 4,24 33,25 8,26 1,28 3,29 4,31 1,32 41,35 5.4,36 0.103,37 8,38 61,39 73.945,40 82.481,41 50.904,42 48.012,44 4}
{0 CHEMBL91301,1 7.757,2 48.4,3 42.9,4 0.996,5 1.107,6 0.705,7 0.666,8 705.93,9 3.3,10 36,11 91,13 40,14 58,16 97,17 44,20 38,21 6,22 4,24 39,25 8,26 1,28 3,29 4,31 1,32 52,35 4.4,36 0.103,37 10,38 80,39 90.596,40 100.726,41 64.188,42 60.593,44 4}
{0 CHEMBL91537,1 8.56,2 47.5,3 38.8,4 1.02,5 1.12,6 0.699,7 0.68,8 684.78,9 2.5,10 30,11 80,13 34,14 54,16 85,17 38,20 32,21 6,22 4,23 3,24 31,25 11,26 1,28 2,29 5,31 1,32 49,34 3,35 6.3,36 0.094,37 8,38 73,39 81.592,40 89.626,41 55.926,42 54.383,43 3.8,44 4.886}
{0 CHEMBL92539,1 7.776,2 46.9,3 43.2,4 0.998,5 1.11,6 0.7,7 0.661,8 629.83,9 3.7,10 30,11 81,13 34,14 51,16 86,17 38,20 32,21 6,22 4,24 35,25 8,26 1,28 3,29 4,31 1,32 46,35 4.9,36 0.093,37 8,38 70,39 80.829,40 89.896,41 56.665,42 53.539,44 4.638}
