"molecule_id","AMW","C.","H.","Me","Mi","Mp","Mv","MW","N.","nAB","nAT","nB","nBM","nBO","nBR","nBT","nC","nCL","nCsp","nCsp2","nCsp3","nDB","nF","nH","nHet","nHM","nI","nN","nO","nP","nS","nSK","nTB","nX","O.","RBF","RBN","SCBO","Se","Si","Sp","Sv","X.","pXC50"
{1 5.768,2 32.8,3 58.6,4 0.983,5 1.145,6 0.602,7 0.547,8 334.57,9 6.9,10 6,11 58,13 7,14 24,16 58,17 19,20 7,21 12,22 1,24 34,25 5,28 4,29 1,32 24,35 1.7,36 0.259,37 15,38 28,39 56.989,40 66.431,41 34.898,42 31.702,44 6.337}
{0 CHEMBL1098240,1 6.566,2 29.9,3 53.6,4 1.006,5 1.154,6 0.596,7 0.563,8 636.91,9 10.3,10 6,11 97,13 11,14 45,16 97,17 29,20 11,21 18,22 5,24 52,25 16,28 10,29 6,32 45,35 6.2,36 0.258,37 25,38 53,39 97.537,40 111.959,41 57.773,42 54.566,44 5.469}
{0 CHEMBL121388,1 10.158,2 30.4,3 34.8,4 1.069,5 1.153,6 0.651,7 0.667,8 233.63,9 13,11 23,13 4,14 15,16 23,17 7,18 1,20 5,21 2,22 4,24 8,25 8,26 1,28 3,29 4,32 15,34 1,35 17.4,36 0.13,37 3,38 19,39 24.589,40 26.522,41 14.977,42 15.331,43 4.3,44 7.432}
{0 CHEMBL1214647,1 11.234,2 52.3,3 34.1,4 1.01,5 1.097,6 0.781,7 0.732,8 494.3,9 4.5,10 18,11 44,13 22,14 32,16 47,17 23,20 23,22 4,24 15,25 6,26 1,27 1,28 2,29 3,32 29,34 1,35 6.8,36 0.085,37 4,38 45,39 44.44,40 48.252,41 34.364,42 32.192,43 2.3,44 4.638}
{0 CHEMBL1214648,1 8.137,2 51.1,3 38.3,4 1.005,5 1.105,6 0.712,7 0.689,8 382.44,9 4.3,10 18,11 47,13 22,14 32,16 50,17 24,20 23,21 1,22 4,24 18,25 5,28 2,29 3,32 29,35 6.4,36 0.08,37 4,38 45,39 47.254,40 51.946,41 33.466,42 32.402,44 4.678}
{0 CHEMBL1214713,1 8.987,2 50,3 32.6,4 1.027,5 1.109,6 0.714,7 0.713,8 413.41,9 6.5,10 18,11 46,13 24,14 34,16 49,17 23,20 23,22 6,24 15,25 8,28 3,29 5,32 31,35 10.9,36 0.102,37 5,38 49,39 47.244,40 51.033,41 32.858,42 32.799,44 4.495}
{0 CHEMBL1214715,1 8.987,2 50,3 32.6,4 1.027,5 1.109,6 0.714,7 0.713,8 413.41,9 6.5,10 18,11 46,13 24,14 34,16 49,17 23,20 23,22 6,24 15,25 8,28 3,29 5,32 31,35 10.9,36 0.102,37 5,38 49,39 47.244,40 51.033,41 32.858,42 32.799,44 5.222}
{0 CHEMBL1214716,1 8.987,2 50,3 32.6,4 1.027,5 1.109,6 0.714,7 0.713,8 413.41,9 6.5,10 18,11 46,13 24,14 34,16 49,17 23,20 23,22 6,24 15,25 8,28 3,29 5,32 31,35 10.9,36 0.102,37 5,38 49,39 47.244,40 51.033,41 32.858,42 32.799,44 5.301}
{0 CHEMBL1214719,1 8.369,2 54,3 36,4 1.005,5 1.099,6 0.729,7 0.708,8 418.47,9 4,10 23,11 50,13 27,14 36,16 54,17 27,20 27,22 4,24 18,25 5,28 2,29 3,32 32,35 6,36 0.074,37 4,38 51.5,39 50.254,40 54.946,41 36.466,42 35.402,44 4.086}
{0 CHEMBL1214795,1 8.135,2 52.5,3 37.5,4 0.998,5 1.105,6 0.726,7 0.698,8 325.39,9 7.5,10 18,11 40,13 21,14 28,16 43,17 21,20 21,22 3,24 15,25 4,28 3,29 1,32 25,35 2.5,36 0.07,37 3,38 40,39 39.934,40 44.196,41 29.04,42 27.94,44 4.131}
{0 CHEMBL1214868,1 10.821,2 51.2,3 37.2,4 0.997,5 1.101,6 0.778,7 0.716,8 465.31,9 7,10 18,11 43,13 21,14 30,16 46,17 22,20 21,21 1,22 3,24 16,25 5,26 1,27 1,28 3,29 1,32 27,34 1,35 2.3,36 0.065,37 3,38 42,39 42.887,40 47.331,41 33.461,42 30.783,43 2.3,44 4.081}
{0 CHEMBL1214934,1 8.373,2 52.3,3 36.4,4 1.008,5 1.103,6 0.721,7 0.702,8 368.41,9 4.5,10 18,11 44,13 22,14 31,16 47,17 23,20 23,22 4,24 16,25 5,28 2,29 3,32 28,35 6.8,36 0.085,37 4,38 44,39 44.371,40 48.531,41 31.705,42 30.875,44 4.602}
{0 CHEMBL1214936,1 8.301,2 50,3 37.5,4 1.012,5 1.107,6 0.707,7 0.69,8 398.44,9 4.2,10 18,11 48,13 22,14 33,16 51,17 24,20 23,21 1,22 4,24 18,25 6,28 2,29 4,32 30,35 8.3,36 0.098,37 5,38 46,39 48.582,40 53.156,41 33.921,42 33.116,44 4.569}
{0 CHEMBL1214937,1 8.301,2 50,3 37.5,4 1.012,5 1.107,6 0.707,7 0.69,8 398.44,9 4.2,10 18,11 48,13 22,14 33,16 51,17 24,20 23,21 1,22 4,24 18,25 6,28 2,29 4,32 30,35 8.3,36 0.098,37 5,38 46,39 48.582,40 53.156,41 33.921,42 33.116,44 4.42}
{0 CHEMBL1214940,1 11.518,2 51.2,3 32.6,4 1.015,5 1.101,6 0.782,7 0.737,8 495.29,9 7,10 18,11 43,13 22,14 32,16 46,17 22,20 22,22 4,24 14,25 7,26 1,27 1,28 3,29 3,32 29,34 1,35 7,36 0.087,37 4,38 45,39 43.658,40 47.335,41 33.608,42 31.686,43 2.3,44 4.215}
{0 CHEMBL1214941,1 11.518,2 51.2,3 32.6,4 1.015,5 1.101,6 0.782,7 0.737,8 495.29,9 7,10 18,11 43,13 22,14 32,16 46,17 22,20 22,22 4,24 14,25 7,26 1,27 1,28 3,29 3,32 29,34 1,35 7,36 0.087,37 4,38 45,39 43.658,40 47.335,41 33.608,42 31.686,43 2.3,44 4.194}
{0 CHEMBL1215004,1 9.285,2 51.1,3 31.9,4 1.038,5 1.127,6 0.708,7 0.714,8 436.41,9 4.3,10 18,11 47,13 22,14 35,16 50,17 24,20 23,21 1,22 4,23 3,24 15,25 8,28 2,29 3,32 32,34 3,35 6.4,36 0.08,37 4,38 48,39 48.792,40 52.966,41 33.279,42 33.552,43 6.4,44 4.658}
{0 CHEMBL1215007,1 8.499,2 48.9,3 36.2,4 1.017,5 1.111,6 0.706,7 0.694,8 399.43,9 6.4,10 18,11 47,13 23,14 33,16 50,17 23,20 22,21 1,22 5,24 17,25 7,28 3,29 4,32 30,35 8.5,36 0.1,37 5,38 47,39 47.8,40 52.239,41 33.165,42 32.611,44 4.854}
{0 CHEMBL1215079,1 8.542,2 51.1,3 35.6,4 1.016,5 1.105,6 0.715,7 0.702,8 384.41,9 4.4,10 18,11 45,13 22,14 32,16 48,17 23,20 23,22 4,24 16,25 6,28 2,29 4,32 29,35 8.9,36 0.083,37 4,38 45,39 45.698,40 49.741,41 32.159,42 31.59,44 4.62}
{0 CHEMBL1215082,1 8.137,2 51.1,3 38.3,4 1.005,5 1.105,6 0.712,7 0.689,8 382.44,9 4.3,10 18,11 47,13 22,14 32,16 50,17 24,20 23,21 1,22 4,24 18,25 5,28 2,29 3,32 29,35 6.4,36 0.08,37 4,38 45,39 47.254,40 51.946,41 33.466,42 32.402,44 4.208}
{0 CHEMBL1215155,1 9.736,2 50,3 30.4,4 1.034,5 1.108,6 0.733,7 0.731,8 447.85,9 6.5,10 18,11 46,13 24,14 35,16 49,17 23,18 1,20 23,22 6,24 14,25 9,26 1,28 3,29 5,32 32,34 1,35 10.9,36 0.102,37 5,38 50,39 47.567,40 50.977,41 33.716,42 33.627,43 2.2,44 5.155}
{0 CHEMBL1215156,1 9.736,2 50,3 30.4,4 1.034,5 1.108,6 0.733,7 0.731,8 447.85,9 6.5,10 18,11 46,13 24,14 35,16 49,17 23,18 1,20 23,22 6,24 14,25 9,26 1,28 3,29 5,32 32,34 1,35 10.9,36 0.102,37 5,38 50,39 47.567,40 50.977,41 33.716,42 33.627,43 2.2,44 4.387}
{0 CHEMBL1215157,1 9.736,2 50,3 30.4,4 1.034,5 1.108,6 0.733,7 0.731,8 447.85,9 6.5,10 18,11 46,13 24,14 35,16 49,17 23,18 1,20 23,22 6,24 14,25 9,26 1,28 3,29 5,32 32,34 1,35 10.9,36 0.102,37 5,38 50,39 47.567,40 50.977,41 33.716,42 33.627,43 2.2,44 4.06}
{0 CHEMBL1215226,1 9.378,2 50,3 30.4,4 1.038,5 1.117,6 0.713,7 0.721,8 431.4,9 6.5,10 18,11 46,13 24,14 35,16 49,17 23,20 23,22 6,23 1,24 14,25 9,28 3,29 5,32 32,34 1,35 10.9,36 0.102,37 5,38 50,39 47.756,40 51.373,41 32.796,42 33.182,43 2.2,44 5.155}
{0 CHEMBL1215227,1 10.702,2 50,3 30.4,4 1.032,5 1.106,6 0.744,7 0.735,8 492.3,9 6.5,10 18,11 46,13 24,14 35,15 1,16 49,17 23,20 23,22 6,24 14,25 9,26 1,28 3,29 5,32 32,34 1,35 10.9,36 0.102,37 5,38 50,39 47.473,40 50.875,41 34.21,42 33.824,43 2.2,44 5.097}
{0 CHEMBL1215290,1 11.724,2 50,3 30.4,4 1.029,5 1.103,6 0.772,7 0.742,8 539.3,9 6.5,10 18,11 46,13 24,14 35,16 49,17 23,20 23,22 6,24 14,25 9,26 1,27 1,28 3,29 5,32 32,34 1,35 10.9,36 0.102,37 5,38 50,39 47.313,40 50.754,41 35.517,42 34.116,43 2.2,44 4.509}
{0 CHEMBL1215291,1 8.723,2 49,3 34.7,4 1.023,5 1.111,6 0.707,7 0.701,8 427.44,9 6.1,10 18,11 49,13 24,14 35,16 52,17 24,20 23,21 1,22 6,24 17,25 8,28 3,29 5,32 32,35 10.2,36 0.096,37 5,38 50,39 50.127,40 54.448,41 34.619,42 34.326,44 4.569}
{0 CHEMBL1215364,1 9.136,2 48.9,3 31.9,4 1.033,5 1.112,6 0.709,7 0.713,8 429.41,9 6.4,10 18,11 47,13 24,14 35,16 50,17 23,20 23,22 6,24 15,25 9,28 3,29 6,32 32,35 12.8,36 0.1,37 5,38 50,39 48.571,40 52.243,41 33.313,42 33.514,44 4.018}
{0 CHEMBL1215365,1 8.741,2 51.8,3 33.9,4 1.018,5 1.105,6 0.721,7 0.712,8 489.51,9 5.4,10 24,11 56,13 30,14 41,16 60,17 29,20 29,22 6,24 19,25 8,28 3,29 5,32 37,35 8.9,36 0.1,37 6,38 59,39 57.011,40 61.864,41 40.381,42 39.853,44 5.301}
{0 CHEMBL1215366,1 8.913,2 51.9,3 32.7,4 1.022,5 1.105,6 0.723,7 0.718,8 463.47,9 5.8,10 23,11 52,13 29,14 39,16 56,17 27,20 27,22 6,24 17,25 8,28 3,29 5,32 35,35 9.6,36 0.089,37 5,38 56.5,39 53.127,40 57.448,41 37.619,42 37.326,44 5.398}
{0 CHEMBL1215441,1 8.282,2 47.3,3 38.2,4 1.016,5 1.114,6 0.693,7 0.68,8 455.5,9 5.5,10 18,11 55,13 24,14 37,16 58,17 26,20 23,21 3,22 6,24 21,25 8,28 3,29 5,32 34,35 9.1,36 0.121,37 7,38 52,39 55.894,40 61.279,41 38.142,42 37.379,44 4.301}
{0 CHEMBL1215580,1 8.453,2 48.1,3 37,4 1.021,5 1.111,6 0.696,7 0.687,8 456.48,9 3.7,10 18,11 54,13 23,14 37,16 57,17 26,20 24,21 2,22 5,24 20,25 8,28 2,29 6,32 34,35 11.1,36 0.123,37 7,38 51,39 55.12,40 59.99,41 37.591,42 37.073,44 4.387}
{0 CHEMBL1215799,1 8.987,2 50,3 32.6,4 1.027,5 1.109,6 0.714,7 0.713,8 413.41,9 6.5,10 18,11 46,13 24,14 34,16 49,17 23,20 23,22 6,24 15,25 8,28 3,29 5,32 31,35 10.9,36 0.102,37 5,38 49,39 47.244,40 51.033,41 32.858,42 32.799,44 4.495}
{0 CHEMBL1215801,1 11.724,2 50,3 30.4,4 1.029,5 1.103,6 0.772,7 0.742,8 539.3,9 6.5,10 18,11 46,13 24,14 35,16 49,17 23,20 23,22 6,24 14,25 9,26 1,27 1,28 3,29 5,32 32,34 1,35 10.9,36 0.102,37 5,38 50,39 47.313,40 50.754,41 35.517,42 34.116,43 2.2,44 4.678}
{0 CHEMBL121915,1 14.134,2 30.4,3 34.8,4 1.058,5 1.143,6 0.729,7 0.688,8 325.08,9 13,11 23,13 4,14 15,16 23,17 7,20 5,21 2,22 4,24 8,25 8,26 1,27 1,28 3,29 4,32 15,34 1,35 17.4,36 0.13,37 3,38 19,39 24.335,40 26.299,41 16.778,42 15.821,43 4.3,44 4.596}
{0 CHEMBL122005,1 8.66,2 30.4,3 39.1,4 1.055,5 1.156,6 0.614,7 0.631,8 199.19,9 13,11 23,13 4,14 14,16 23,17 7,20 5,21 2,22 4,24 9,25 7,28 3,29 4,32 14,35 17.4,36 0.13,37 3,38 18,39 24.265,40 26.578,41 14.119,42 14.504,44 4.939}
{0 CHEMBL123132,1 9.443,2 30.4,3 34.8,4 1.077,5 1.17,6 0.611,7 0.647,8 217.18,9 13,11 23,13 4,14 15,16 23,17 7,20 5,21 2,22 4,23 1,24 8,25 8,28 3,29 4,32 15,34 1,35 17.4,36 0.13,37 3,38 19,39 24.778,40 26.918,41 14.057,42 14.887,43 4.3,44 6.42}
{0 CHEMBL12442,1 8.568,2 32,3 40,4 1.055,5 1.148,6 0.613,7 0.629,8 214.2,9 8,10 5,11 25,13 7,14 15,16 25,17 8,20 5,21 3,22 2,24 10,25 7,28 2,29 5,32 15,35 20,36 0.16,37 4,38 19.5,39 26.375,40 28.704,41 15.329,42 15.724,44 5.959}
{0 CHEMBL13378,1 8.095,2 30.4,3 43.5,4 1.046,5 1.152,6 0.603,7 0.609,8 186.19,9 8.7,10 5,11 23,13 6,14 13,16 23,17 7,20 4,21 3,22 1,24 10,25 6,28 2,29 4,32 13,35 17.4,36 0.13,37 3,38 16.5,39 24.047,40 26.495,41 13.875,42 14.009,44 7.529}
{0 CHEMBL154535,1 8.77,2 33.3,3 38.1,4 1.055,5 1.147,6 0.624,7 0.642,8 184.17,9 9.5,10 5,11 21,13 6,14 14,16 22,17 7,20 4,21 3,22 1,24 8,25 6,28 2,29 4,32 13,35 19,36 0.045,37 1,38 17.5,39 22.164,40 24.08,41 13.114,42 13.482,44 4.082}
{0 CHEMBL154700,1 11.923,2 45.2,3 32.3,4 1.037,5 1.112,6 0.755,7 0.731,8 369.61,9 6.5,10 12,11 31,13 14,14 22,15 1,16 32,17 14,18 1,20 14,22 2,24 10,25 7,26 2,28 2,29 3,32 21,34 2,35 9.7,36 0.094,37 3,38 30,39 32.156,40 34.486,41 23.392,42 22.674,43 6.5,44 4}
{0 CHEMBL16117,1 6.051,2 31.9,3 56.9,4 0.992,5 1.147,6 0.599,7 0.552,8 435.69,9 6.9,10 6,11 72,13 8,14 31,16 72,17 23,20 8,21 15,22 2,24 41,25 8,28 5,29 3,32 31,35 4.2,36 0.25,37 18,38 36,39 71.396,40 82.593,41 43.097,42 39.734,44 5.553}
{0 CHEMBL1835336,1 9.315,2 35.3,3 38.2,4 1.053,5 1.138,6 0.652,7 0.656,8 316.72,9 5.9,10 6,11 34,13 10,14 21,16 34,17 12,18 1,20 8,21 4,22 4,24 13,25 9,26 1,28 2,29 6,32 21,34 1,35 17.6,36 0.206,37 7,38 28,39 35.793,40 38.688,41 22.165,42 22.32,43 2.9,44 5.163}
{0 CHEMBL193087,1 8.303,2 29.4,3 41.2,4 1.043,5 1.161,6 0.615,7 0.62,8 282.3,9 17.6,10 10,11 34,13 11,14 21,16 35,17 10,20 5,21 5,22 1,24 14,25 10,28 6,29 4,32 20,35 11.8,36 0.143,37 5,38 27,39 35.454,40 39.488,41 20.898,42 21.095,44 8}
{0 CHEMBL2092841,1 8.77,2 33.3,3 38.1,4 1.055,5 1.147,6 0.624,7 0.642,8 184.17,9 9.5,10 5,11 21,13 6,14 14,16 22,17 7,20 4,21 3,22 1,24 8,25 6,28 2,29 4,32 13,35 19,36 0.045,37 1,38 17.5,39 22.164,40 24.08,41 13.114,42 13.482,44 6.444}
{0 CHEMBL211749,1 6.01,2 32.9,3 57.1,4 0.99,5 1.144,6 0.601,7 0.553,8 420.67,9 5.7,10 6,11 70,13 8,14 30,16 70,17 23,20 8,21 15,22 2,24 40,25 7,28 4,29 3,32 30,35 4.3,36 0.243,37 17,38 35,39 69.294,40 80.095,41 42.091,42 38.712,44 7.454}
{0 CHEMBL212034,1 6.01,2 32.9,3 57.1,4 0.99,5 1.144,6 0.601,7 0.553,8 420.67,9 5.7,10 6,11 70,13 8,14 30,16 70,17 23,20 8,21 15,22 2,24 40,25 7,28 4,29 3,32 30,35 4.3,36 0.243,37 17,38 35,39 69.294,40 80.095,41 42.091,42 38.712,44 7.276}
{0 CHEMBL212557,1 5.858,2 32.9,3 58.2,4 0.987,5 1.144,6 0.6,7 0.548,8 462.76,9 5.1,10 6,11 79,13 8,14 33,16 79,17 26,20 8,21 18,22 2,24 46,25 7,28 4,29 3,32 33,35 3.8,36 0.253,37 20,38 38,39 77.945,40 90.341,41 47.376,42 43.293,44 5.638}
{0 CHEMBL213090,1 5.702,2 33,3 59.3,4 0.983,5 1.143,6 0.598,7 0.543,8 518.88,9 4.4,10 6,11 91,13 8,14 37,16 91,17 30,20 8,21 22,22 2,24 54,25 7,28 4,29 3,32 37,35 3.3,36 0.264,37 24,38 42,39 89.479,40 104.001,41 54.421,42 49.4,44 5.509}
{0 CHEMBL213091,1 6.135,2 32.8,3 56.3,4 0.993,5 1.145,6 0.603,7 0.557,8 392.61,9 6.3,10 6,11 64,13 8,14 28,16 64,17 21,20 8,21 13,22 2,24 36,25 7,28 4,29 3,32 28,35 4.7,36 0.234,37 15,38 33,39 63.527,40 73.265,41 38.569,42 35.659,44 6.682}
{0 CHEMBL213126,1 6.135,2 32.8,3 56.3,4 0.993,5 1.145,6 0.603,7 0.557,8 392.61,9 6.3,10 6,11 64,13 8,14 28,16 64,17 21,20 8,21 13,22 2,24 36,25 7,28 4,29 3,32 28,35 4.7,36 0.234,37 15,38 33,39 63.527,40 73.265,41 38.569,42 35.659,44 7.528}
{0 CHEMBL213186,1 5.955,2 32.9,3 57.5,4 0.989,5 1.144,6 0.601,7 0.551,8 434.7,9 5.5,10 6,11 73,13 8,14 31,16 73,17 24,20 8,21 16,22 2,24 42,25 7,28 4,29 3,32 31,35 4.1,36 0.247,37 18,38 36,39 72.178,40 83.51,41 43.853,42 40.239,44 7.42}
{0 CHEMBL213582,1 5.774,2 32.9,3 58.8,4 0.985,5 1.143,6 0.599,7 0.545,8 490.82,9 4.7,10 6,11 85,13 8,14 35,16 85,17 28,20 8,21 20,22 2,24 50,25 7,28 4,29 3,32 35,35 3.5,36 0.259,37 22,38 40,39 83.712,40 97.171,41 50.898,42 46.346,44 7.432}
{0 CHEMBL213645,1 5.955,2 32.9,3 57.5,4 0.989,5 1.144,6 0.601,7 0.551,8 434.7,9 5.5,10 6,11 73,13 8,14 31,16 73,17 24,20 8,21 16,22 2,24 42,25 7,28 4,29 3,32 31,35 4.1,36 0.247,37 18,38 36,39 72.178,40 83.51,41 43.853,42 40.239,44 6.775}
{0 CHEMBL213646,1 5.955,2 32.9,3 57.5,4 0.989,5 1.144,6 0.601,7 0.551,8 434.7,9 5.5,10 6,11 73,13 8,14 31,16 73,17 24,20 8,21 16,22 2,24 42,25 7,28 4,29 3,32 31,35 4.1,36 0.247,37 18,38 36,39 72.178,40 83.51,41 43.853,42 40.239,44 8.262}
{0 CHEMBL213885,1 5.815,2 32.9,3 58.5,4 0.986,5 1.143,6 0.599,7 0.547,8 476.79,9 4.9,10 6,11 82,13 8,14 34,16 82,17 27,20 8,21 19,22 2,24 48,25 7,28 4,29 3,32 34,35 3.7,36 0.256,37 21,38 39,39 80.828,40 93.756,41 49.137,42 44.82,44 7.114}
{0 CHEMBL214038,1 6.206,2 32.8,3 55.7,4 0.994,5 1.145,6 0.603,7 0.56,8 378.58,9 6.6,10 6,11 61,13 8,14 27,16 61,17 20,20 8,21 12,22 2,24 34,25 7,28 4,29 3,32 27,35 4.9,36 0.23,37 14,38 32,39 60.643,40 69.849,41 36.807,42 34.132,44 6.621}
{0 CHEMBL214086,1 6.069,2 32.8,3 56.7,4 0.991,5 1.144,6 0.602,7 0.555,8 406.64,9 6,10 6,11 67,13 8,14 29,16 67,17 22,20 8,21 14,22 2,24 38,25 7,28 4,29 3,32 29,35 4.5,36 0.239,37 16,38 34,39 66.41,40 76.68,41 40.33,42 37.186,44 7.527}
{0 CHEMBL214170,1 5.904,2 32.9,3 57.9,4 0.988,5 1.144,6 0.6,7 0.55,8 448.73,9 5.3,10 6,11 76,13 8,14 32,16 76,17 25,20 8,21 17,22 2,24 44,25 7,28 4,29 3,32 32,35 3.9,36 0.25,37 19,38 37,39 75.061,40 86.925,41 45.614,42 41.766,44 5.959}
{0 CHEMBL214206,1 5.774,2 32.9,3 58.8,4 0.985,5 1.143,6 0.599,7 0.545,8 490.82,9 4.7,10 6,11 85,13 8,14 35,16 85,17 28,20 8,21 20,22 2,24 50,25 7,28 4,29 3,32 35,35 3.5,36 0.259,37 22,38 40,39 83.712,40 97.171,41 50.898,42 46.346,44 5.921}
{0 CHEMBL214345,1 5.858,2 32.9,3 58.2,4 0.987,5 1.144,6 0.6,7 0.548,8 462.76,9 5.1,10 6,11 79,13 8,14 33,16 79,17 26,20 8,21 18,22 2,24 46,25 7,28 4,29 3,32 33,35 3.8,36 0.253,37 20,38 38,39 77.945,40 90.341,41 47.376,42 43.293,44 6.682}
{0 CHEMBL215794,1 5.955,2 32.9,3 57.5,4 0.989,5 1.144,6 0.601,7 0.551,8 434.7,9 5.5,10 6,11 73,13 8,14 31,16 73,17 24,20 8,21 16,22 2,24 42,25 7,28 4,29 3,32 31,35 4.1,36 0.247,37 18,38 36,39 72.178,40 83.51,41 43.853,42 40.239,44 6.456}
{0 CHEMBL2178917,1 6.716,2 30.3,3 52.5,4 1.009,5 1.153,6 0.598,7 0.568,8 664.92,9 10.1,10 6,11 99,13 12,14 47,16 99,17 30,20 12,21 18,22 6,24 52,25 17,28 10,29 7,32 47,35 7.1,36 0.253,37 25,38 56,39 99.865,40 114.168,41 59.228,42 56.28,44 6.863}
{0 CHEMBL2178918,1 6.837,2 30.2,3 51.7,4 1.012,5 1.154,6 0.599,7 0.572,8 793.07,9 10.3,10 6,11 116,13 14,14 56,16 116,17 35,20 14,21 21,22 8,24 60,25 21,28 12,29 9,32 56,35 7.8,36 0.25,37 29,38 67,39 117.374,40 133.829,41 69.432,42 66.333,44 5.967}
{0 CHEMBL2178919,1 6.437,2 32.6,3 53.9,4 0.998,5 1.148,6 0.608,7 0.568,8 572.85,9 9,10 10,11 89,13 14,14 42,16 90,17 29,20 12,21 17,22 4,24 48,25 12,28 8,29 4,32 41,35 4.5,36 0.256,37 23,38 51,39 88.796,40 102.128,41 54.092,42 50.566,44 7.569}
{0 CHEMBL2178920,1 6.543,2 32.2,3 53.3,4 1.001,5 1.148,6 0.606,7 0.57,8 588.85,9 8.9,10 10,11 90,13 14,14 43,16 91,17 29,20 12,21 17,22 4,24 48,25 13,28 8,29 5,32 42,35 5.6,36 0.253,37 23,38 52,39 90.123,40 103.337,41 54.546,42 51.281,44 7.292}
{0 CHEMBL22304,1 7.644,2 24.2,3 51.5,4 1.027,5 1.154,6 0.608,7 0.568,8 252.24,9 6.1,11 33,13 2,14 16,16 33,17 8,20 1,21 7,22 2,24 17,25 8,26 1,28 2,29 5,30 1,32 16,35 15.2,36 0.152,37 5,38 18,39 33.884,40 38.089,41 20.057,42 18.755,44 4}
{0 CHEMBL224688,1 11.284,2 44.1,3 35.3,4 1.031,5 1.115,6 0.74,7 0.712,8 383.64,9 5.9,10 12,11 34,13 14,14 23,15 1,16 35,17 15,18 1,20 14,21 1,22 2,24 12,25 7,26 2,28 2,29 3,32 22,34 2,35 8.8,36 0.114,37 4,38 31,39 35.04,40 37.902,41 25.154,42 24.201,43 5.9,44 4}
{0 CHEMBL224872,1 12.677,2 40.6,3 31.3,4 1.049,5 1.113,6 0.765,7 0.737,8 405.67,9 6.3,10 12,11 32,13 15,14 23,15 1,16 33,17 13,18 1,20 13,22 3,24 10,25 9,26 3,28 2,29 4,31 1,32 22,34 2,35 12.5,36 0.091,37 3,38 32,39 33.56,40 35.616,41 24.494,42 23.576,43 6.3,44 4}
{0 CHEMBL224926,1 11.929,2 42.4,3 30.3,4 1.035,5 1.128,6 0.757,7 0.736,8 393.65,9 18.2,10 17,11 33,13 18,14 25,15 1,16 35,17 14,18 1,20 14,22 1,24 10,25 9,26 2,28 6,29 1,32 23,34 2,35 3,36 0.086,37 3,38 34.5,39 34.142,40 37.23,41 24.983,42 24.276,43 6.1,44 4}
{0 CHEMBL2311573,1 6.484,2 32,3 53.6,4 0.999,5 1.15,6 0.607,7 0.568,8 628.93,9 10.3,10 10,11 97,13 15,14 46,16 98,17 31,20 13,21 18,22 5,24 52,25 14,28 10,29 4,32 45,35 4.1,36 0.245,37 24,38 56,39 96.883,40 111.54,41 58.864,42 55.136,44 7.244}
{0 CHEMBL2314712,1 6.666,2 34.3,3 52,4 1,5 1.144,6 0.618,7 0.582,8 679.97,9 8.8,10 16,11 102,13 20,14 51,16 104,17 35,20 18,21 17,22 4,24 53,25 14,28 9,29 5,32 49,35 4.9,36 0.221,37 23,38 63,39 101.992,40 116.666,41 63.075,42 59.356,44 7.553}
{0 CHEMBL2314713,1 6.641,2 31.6,3 52.6,4 1.003,5 1.151,6 0.606,7 0.572,8 630.9,9 10.5,10 11,11 95,13 15,14 46,16 96,17 30,20 13,21 17,22 4,24 50,25 15,28 10,29 5,32 45,35 5.3,36 0.24,37 23,38 55.5,39 95.327,40 109.334,41 57.557,42 54.324,44 7.284}
{0 CHEMBL2314714,1 6.626,2 30.9,3 53.2,4 1.007,5 1.151,6 0.598,7 0.566,8 622.87,9 8.5,10 6,11 94,13 11,14 44,16 94,17 29,20 11,21 18,22 5,24 50,25 15,28 8,29 7,32 44,35 7.4,36 0.255,37 24,38 52,39 94.661,40 108.171,41 56.216,42 53.238,44 6.332}
{0 CHEMBL2314715,1 6.343,2 31.2,3 54.8,4 0.998,5 1.151,6 0.601,7 0.56,8 589.89,9 9.7,10 6,11 93,13 11,14 42,16 93,17 29,20 11,21 18,22 5,24 51,25 13,28 9,29 4,32 42,35 4.3,36 0.258,37 24,38 50,39 92.781,40 107.042,41 55.859,42 52.115,44 7.027}
{0 CHEMBL2314716,1 6.446,2 30.9,3 54.3,4 1.001,5 1.152,6 0.599,7 0.562,8 605.89,9 9.6,10 6,11 94,13 11,14 43,16 94,17 29,20 11,21 18,22 5,24 51,25 14,28 9,29 5,32 43,35 5.3,36 0.255,37 24,38 51,39 94.108,40 108.251,41 56.313,42 52.829,44 7.076}
{0 CHEMBL2314717,1 6.446,2 30.9,3 54.3,4 1.001,5 1.152,6 0.599,7 0.562,8 605.89,9 9.6,10 6,11 94,13 11,14 43,16 94,17 29,20 11,21 18,22 5,24 51,25 14,28 9,29 5,32 43,35 5.3,36 0.255,37 24,38 51,39 94.108,40 108.251,41 56.313,42 52.829,44 7.432}
{0 CHEMBL2314718,1 6.666,2 34.3,3 52,4 1,5 1.144,6 0.618,7 0.582,8 679.97,9 8.8,10 16,11 102,13 20,14 51,16 104,17 35,20 18,21 17,22 4,24 53,25 14,28 9,29 5,32 49,35 4.9,36 0.221,37 23,38 63,39 101.992,40 116.666,41 63.075,42 59.356,44 7.77}
{0 CHEMBL2314719,1 6.641,2 31.6,3 52.6,4 1.003,5 1.151,6 0.606,7 0.572,8 630.9,9 10.5,10 11,11 95,13 15,14 46,16 96,17 30,20 13,21 17,22 4,24 50,25 15,28 10,29 5,32 45,35 5.3,36 0.24,37 23,38 55.5,39 95.327,40 109.334,41 57.557,42 54.324,44 7.367}
{0 CHEMBL2314927,1 6.626,2 30.9,3 53.2,4 1.007,5 1.151,6 0.598,7 0.566,8 622.87,9 8.5,10 6,11 94,13 11,14 44,16 94,17 29,20 11,21 18,22 5,24 50,25 15,28 8,29 7,32 44,35 7.4,36 0.255,37 24,38 52,39 94.661,40 108.171,41 56.216,42 53.238,44 6.777}
{0 CHEMBL2314928,1 6.419,2 30.7,3 54.5,4 1.001,5 1.152,6 0.597,7 0.56,8 564.83,9 9.1,10 6,11 88,13 10,14 40,16 88,17 27,20 10,21 17,22 4,24 48,25 13,28 8,29 5,32 40,35 5.7,36 0.25,37 22,38 47,39 88.123,40 101.337,41 52.546,42 49.281,44 6.979}
{0 CHEMBL2314929,1 6.446,2 30.9,3 54.3,4 1.001,5 1.152,6 0.599,7 0.562,8 605.89,9 9.6,10 6,11 94,13 11,14 43,16 94,17 29,20 11,21 18,22 5,24 51,25 14,28 9,29 5,32 43,35 5.3,36 0.255,37 24,38 51,39 94.108,40 108.251,41 56.313,42 52.829,44 7.018}
{0 CHEMBL2314930,1 6.343,2 31.2,3 54.8,4 0.998,5 1.151,6 0.601,7 0.56,8 589.89,9 9.7,10 6,11 93,13 11,14 42,16 93,17 29,20 11,21 18,22 5,24 51,25 13,28 9,29 4,32 42,35 4.3,36 0.258,37 24,38 50,39 92.781,40 107.042,41 55.859,42 52.115,44 6.907}
{0 CHEMBL2314931,1 6.446,2 30.9,3 54.3,4 1.001,5 1.152,6 0.599,7 0.562,8 605.89,9 9.6,10 6,11 94,13 11,14 43,16 94,17 29,20 11,21 18,22 5,24 51,25 14,28 9,29 5,32 43,35 5.3,36 0.255,37 24,38 51,39 94.108,40 108.251,41 56.313,42 52.829,44 7.114}
{0 CHEMBL2314932,1 6.489,2 30.6,3 54.1,4 1.003,5 1.152,6 0.597,7 0.562,8 635.92,9 9.2,10 6,11 98,13 11,14 45,16 98,17 30,20 11,21 19,22 5,24 53,25 15,28 9,29 6,32 45,35 6.1,36 0.255,37 25,38 53,39 98.319,40 112.876,41 58.529,42 55.071,44 6.767}
{0 CHEMBL2314933,1 6.489,2 30.6,3 54.1,4 1.003,5 1.152,6 0.597,7 0.562,8 635.92,9 9.2,10 6,11 98,13 11,14 45,16 98,17 30,20 11,21 19,22 5,24 53,25 15,28 9,29 6,32 45,35 6.1,36 0.255,37 25,38 53,39 98.319,40 112.876,41 58.529,42 55.071,44 7.721}
{0 CHEMBL2314934,1 6.419,2 30.7,3 54.5,4 1.001,5 1.152,6 0.597,7 0.56,8 564.83,9 9.1,10 6,11 88,13 10,14 40,16 88,17 27,20 10,21 17,22 4,24 48,25 13,28 8,29 5,32 40,35 5.7,36 0.25,37 22,38 47,39 88.123,40 101.337,41 52.546,42 49.281,44 7.208}
{0 CHEMBL2314935,1 6.489,2 30.6,3 54.1,4 1.003,5 1.152,6 0.597,7 0.562,8 635.92,9 9.2,10 6,11 98,13 11,14 45,16 98,17 30,20 11,21 19,22 5,24 53,25 15,28 9,29 6,32 45,35 6.1,36 0.255,37 25,38 53,39 98.319,40 112.876,41 58.529,42 55.071,44 7.337}
{0 CHEMBL2314936,1 6.489,2 30.6,3 54.1,4 1.003,5 1.152,6 0.597,7 0.562,8 635.92,9 9.2,10 6,11 98,13 11,14 45,16 98,17 30,20 11,21 19,22 5,24 53,25 15,28 9,29 6,32 45,35 6.1,36 0.255,37 25,38 53,39 98.319,40 112.876,41 58.529,42 55.071,44 7.108}
{0 CHEMBL2314937,1 6.489,2 30.6,3 54.1,4 1.003,5 1.152,6 0.597,7 0.562,8 635.92,9 9.2,10 6,11 98,13 11,14 45,16 98,17 30,20 11,21 19,22 5,24 53,25 15,28 9,29 6,32 45,35 6.1,36 0.255,37 25,38 53,39 98.319,40 112.876,41 58.529,42 55.071,44 6.928}
{0 CHEMBL2314938,1 6.489,2 30.6,3 54.1,4 1.003,5 1.152,6 0.597,7 0.562,8 635.92,9 9.2,10 6,11 98,13 11,14 45,16 98,17 30,20 11,21 19,22 5,24 53,25 15,28 9,29 6,32 45,35 6.1,36 0.255,37 25,38 53,39 98.319,40 112.876,41 58.529,42 55.071,44 7.081}
{0 CHEMBL2314939,1 6.489,2 30.6,3 54.1,4 1.003,5 1.152,6 0.597,7 0.562,8 635.92,9 9.2,10 6,11 98,13 11,14 45,16 98,17 30,20 11,21 19,22 5,24 53,25 15,28 9,29 6,32 45,35 6.1,36 0.255,37 25,38 53,39 98.319,40 112.876,41 58.529,42 55.071,44 6.343}
{0 CHEMBL2314940,1 6.484,2 32,3 53.6,4 0.999,5 1.15,6 0.607,7 0.568,8 628.93,9 10.3,10 10,11 97,13 15,14 46,16 98,17 31,20 13,21 18,22 5,24 52,25 14,28 10,29 4,32 45,35 4.1,36 0.245,37 24,38 56,39 96.883,40 111.54,41 58.864,42 55.136,44 7.092}
{0 CHEMBL260328,1 8.429,2 26.3,3 42.1,4 1.061,5 1.162,6 0.585,7 0.604,8 160.15,9 10.5,11 19,13 2,14 11,16 19,17 5,20 2,21 3,22 2,24 8,25 6,28 2,29 4,32 11,35 21.1,36 0.105,37 2,38 13,39 20.164,40 22.08,41 11.114,42 11.482,44 3.94}
{0 CHEMBL27130,1 7.134,2 31.3,3 50,4 1.022,5 1.148,6 0.599,7 0.581,8 228.28,9 6.3,10 5,11 32,13 6,14 16,16 32,17 10,20 4,21 6,22 1,24 16,25 6,28 2,29 4,32 16,35 12.5,36 0.125,37 4,38 19.5,39 32.698,40 36.741,41 19.159,42 18.59,44 4.208}
{0 CHEMBL274440,1 7.507,2 23.3,3 53.3,4 1.026,5 1.153,6 0.602,7 0.558,8 225.21,9 3.3,11 30,13 2,14 13,16 29,17 7,20 1,21 6,22 2,24 16,25 7,26 1,28 1,29 5,30 1,32 14,35 16.7,36 0.241,37 7,38 15,39 30.782,40 34.591,41 18.051,42 16.734,44 4}
{0 CHEMBL275040,1 7.109,2 33.3,3 50,4 1.02,5 1.141,6 0.605,7 0.586,8 213.26,9 3.3,11 30,13 3,14 15,16 30,17 10,20 4,21 6,22 3,24 15,25 5,28 1,29 4,32 15,35 13.3,36 0.133,37 4,38 18,39 30.596,40 34.242,41 18.154,42 17.568,44 4.604}
{0 CHEMBL276815,1 8.095,2 30.4,3 43.5,4 1.046,5 1.152,6 0.603,7 0.609,8 186.19,9 8.7,10 5,11 23,13 6,14 13,16 23,17 7,20 4,21 3,22 1,24 10,25 6,28 2,29 4,32 13,35 17.4,36 0.13,37 3,38 16.5,39 24.047,40 26.495,41 13.875,42 14.009,44 7.658}
{0 CHEMBL28472,1 7.686,2 35.5,3 45.2,4 1.026,5 1.14,6 0.626,7 0.615,8 238.27,9 6.5,10 5,11 31,13 7,14 18,16 32,17 11,20 6,21 5,22 2,24 14,25 6,28 2,29 4,32 17,35 12.9,36 0.094,37 3,38 22.5,39 31.814,40 35.325,41 19.398,42 19.063,44 4.495}
{0 CHEMBL288166,1 7.326,2 27.3,3 50,4 1.038,5 1.155,6 0.574,7 0.569,8 161.18,9 4.5,11 22,13 2,14 10,16 21,17 6,20 2,21 4,22 2,24 11,25 5,28 1,29 4,32 11,35 18.2,36 0.19,37 4,38 12,39 22.829,40 25.412,41 12.631,42 12.515,44 4}
{0 CHEMBL28862,1 8.215,2 20.8,3 50,4 1.042,5 1.157,6 0.605,7 0.57,8 197.15,9 4.2,11 24,13 2,14 11,16 23,17 5,20 1,21 4,22 2,24 12,25 7,26 1,28 1,29 5,30 1,32 12,35 20.8,36 0.217,37 5,38 13,39 25.015,40 27.76,41 14.528,42 13.68,44 4}
{0 CHEMBL289439,1 7.326,2 27.3,3 50,4 1.038,5 1.155,6 0.574,7 0.569,8 161.18,9 4.5,11 22,13 2,14 10,16 21,17 6,20 2,21 4,22 2,24 11,25 5,28 1,29 4,32 11,35 18.2,36 0.19,37 4,38 12,39 22.829,40 25.412,41 12.631,42 12.515,44 5}
{0 CHEMBL30285,1 9.302,2 29.4,3 35.3,4 1.075,5 1.157,6 0.609,7 0.644,8 158.13,9 11.8,10 5,11 17,13 6,14 11,16 17,17 5,20 4,21 1,22 1,24 6,25 6,28 2,29 4,32 11,35 23.5,36 0.118,37 2,38 14.5,39 18.28,40 19.665,41 10.352,42 10.956,44 4}
{0 CHEMBL313747,1 6.504,2 31,3 54,4 1.004,5 1.15,6 0.598,7 0.563,8 565.81,9 8,10 6,11 87,13 10,14 40,16 87,17 27,20 10,21 17,22 4,24 47,25 13,28 7,29 6,32 40,35 6.9,36 0.264,37 23,38 47,39 87.348,40 100.049,41 51.995,42 48.975,44 7.187}
{0 CHEMBL333964,1 12.09,2 30.4,3 34.8,4 1.065,5 1.149,6 0.673,7 0.675,8 278.08,9 13,11 23,13 4,14 15,15 1,16 23,17 7,20 5,21 2,22 4,24 8,25 8,26 1,28 3,29 4,32 15,34 1,35 17.4,36 0.13,37 3,38 19,39 24.495,40 26.42,41 15.472,42 15.529,43 4.3,44 5.553}
{0 CHEMBL337577,1 7.975,2 33.3,3 43.3,4 1.034,5 1.147,6 0.621,7 0.619,8 239.26,9 10,11 30,13 4,14 18,16 31,17 10,20 5,21 5,22 4,24 13,25 7,28 3,29 4,32 17,35 13.3,36 0.097,37 3,38 22,39 31.033,40 34.409,41 18.642,42 18.557,44 4.604}
{0 CHEMBL346524,1 9.21,2 48.6,3 35.1,4 1.022,5 1.11,6 0.724,7 0.707,8 340.78,9 5.4,10 17,11 37,13 19,14 26,16 39,17 18,18 1,20 18,22 2,24 13,25 6,26 1,28 2,29 3,32 24,34 1,35 8.1,36 0.077,37 3,38 36.5,39 37.811,40 41.06,41 26.801,42 26.176,43 2.7,44 4}
{0 CHEMBL366489,1 8.66,2 30.4,3 39.1,4 1.055,5 1.156,6 0.614,7 0.631,8 199.19,9 13,11 23,13 4,14 14,16 23,17 7,20 5,21 2,22 4,24 9,25 7,28 3,29 4,32 14,35 17.4,36 0.13,37 3,38 18,39 24.265,40 26.578,41 14.119,42 14.504,44 6.387}
{0 CHEMBL370941,1 8.654,2 29,3 38.7,4 1.051,5 1.164,6 0.617,7 0.631,8 268.27,9 19.4,10 10,11 31,13 11,14 20,16 32,17 9,20 5,21 4,22 1,24 12,25 10,28 6,29 4,32 19,35 12.9,36 0.156,37 5,38 26,39 32.571,40 36.073,41 19.136,42 19.568,44 9.824}
{0 CHEMBL372643,1 8.303,2 29.4,3 41.2,4 1.043,5 1.161,6 0.615,7 0.62,8 282.3,9 17.6,10 10,11 34,13 11,14 21,16 35,17 10,20 5,21 5,22 1,24 14,25 10,28 6,29 4,32 20,35 11.8,36 0.171,37 6,38 27,39 35.454,40 39.488,41 20.898,42 21.095,44 8.284}
{0 CHEMBL377919,1 5.904,2 32.9,3 57.9,4 0.988,5 1.144,6 0.6,7 0.55,8 448.73,9 5.3,10 6,11 76,13 8,14 32,16 76,17 25,20 8,21 17,22 2,24 44,25 7,28 4,29 3,32 32,35 3.9,36 0.25,37 19,38 37,39 75.061,40 86.925,41 45.614,42 41.766,44 6.164}
{0 CHEMBL378911,1 6.069,2 32.8,3 56.7,4 0.991,5 1.144,6 0.602,7 0.555,8 406.64,9 6,10 6,11 67,13 8,14 29,16 67,17 22,20 8,21 14,22 2,24 38,25 7,28 4,29 3,32 29,35 4.5,36 0.239,37 16,38 34,39 66.41,40 76.68,41 40.33,42 37.186,44 6.9}
{0 CHEMBL379587,1 5.955,2 32.9,3 57.5,4 0.989,5 1.144,6 0.601,7 0.551,8 434.7,9 5.5,10 6,11 73,13 8,14 31,16 73,17 24,20 8,21 16,22 2,24 42,25 7,28 4,29 3,32 31,35 4.1,36 0.247,37 18,38 36,39 72.178,40 83.51,41 43.853,42 40.239,44 6.387}
{0 CHEMBL384736,1 5.815,2 32.9,3 58.5,4 0.986,5 1.143,6 0.599,7 0.547,8 476.79,9 4.9,10 6,11 82,13 8,14 34,16 82,17 27,20 8,21 19,22 2,24 48,25 7,28 4,29 3,32 34,35 3.7,36 0.256,37 21,38 39,39 80.828,40 93.756,41 49.137,42 44.82,44 5.301}
{0 CHEMBL385474,1 5.955,2 32.9,3 57.5,4 0.989,5 1.144,6 0.601,7 0.551,8 434.7,9 5.5,10 6,11 73,13 8,14 31,16 73,17 24,20 8,21 16,22 2,24 42,25 7,28 4,29 3,32 31,35 4.1,36 0.247,37 18,38 36,39 72.178,40 83.51,41 43.853,42 40.239,44 7.187}
{0 CHEMBL387549,1 12.048,2 44.1,3 29.4,4 1.043,5 1.12,6 0.754,7 0.741,8 409.64,9 11.8,10 17,11 34,13 18,14 26,15 1,16 36,17 15,18 1,20 15,22 1,24 10,25 9,26 2,28 4,29 3,32 24,34 2,35 8.8,36 0.083,37 3,38 35.5,39 35.476,40 38.068,41 25.642,42 25.19,43 5.9,44 4}
{0 CHEMBL388746,1 8.693,2 36.8,3 36.8,4 1.038,5 1.144,6 0.655,7 0.66,8 330.34,9 15.8,10 16,11 38,13 17,14 26,16 40,17 14,20 11,21 3,22 1,24 14,25 10,28 6,29 4,32 24,35 10.5,36 0.15,37 6,38 35,39 39.454,40 43.488,41 24.898,42 25.095,44 8.114}
{0 CHEMBL39664,1 7.971,2 25,3 50,4 1.032,5 1.149,6 0.617,7 0.579,8 223.19,9 3.6,11 28,13 2,14 14,16 28,17 7,20 1,21 6,22 2,24 14,25 7,26 1,28 1,29 5,30 1,32 14,35 17.9,36 0.107,37 3,38 16,39 28.898,40 32.175,41 17.29,42 16.207,44 4}
{0 CHEMBL400566,1 8.542,2 51.1,3 35.6,4 1.016,5 1.105,6 0.715,7 0.702,8 384.41,9 4.4,10 18,11 45,13 22,14 32,16 48,17 23,20 23,22 4,24 16,25 6,28 2,29 4,32 29,35 8.9,36 0.083,37 4,38 45,39 45.698,40 49.741,41 32.159,42 31.59,44 4.444}
{0 CHEMBL41221,1 7.326,2 27.3,3 50,4 1.038,5 1.155,6 0.574,7 0.569,8 161.18,9 4.5,11 22,13 2,14 10,16 21,17 6,20 2,21 4,22 2,24 11,25 5,28 1,29 4,32 11,35 18.2,36 0.19,37 4,38 12,39 22.829,40 25.412,41 12.631,42 12.515,44 5}
{0 CHEMBL425614,1 5.955,2 32.9,3 57.5,4 0.989,5 1.144,6 0.601,7 0.551,8 434.7,9 5.5,10 6,11 73,13 8,14 31,16 73,17 24,20 8,21 16,22 2,24 42,25 7,28 4,29 3,32 31,35 4.1,36 0.247,37 18,38 36,39 72.178,40 83.51,41 43.853,42 40.239,44 6.33}
{0 CHEMBL431029,1 9.18,2 21.7,3 43.5,4 1.063,5 1.155,6 0.618,7 0.603,8 211.13,9 4.3,11 23,13 3,14 12,16 22,17 5,20 2,21 3,22 3,24 10,25 8,26 1,28 1,29 6,30 1,32 13,35 26.1,36 0.227,37 5,38 15,39 24.458,40 26.554,41 14.221,42 13.868,44 4}
{0 CHEMBL449296,1 12.09,2 30.4,3 34.8,4 1.065,5 1.149,6 0.673,7 0.675,8 278.08,9 13,11 23,13 4,14 15,15 1,16 23,17 7,20 5,21 2,22 4,24 8,25 8,26 1,28 3,29 4,32 15,34 1,35 17.4,36 0.13,37 3,38 19,39 24.495,40 26.42,41 15.472,42 15.529,43 4.3,44 7.456}
{0 CHEMBL492469,1 9.189,2 32.1,3 39.3,4 1.044,5 1.14,6 0.662,7 0.651,8 257.3,9 10.7,11 28,13 4,14 18,16 29,17 9,20 5,21 4,22 4,24 11,25 8,26 1,28 3,29 4,31 1,32 17,35 14.3,36 0.103,37 3,38 22,39 29.225,40 31.913,41 18.528,42 18.218,44 4.928}
{0 CHEMBL492628,1 7.541,2 31.9,3 46.8,4 1.028,5 1.149,6 0.609,7 0.598,8 354.41,9 8.5,11 47,13 5,14 26,16 48,17 15,20 6,21 9,22 5,24 22,25 10,28 4,29 6,32 25,35 12.8,36 0.167,37 8,38 31,39 48.323,40 53.986,41 28.602,42 28.116,44 4}
{0 CHEMBL492629,1 7.426,2 33.3,3 47.2,4 1.022,5 1.146,6 0.616,7 0.6,8 267.32,9 8.3,11 36,13 4,14 20,16 37,17 12,20 5,21 7,22 4,24 17,25 7,28 3,29 4,32 19,35 11.1,36 0.081,37 3,38 24,39 36.8,40 41.239,41 22.165,42 21.611,44 6.991}
{0 CHEMBL492630,1 9.818,2 34.6,3 34.6,4 1.052,5 1.135,6 0.683,7 0.68,8 255.28,9 11.5,10 5,11 26,13 8,14 18,16 27,17 9,20 7,21 2,22 3,24 9,25 8,26 1,28 3,29 4,31 1,32 17,35 15.4,36 0.111,37 3,38 23.5,39 27.342,40 29.498,41 17.767,42 17.691,44 5.143}
{0 CHEMBL493596,1 7.975,2 33.3,3 43.3,4 1.034,5 1.147,6 0.621,7 0.619,8 239.26,9 10,11 30,13 4,14 18,16 31,17 10,20 5,21 5,22 4,24 13,25 7,28 3,29 4,32 17,35 13.3,36 0.097,37 3,38 22,39 31.033,40 34.409,41 18.642,42 18.557,44 4.983}
{0 CHEMBL493665,1 7.675,2 33.3,3 45.5,4 1.028,5 1.146,6 0.618,7 0.609,8 253.29,9 9.1,11 33,13 4,14 19,16 34,17 11,20 5,21 6,22 4,24 15,25 7,28 3,29 4,32 18,35 12.1,36 0.118,37 4,38 23,39 33.916,40 37.824,41 20.404,42 20.084,44 4}
{0 CHEMBL493892,1 9.2,2 34.6,3 34.6,4 1.061,5 1.146,6 0.637,7 0.662,8 239.21,9 11.5,10 5,11 26,13 8,14 18,16 27,17 9,20 7,21 2,22 3,24 9,25 8,28 3,29 5,32 17,35 19.2,36 0.111,37 3,38 23.5,39 27.593,40 29.788,41 16.574,42 17.219,44 4.453}
{0 CHEMBL508818,1 8.595,2 37.9,3 37.9,4 1.04,5 1.138,6 0.651,7 0.656,8 249.25,9 10.3,10 6,11 29,13 9,14 19,16 30,17 11,20 9,21 2,22 3,24 11,25 7,28 3,29 4,32 18,35 13.8,36 0.1,37 3,38 25,39 30.149,40 32.993,41 18.881,42 19.031,44 5.622}
{0 CHEMBL553028,1 7.421,2 35.3,3 47.1,4 1.021,5 1.139,6 0.622,7 0.606,8 252.3,9 5.9,10 5,11 34,13 7,14 19,16 35,17 12,20 6,21 6,22 2,24 16,25 6,28 2,29 4,32 18,35 11.8,36 0.086,37 3,38 23.5,39 34.698,40 38.741,41 21.159,42 20.59,44 4.2}
{0 CHEMBL575060,1 7.745,2 26.3,3 47.4,4 1.05,5 1.158,6 0.572,7 0.578,8 147.15,9 5.3,11 19,13 2,14 9,16 18,17 5,20 2,21 3,22 2,24 9,25 5,28 1,29 4,32 10,35 21.1,36 0.222,37 4,38 11,39 19.945,40 21.997,41 10.869,42 10.988,44 4.456}
{0 CHEMBL72366,1 10.33,2 30,3 35,4 1.074,5 1.151,6 0.649,7 0.665,8 206.6,9 10,10 5,11 20,13 6,14 13,16 20,17 6,18 1,20 4,21 2,22 1,24 7,25 7,26 1,28 2,29 4,32 13,34 1,35 20,36 0.15,37 3,38 16.5,39 21.487,40 23.024,41 12.972,42 13.31,43 5,44 6.772}
{0 CHEMBL73698,1 12.553,2 30,3 35,4 1.07,5 1.146,6 0.673,7 0.675,8 251.05,9 10,10 5,11 20,13 6,14 13,15 1,16 20,17 6,20 4,21 2,22 1,24 7,25 7,26 1,28 2,29 4,32 13,34 1,35 20,36 0.15,37 3,38 16.5,39 21.393,40 22.921,41 13.466,42 13.508,43 5,44 6.187}
{0 CHEMBL85447,1 7.326,2 27.3,3 50,4 1.038,5 1.155,6 0.574,7 0.569,8 161.18,9 4.5,11 22,13 2,14 10,16 21,17 6,20 2,21 4,22 2,24 11,25 5,28 1,29 4,32 11,35 18.2,36 0.19,37 4,38 12,39 22.829,40 25.412,41 12.631,42 12.515,44 4}
