"molecule_id","FCFP4_1024b1","FCFP4_1024b10","FCFP4_1024b100","FCFP4_1024b1000","FCFP4_1024b1001","FCFP4_1024b1002","FCFP4_1024b1003","FCFP4_1024b1004","FCFP4_1024b1005","FCFP4_1024b1006","FCFP4_1024b1007","FCFP4_1024b1008","FCFP4_1024b1009","FCFP4_1024b101","FCFP4_1024b1010","FCFP4_1024b1011","FCFP4_1024b1012","FCFP4_1024b1013","FCFP4_1024b1014","FCFP4_1024b1015","FCFP4_1024b1016","FCFP4_1024b1017","FCFP4_1024b1018","FCFP4_1024b1019","FCFP4_1024b102","FCFP4_1024b1020","FCFP4_1024b1021","FCFP4_1024b1022","FCFP4_1024b1023","FCFP4_1024b1024","FCFP4_1024b103","FCFP4_1024b104","FCFP4_1024b105","FCFP4_1024b106","FCFP4_1024b107","FCFP4_1024b108","FCFP4_1024b109","FCFP4_1024b11","FCFP4_1024b110","FCFP4_1024b111","FCFP4_1024b112","FCFP4_1024b113","FCFP4_1024b114","FCFP4_1024b115","FCFP4_1024b116","FCFP4_1024b117","FCFP4_1024b118","FCFP4_1024b119","FCFP4_1024b12","FCFP4_1024b120","FCFP4_1024b121","pXC50"
{1 1,52 4.523}
{0 CHEMBL183,1 1,52 6.854}
{0 CHEMBL190,1 1,52 4.854}
{0 CHEMBL22099,1 1,52 6.658}
{0 CHEMBL317534,1 1,52 6.364}
{0 CHEMBL317990,1 1,13 1,52 5.777}
{0 CHEMBL327612,1 1,52 5.443}
{0 CHEMBL327672,1 1,52 5.777}
{0 CHEMBL327697,1 1,13 1,52 5.572}
{0 CHEMBL328358,1 1,52 5.528}
{0 CHEMBL328561,1 1,13 1,52 6.523}
{0 CHEMBL328689,1 1,52 6.523}
{0 CHEMBL329247,1 1,52 5.762}
{0 CHEMBL329916,1 1,52 5.533}
{0 CHEMBL330054,1 1,13 1,52 6.824}
{0 CHEMBL330704,1 1,52 5.505}
{0 CHEMBL369602,1 1,52 5.301}
{0 CHEMBL419139,1 1,52 5.651}
{0 CHEMBL420432,1 1,52 5.578}
{0 CHEMBL430458,1 1,2 1,52 6.563}
{0 CHEMBL432817,1 1,52 5.578}
{0 CHEMBL52606,1 1,52 6.563}
{0 CHEMBL89962,1 1,52 5.572}
{0 CHEMBL90423,1 1,52 5.543}
{0 CHEMBL91795,1 1,46 1,52 5.359}
{0 CHEMBL91909,1 1,13 1,52 6.824}
{0 CHEMBL92229,1 1,52 6.49}
{0 CHEMBL92577,1 1,52 5.44}
{0 CHEMBL92687,1 1,52 5.699}
{0 CHEMBL92719,1 1,52 6.627}
{0 CHEMBL92857,1 1,52 5.829}
{0 CHEMBL92911,1 1,2 1,52 5.699}
{0 CHEMBL92919,1 1,13 1,52 6.717}
{0 CHEMBL93009,1 1,26 1,52 6.563}
{0 CHEMBL93042,1 1,2 1,52 5.679}
{0 CHEMBL93194,1 1,2 1,52 5.81}
{0 CHEMBL93242,1 1,26 1,52 5.829}
{0 CHEMBL93252,1 1,26 1,52 5.496}
{0 CHEMBL93259,1 1,52 5.829}
{0 CHEMBL93260,1 1,52 5.634}
{0 CHEMBL93393,1 1,52 5.66}
{0 CHEMBL93408,1 1,46 1,52 5.689}
{0 CHEMBL93468,1 1,52 5.689}
{0 CHEMBL93469,1 1,46 1,52 5.396}
{0 CHEMBL93521,1 1,52 5.793}
{0 CHEMBL93841,1 1,2 1,52 5.505}
{0 CHEMBL94135,1 1,52 5.604}
{0 CHEMBL94168,1 1,52 5.748}
{0 CHEMBL94313,1 1,2 1,52 5.735}
{0 CHEMBL94343,1 1,52 5.722}
