{
  "data_set_description": {
    "collection_date": "November 2013",
    "creator": "Dr Jeremy Besnard, Dr Ivan Olier, Dr Noureddin Sadawi, Dr Larisa Soldatova, Dr Crina Grosan, Prof Ross King, Dr Richard Bickerton, Prof Andrew Hopkins and Dr Willem van Hoorn",
    "default_target_attribute": "pXC50",
    "description": "This dataset contains QSAR data (from ChEMBL version 17) showing activity values (unit is pseudo-pCI50) of several compounds on drug target ChEMBL_ID: CHEMBL5573 (TID: 101024), and it has 467 rows and 1392 features (not including molecule IDs and class feature: molecule_id and pXC50). The features represent Molecular Descriptors which were generated from SMILES strings. Missing value imputation was applied to this dataset (By choosing the Median).",
    "description_version": "1",
    "file_id": "3455374",
    "format": "ARFF",
    "id": "31648",
    "licence": "Public",
    "md5_checksum": "10a0a1faeeefeab8f3be1fa29129f362",
    "minio_url": "https://data.openml.org/datasets/0003/31648/dataset_31648.pq",
    "name": "QSAR-DATASET-FOR-DRUG-TARGET-CHEMBL5573",
    "original_data_url": "https://www.ebi.ac.uk/chembl/target/inspect/CHEMBL5573",
    "parquet_url": "https://data.openml.org/datasets/0003/31648/dataset_31648.pq",
    "processing_date": "2018-10-04 02:26:28",
    "row_id_attribute": "molecule_id",
    "status": "deactivated",
    "tag": [
      "MetaQSAR",
      "study_13"
    ],
    "upload_date": "2016-07-15T08:08:28",
    "url": "https://api.openml.org/data/v1/download/3455374/QSAR-DATASET-FOR-DRUG-TARGET-CHEMBL5573.arff",
    "version": "11",
    "visibility": "public"
  }
}