"molecule_id","AMW","C.","H.","Me","Mi","Mp","Mv","MW","N.","nAB","nAT","nB","nBM","nBO","nBR","nBT","nC","nCL","nCsp","nCsp2","nCsp3","nDB","nF","nH","nHet","nHM","nI","nN","nO","nP","nS","nSK","nTB","nX","O.","RBF","RBN","SCBO","Se","Si","Sp","Sv","X.","pXC50"
{1 8.631,2 37.5,3 45,4 1.02,5 1.131,6 0.674,7 0.64,8 345.25,9 5,10 6,11 40,13 8,14 23,16 41,17 15,18 2,20 8,21 7,22 2,24 18,25 7,26 2,28 2,29 3,32 22,34 2,35 7.5,36 0.098,37 4,38 28,39 40.785,40 45.25,41 26.943,42 25.583,43 5,44 5.533}
{0 CHEMBL1926687,1 9.257,2 37.3,3 43.1,4 1.013,5 1.117,6 0.721,7 0.664,8 472.1,9 5.9,10 10,11 51,13 13,14 31,16 53,17 19,18 1,20 10,21 9,22 3,24 22,25 10,26 4,28 3,29 3,31 3,32 29,34 1,35 5.9,36 0.17,37 9,38 39,39 51.676,40 56.979,41 36.796,42 33.865,43 2,44 4.752}
{0 CHEMBL1926835,1 9.847,2 38.1,3 38.1,4 1.029,5 1.122,6 0.728,7 0.687,8 413.56,9 7.1,10 10,11 42,13 13,14 28,16 44,17 16,20 10,21 6,22 3,23 1,24 16,25 10,26 3,28 3,29 3,31 3,32 26,34 1,35 7.1,36 0.136,37 6,38 36,39 43.214,40 47.129,41 30.591,42 28.841,43 2.4,44 7.398}
{0 CHEMBL1926836,1 9.847,2 38.1,3 38.1,4 1.029,5 1.122,6 0.728,7 0.687,8 413.56,9 7.1,10 10,11 42,13 13,14 28,16 44,17 16,20 10,21 6,22 3,23 1,24 16,25 10,26 3,28 3,29 3,31 3,32 26,34 1,35 7.1,36 0.136,37 6,38 36,39 43.214,40 47.129,41 30.591,42 28.841,43 2.4,44 5.516}
{0 CHEMBL1926837,1 9.502,2 37.8,3 40,4 1.024,5 1.123,6 0.719,7 0.675,8 427.59,9 6.7,10 10,11 45,13 13,14 29,16 47,17 17,20 10,21 7,22 3,23 1,24 18,25 10,26 3,28 3,29 3,31 3,32 27,34 1,35 6.7,36 0.149,37 7,38 37,39 46.098,40 50.544,41 32.352,42 30.368,43 2.2,44 6.469}
{0 CHEMBL1926838,1 9.2,2 37.5,3 41.7,4 1.02,5 1.124,6 0.711,7 0.664,8 441.62,9 6.3,10 10,11 48,13 13,14 30,16 50,17 18,20 10,21 8,22 3,23 1,24 20,25 10,26 3,28 3,29 3,31 3,32 28,34 1,35 6.3,36 0.14,37 7,38 38,39 48.982,40 53.96,41 34.114,42 31.894,43 2.1,44 5.23}
{0 CHEMBL1926839,1 8.934,2 37.3,3 43.1,4 1.017,5 1.125,6 0.703,7 0.655,8 455.65,9 5.9,10 10,11 51,13 13,14 31,16 53,17 19,20 10,21 9,22 3,23 1,24 22,25 10,26 3,28 3,29 3,31 3,32 29,34 1,35 5.9,36 0.132,37 7,38 39,39 51.865,40 57.375,41 35.875,42 33.421,43 2,44 5.461}
{0 CHEMBL1926840,1 9.2,2 37.5,3 41.7,4 1.02,5 1.124,6 0.711,7 0.664,8 441.62,9 6.3,10 10,11 48,13 13,14 30,16 50,17 18,20 10,21 8,22 3,23 1,24 20,25 10,26 3,28 3,29 3,31 3,32 28,34 1,35 6.3,36 0.14,37 7,38 38,39 48.982,40 53.96,41 34.114,42 31.894,43 2.1,44 5.9}
{0 CHEMBL1926841,1 9.2,2 37.5,3 41.7,4 1.02,5 1.124,6 0.711,7 0.664,8 441.62,9 6.3,10 10,11 48,13 13,14 30,16 50,17 18,20 10,21 8,22 3,23 1,24 20,25 10,26 3,28 3,29 3,31 3,32 28,34 1,35 6.3,36 0.16,37 8,38 38,39 48.982,40 53.96,41 34.114,42 31.894,43 2.1,44 5.883}
{0 CHEMBL1926842,1 9.2,2 37.5,3 41.7,4 1.02,5 1.124,6 0.711,7 0.664,8 441.62,9 6.3,10 10,11 48,13 13,14 30,16 50,17 18,20 10,21 8,22 3,23 1,24 20,25 10,26 3,28 3,29 3,31 3,32 28,34 1,35 6.3,36 0.16,37 8,38 38,39 48.982,40 53.96,41 34.114,42 31.894,43 2.1,44 5.033}
{0 CHEMBL1926843,1 8.934,2 37.3,3 43.1,4 1.017,5 1.125,6 0.703,7 0.655,8 455.65,9 5.9,10 10,11 51,13 13,14 31,16 53,17 19,20 10,21 9,22 3,23 1,24 22,25 10,26 3,28 3,29 3,31 3,32 29,34 1,35 5.9,36 0.17,37 9,38 39,39 51.865,40 57.375,41 35.875,42 33.421,43 2,44 5.062}
{0 CHEMBL1926844,1 9.988,2 42.1,3 36.8,4 1.018,5 1.113,6 0.761,7 0.707,8 379.54,9 7.9,10 10,11 38,13 13,14 26,16 40,17 16,19 2,20 9,21 5,22 2,23 1,24 14,25 8,26 3,28 3,29 1,31 3,32 24,33 1,34 1,35 2.6,36 0.1,37 4,38 35,39 38.676,40 42.295,41 28.921,42 26.884,43 2.6,44 5.012}
{0 CHEMBL1926845,1 10.238,2 38.1,3 38.1,4 1.024,5 1.113,6 0.75,7 0.697,8 430.01,9 7.1,10 10,11 42,13 13,14 28,16 44,17 16,18 1,20 10,21 6,22 3,24 16,25 10,26 4,28 3,29 3,31 3,32 26,34 1,35 7.1,36 0.136,37 6,38 36,39 43.025,40 46.734,41 31.511,42 29.285,43 2.4,44 6.699}
{0 CHEMBL1926846,1 9.868,2 37.8,3 40,4 1.02,5 1.114,6 0.739,7 0.685,8 444.04,9 6.7,10 10,11 45,13 13,14 29,16 47,17 17,18 1,20 10,21 7,22 3,24 18,25 10,26 4,28 3,29 3,31 3,32 27,34 1,35 6.7,36 0.149,37 7,38 37,39 45.909,40 50.149,41 33.273,42 30.812,43 2.2,44 5.235}
{0 CHEMBL1926847,1 9.543,2 37.5,3 41.7,4 1.017,5 1.116,6 0.73,7 0.674,8 458.07,9 6.3,10 10,11 48,13 13,14 30,16 50,17 18,18 1,20 10,21 8,22 3,24 20,25 10,26 4,28 3,29 3,31 3,32 28,34 1,35 6.3,36 0.14,37 7,38 38,39 48.793,40 53.564,41 35.034,42 32.339,43 2.1,44 4.921}
{0 CHEMBL1926848,1 9.257,2 37.3,3 43.1,4 1.013,5 1.117,6 0.721,7 0.664,8 472.1,9 5.9,10 10,11 51,13 13,14 31,16 53,17 19,18 1,20 10,21 9,22 3,24 22,25 10,26 4,28 3,29 3,31 3,32 29,34 1,35 5.9,36 0.132,37 7,38 39,39 51.676,40 56.979,41 36.796,42 33.865,43 2,44 4.463}
{0 CHEMBL1926849,1 9.543,2 37.5,3 41.7,4 1.017,5 1.116,6 0.73,7 0.674,8 458.07,9 6.3,10 10,11 48,13 13,14 30,16 50,17 18,18 1,20 10,21 8,22 3,24 20,25 10,26 4,28 3,29 3,31 3,32 28,34 1,35 6.3,36 0.16,37 8,38 38,39 48.793,40 53.564,41 35.034,42 32.339,43 2.1,44 5.893}
{0 CHEMBL1926850,1 10.421,2 42.1,3 36.8,4 1.013,5 1.103,6 0.785,7 0.719,8 395.99,9 7.9,10 10,11 38,13 13,14 26,16 40,17 16,18 1,19 2,20 9,21 5,22 2,24 14,25 8,26 4,28 3,29 1,31 3,32 24,33 1,34 1,35 2.6,36 0.1,37 4,38 35,39 38.487,40 41.9,41 29.841,42 27.329,43 2.6,44 4.67}
{0 CHEMBL1926851,1 10.855,2 37.8,3 40,4 1.018,5 1.112,6 0.75,7 0.689,8 488.49,9 6.7,10 10,11 45,13 13,14 29,15 1,16 47,17 17,20 10,21 7,22 3,24 18,25 10,26 4,28 3,29 3,31 3,32 27,34 1,35 6.7,36 0.149,37 7,38 37,39 45.814,40 50.046,41 33.767,42 31.01,43 2.2,44 4.807}
{0 CHEMBL1926853,1 10.128,2 37.3,3 43.1,4 1.011,5 1.115,6 0.731,7 0.668,8 516.55,9 5.9,10 10,11 51,13 13,14 31,15 1,16 53,17 19,20 10,21 9,22 3,24 22,25 10,26 4,28 3,29 3,31 3,32 29,34 1,35 5.9,36 0.132,37 7,38 39,39 51.582,40 56.877,41 37.29,42 34.063,43 2,44 4.362}
{0 CHEMBL1926854,1 10.469,2 37.5,3 41.7,4 1.015,5 1.114,6 0.74,7 0.678,8 502.52,9 6.3,10 10,11 48,13 13,14 30,15 1,16 50,17 18,20 10,21 8,22 3,24 20,25 10,26 4,28 3,29 3,31 3,32 28,34 1,35 6.3,36 0.16,37 8,38 38,39 48.698,40 53.462,41 35.529,42 32.536,43 2.1,44 4.561}
{0 CHEMBL1926856,1 11.591,2 42.1,3 36.8,4 1.01,5 1.1,6 0.798,7 0.724,8 440.44,9 7.9,10 10,11 38,13 13,14 26,15 1,16 40,17 16,19 2,20 9,21 5,22 2,24 14,25 8,26 4,28 3,29 1,31 3,32 24,33 1,34 1,35 2.6,36 0.1,37 4,38 35,39 38.393,40 41.797,41 30.335,42 27.526,43 2.6,44 4.684}
{0 CHEMBL1926857,1 9.464,2 38.1,3 38.1,4 1.035,5 1.129,6 0.7,7 0.675,8 397.49,9 7.1,10 10,11 42,13 13,14 28,16 44,17 16,20 10,21 6,22 3,23 1,24 16,25 10,26 2,28 3,29 4,31 2,32 26,34 1,35 9.5,36 0.136,37 6,38 36,39 43.465,40 47.419,41 29.398,42 28.369,43 2.4,44 6.143}
{0 CHEMBL1926858,1 9.464,2 38.1,3 38.1,4 1.035,5 1.129,6 0.7,7 0.675,8 397.49,9 7.1,10 10,11 42,13 13,14 28,16 44,17 16,20 10,21 6,22 3,23 1,24 16,25 10,26 2,28 3,29 4,31 2,32 26,34 1,35 9.5,36 0.136,37 6,38 36,39 43.465,40 47.419,41 29.398,42 28.369,43 2.4,44 5.399}
{0 CHEMBL1926859,1 9.145,2 37.8,3 40,4 1.03,5 1.13,6 0.692,7 0.664,8 411.52,9 6.7,10 10,11 45,13 13,14 29,16 47,17 17,20 10,21 7,22 3,23 1,24 18,25 10,26 2,28 3,29 4,31 2,32 27,34 1,35 8.9,36 0.149,37 7,38 37,39 46.349,40 50.834,41 31.159,42 29.895,43 2.2,44 5.801}
{0 CHEMBL1926860,1 8.866,2 37.5,3 41.7,4 1.026,5 1.13,6 0.686,7 0.655,8 425.55,9 6.3,10 10,11 48,13 13,14 30,16 50,17 18,20 10,21 8,22 3,23 1,24 20,25 10,26 2,28 3,29 4,31 2,32 28,34 1,35 8.3,36 0.14,37 7,38 38,39 49.233,40 54.249,41 32.921,42 31.422,43 2.1,44 5.848}
{0 CHEMBL1926861,1 8.619,2 37.3,3 43.1,4 1.022,5 1.131,6 0.68,7 0.646,8 439.58,9 5.9,10 10,11 51,13 13,14 31,16 53,17 19,20 10,21 9,22 3,23 1,24 22,25 10,26 2,28 3,29 4,31 2,32 29,34 1,35 7.8,36 0.132,37 7,38 39,39 52.116,40 57.664,41 34.682,42 32.949,43 2,44 5.812}
{0 CHEMBL1926862,1 8.866,2 37.5,3 41.7,4 1.026,5 1.13,6 0.686,7 0.655,8 425.55,9 6.3,10 10,11 48,13 13,14 30,16 50,17 18,20 10,21 8,22 3,23 1,24 20,25 10,26 2,28 3,29 4,31 2,32 28,34 1,35 8.3,36 0.14,37 7,38 38,39 49.233,40 54.249,41 32.921,42 31.422,43 2.1,44 5.932}
{0 CHEMBL1926863,1 8.866,2 37.5,3 41.7,4 1.026,5 1.13,6 0.686,7 0.655,8 425.55,9 6.3,10 10,11 48,13 13,14 30,16 50,17 18,20 10,21 8,22 3,23 1,24 20,25 10,26 2,28 3,29 4,31 2,32 28,34 1,35 8.3,36 0.16,37 8,38 38,39 49.233,40 54.249,41 32.921,42 31.422,43 2.1,44 6.155}
{0 CHEMBL1926960,1 8.866,2 37.5,3 41.7,4 1.026,5 1.13,6 0.686,7 0.655,8 425.55,9 6.3,10 10,11 48,13 13,14 30,16 50,17 18,20 10,21 8,22 3,23 1,24 20,25 10,26 2,28 3,29 4,31 2,32 28,34 1,35 8.3,36 0.16,37 8,38 38,39 49.233,40 54.249,41 32.921,42 31.422,43 2.1,44 6.495}
{0 CHEMBL1926961,1 8.619,2 37.3,3 43.1,4 1.022,5 1.131,6 0.68,7 0.646,8 439.58,9 5.9,10 10,11 51,13 13,14 31,16 53,17 19,20 10,21 9,22 3,23 1,24 22,25 10,26 2,28 3,29 4,31 2,32 29,34 1,35 7.8,36 0.17,37 9,38 39,39 52.116,40 57.664,41 34.682,42 32.949,43 2,44 6.444}
{0 CHEMBL1926962,1 9.565,2 42.1,3 36.8,4 1.024,5 1.121,6 0.73,7 0.695,8 363.47,9 7.9,10 10,11 38,13 13,14 26,16 40,17 16,19 2,20 9,21 5,22 2,23 1,24 14,25 8,26 2,28 3,29 2,31 2,32 24,33 1,34 1,35 5.3,36 0.1,37 4,38 35,39 38.927,40 42.585,41 27.727,42 26.412,43 2.6,44 5.717}
{0 CHEMBL1926963,1 9.856,2 38.1,3 38.1,4 1.03,5 1.12,6 0.722,7 0.686,8 413.94,9 7.1,10 10,11 42,13 13,14 28,16 44,17 16,18 1,20 10,21 6,22 3,24 16,25 10,26 3,28 3,29 4,31 2,32 26,34 1,35 9.5,36 0.136,37 6,38 36,39 43.276,40 47.023,41 30.318,42 28.813,43 2.4,44 6.481}
{0 CHEMBL1926964,1 9.51,2 37.8,3 40,4 1.026,5 1.121,6 0.713,7 0.674,8 427.97,9 6.7,10 10,11 45,13 13,14 29,16 47,17 17,18 1,20 10,21 7,22 3,24 18,25 10,26 3,28 3,29 4,31 2,32 27,34 1,35 8.9,36 0.149,37 7,38 37,39 46.16,40 50.438,41 32.08,42 30.34,43 2.2,44 5.971}
{0 CHEMBL1926965,1 9.208,2 37.5,3 41.7,4 1.022,5 1.122,6 0.705,7 0.664,8 442,9 6.3,10 10,11 48,13 13,14 30,16 50,17 18,18 1,20 10,21 8,22 3,24 20,25 10,26 3,28 3,29 4,31 2,32 28,34 1,35 8.3,36 0.14,37 7,38 38,39 49.044,40 53.853,41 33.841,42 31.866,43 2.1,44 5.772}
{0 CHEMBL1926966,1 8.942,2 37.3,3 43.1,4 1.018,5 1.123,6 0.698,7 0.655,8 456.03,9 5.9,10 10,11 51,13 13,14 31,16 53,17 19,18 1,20 10,21 9,22 3,24 22,25 10,26 3,28 3,29 4,31 2,32 29,34 1,35 7.8,36 0.132,37 7,38 39,39 51.927,40 57.269,41 35.602,42 33.393,43 2,44 5.87}
{0 CHEMBL1926967,1 9.208,2 37.5,3 41.7,4 1.022,5 1.122,6 0.705,7 0.664,8 442,9 6.3,10 10,11 48,13 13,14 30,16 50,17 18,18 1,20 10,21 8,22 3,24 20,25 10,26 3,28 3,29 4,31 2,32 28,34 1,35 8.3,36 0.16,37 8,38 38,39 49.044,40 53.853,41 33.841,42 31.866,43 2.1,44 6.602}
{0 CHEMBL1926968,1 8.942,2 37.3,3 43.1,4 1.018,5 1.123,6 0.698,7 0.655,8 456.03,9 5.9,10 10,11 51,13 13,14 31,16 53,17 19,18 1,20 10,21 9,22 3,24 22,25 10,26 3,28 3,29 4,31 2,32 29,34 1,35 7.8,36 0.17,37 9,38 39,39 51.927,40 57.269,41 35.602,42 33.393,43 2,44 5.695}
{0 CHEMBL1926969,1 9.998,2 42.1,3 36.8,4 1.019,5 1.11,6 0.754,7 0.707,8 379.92,9 7.9,10 10,11 38,13 13,14 26,16 40,17 16,18 1,19 2,20 9,21 5,22 2,24 14,25 8,26 3,28 3,29 2,31 2,32 24,33 1,34 1,35 5.3,36 0.1,37 4,38 35,39 38.738,40 42.189,41 28.648,42 26.856,43 2.6,44 5.065}
{0 CHEMBL1926970,1 10.498,2 37.8,3 40,4 1.024,5 1.119,6 0.724,7 0.679,8 472.42,9 6.7,10 10,11 45,13 13,14 29,15 1,16 47,17 17,20 10,21 7,22 3,24 18,25 10,26 3,28 3,29 4,31 2,32 27,34 1,35 8.9,36 0.149,37 7,38 37,39 46.065,40 50.336,41 32.574,42 30.537,43 2.2,44 5.157}
{0 CHEMBL1926971,1 10.134,2 37.5,3 41.7,4 1.02,5 1.12,6 0.715,7 0.668,8 486.45,9 6.3,10 10,11 48,13 13,14 30,15 1,16 50,17 18,20 10,21 8,22 3,24 20,25 10,26 3,28 3,29 4,31 2,32 28,34 1,35 8.3,36 0.14,37 7,38 38,39 48.949,40 53.751,41 34.335,42 32.064,43 2.1,44 5.09}
{0 CHEMBL1926972,1 9.813,2 37.3,3 43.1,4 1.016,5 1.121,6 0.708,7 0.659,8 500.48,9 5.9,10 10,11 51,13 13,14 31,15 1,16 53,17 19,20 10,21 9,22 3,24 22,25 10,26 3,28 3,29 4,31 2,32 29,34 1,35 7.8,36 0.132,37 7,38 39,39 51.833,40 57.166,41 36.097,42 33.591,43 2,44 5.801}
{0 CHEMBL1926973,1 10.134,2 37.5,3 41.7,4 1.02,5 1.12,6 0.715,7 0.668,8 486.45,9 6.3,10 10,11 48,13 13,14 30,15 1,16 50,17 18,20 10,21 8,22 3,24 20,25 10,26 3,28 3,29 4,31 2,32 28,34 1,35 8.3,36 0.16,37 8,38 38,39 48.949,40 53.751,41 34.335,42 32.064,43 2.1,44 5.772}
{0 CHEMBL1926974,1 9.813,2 37.3,3 43.1,4 1.016,5 1.121,6 0.708,7 0.659,8 500.48,9 5.9,10 10,11 51,13 13,14 31,15 1,16 53,17 19,20 10,21 9,22 3,24 22,25 10,26 3,28 3,29 4,31 2,32 29,34 1,35 7.8,36 0.17,37 9,38 39,39 51.833,40 57.166,41 36.097,42 33.591,43 2,44 5.234}
{0 CHEMBL1926975,1 11.168,2 42.1,3 36.8,4 1.017,5 1.108,6 0.767,7 0.712,8 424.37,9 7.9,10 10,11 38,13 13,14 26,15 1,16 40,17 16,19 2,20 9,21 5,22 2,24 14,25 8,26 3,28 3,29 2,31 2,32 24,33 1,34 1,35 5.3,36 0.1,37 4,38 35,39 38.644,40 42.087,41 29.142,42 27.054,43 2.6,44 4.954}
{0 CHEMBL222440,1 11.667,2 45.2,3 22.6,4 1.097,5 1.148,6 0.702,7 0.749,8 361.67,9 3.2,10 12,11 31,13 15,14 25,16 32,17 14,18 1,20 13,21 1,22 3,23 3,24 7,25 10,26 1,28 1,29 5,32 24,34 4,35 16.1,36 0.125,37 4,38 34,39 34.018,40 35.584,41 21.756,42 23.207,43 12.9,44 5.767}
