"molecule_id","P_VSA_LogP_3","SpMin3_Bh.i.","Eig01_AEA.dm.","Eig02_AEA.dm.","Eig03_AEA.dm.","Eig05_AEA.dm.","GATS1m","GATS4s","MAXDP","SpDiam_AEA.dm.","SpMAD_AEA.dm.","SpMax_AEA.dm.","SpMin3_Bh.e.","MATS3s","Eig09_EA.bo.","AAC","AECC","ALOGP","ALOGP2","AMR","AMW","ARR","ATS1e","ATS1i","ATS1m","ATS1p","ATS1s","ATS1v","ATS2e","ATS2i","ATS2m","ATS2p","ATS2s","ATS2v","ATS3e","ATS3i","ATS3m","ATS3p","ATS3s","ATS3v","ATS4e","ATS4i","ATS4m","ATS4p","ATS4s","ATS4v","ATS5e","ATS5i","ATS5m","ATS5p","ATS5s","ATS5v","ATS6e","ATS6i","ATS6m","ATS6p","ATS6s","ATS6v","ATS7e","ATS7i","ATS7m","ATS7p","ATS7s","ATS7v","ATS8e","ATS8i","ATS8m","ATS8p","ATS8s","ATS8v","ATSC1e","ATSC1i","ATSC1m","ATSC1p","ATSC1s","ATSC1v","ATSC2e","ATSC2i","ATSC2m","ATSC2p","ATSC2s","ATSC2v","ATSC3e","ATSC3i","ATSC3m","ATSC3p","ATSC3s","ATSC3v","ATSC4e","ATSC4i","ATSC4m","ATSC4p","ATSC4s","ATSC4v","ATSC5e","ATSC5i","ATSC5m","ATSC5p","ATSC5s","ATSC5v","ATSC6e","ATSC6i","ATSC6m","ATSC6p","ATSC6s","ATSC6v","ATSC7e","ATSC7i","ATSC7m","ATSC7p","ATSC7s","ATSC7v","ATSC8e","ATSC8i","ATSC8m","ATSC8p","ATSC8s","ATSC8v","BAC","BBI","BIC0","BIC1","BIC2","BIC3","BIC4","BIC5","BID","BLI","BLTA96","BLTD48","BLTF96","C.","C.002","C.003","C.005","C.006","C.008","C.016","C.017","C.020","C.024","C.025","C.026","C.033","C.034","C.040","CATS2D_01_AN","CATS2D_01_DD","CATS2D_01_DN","CATS2D_01_DP","CATS2D_01_LL","CATS2D_01_NL","CATS2D_02_AL","CATS2D_02_AN","CATS2D_02_DA","CATS2D_02_DL","CATS2D_02_DN","CATS2D_02_LL","pXC50"
{1 9.476,2 0.792,3 3.621,4 2.715,5 1.741,6 0.445,7 0.914,8 1.315,9 3.223,10 5.301,11 1.568,12 3.621,13 0.804,14 -0.02,15 -2.439,16 1.612,17 4,18 -0.125,19 0.016,20 33.447,21 7.064,23 2.991,24 3.115,25 2.455,26 2.439,27 4.204,28 2.43,29 3.485,30 3.651,31 2.782,32 2.818,33 4.831,34 2.761,35 3.742,36 3.988,37 2.558,38 2.77,39 4.863,40 2.652,41 3.633,42 3.916,43 2.211,44 2.334,45 4.774,46 2.236,47 2.985,48 3.219,49 1.639,50 1.58,51 4.636,52 1.529,53 2.278,54 2.548,55 0.449,56 0.861,57 3.526,58 0.771,59 1.02,60 1.365,61 0.014,62 0.255,63 1.099,64 0.13,71 0.066,72 0.242,73 4.072,74 1.623,75 15.494,76 2.156,77 0.159,78 0.369,79 6.997,80 2.727,81 37.099,82 3.834,83 0.159,84 0.381,85 9.767,86 2.812,87 33.21,88 4.466,89 0.266,90 0.239,91 9.686,92 2.047,93 55.956,94 3.356,95 0.261,96 0.103,97 5.212,98 0.834,99 51.394,100 1.349,101 0.12,102 0.039,103 2.554,104 0.301,105 22.61,106 0.534,107 0.011,108 0.008,109 0.508,110 0.104,111 1.927,112 0.209,119 11,120 12,121 0.373,122 0.764,123 0.836,124 0.888,125 0.888,126 0.888,127 2.357,128 0.959,129 -1.27,130 -1.36,131 -1.42,132 33.3,133 2,137 1,138 1,139 1,146 1,147 1,149 1,151 3,152 1,153 1,155 1,156 3,158 3,159 2.796}
{0 CHEMBL146927,2 0.877,3 3.771,4 3.514,5 2.71,6 1.372,7 0.71,8 1.359,9 4.034,10 5.529,11 1.586,12 3.771,13 0.903,14 -0.038,15 -1.466,16 1.908,17 4.833,18 0.272,19 0.074,20 37.958,21 8.437,23 3.17,24 3.282,25 2.76,26 2.573,27 4.533,28 2.614,29 3.703,30 3.855,31 3.174,32 2.989,33 5.369,34 2.985,35 4.012,36 4.22,37 3.125,38 3.057,39 5.227,40 3.023,41 4.113,42 4.355,43 3.073,44 2.724,45 5.709,46 2.791,47 3.65,48 3.925,49 2.476,50 2.034,51 5.35,52 2.156,53 2.812,54 2.921,55 2.309,56 1.11,57 5.488,58 1.419,59 1.707,60 2.035,61 0.247,62 0.427,63 2.944,64 0.392,71 0.199,72 0.42,73 3.723,74 2.042,75 44.181,76 2.166,77 0.505,78 0.697,79 7.519,80 3.456,81 110.319,82 4.166,83 0.565,84 0.625,85 11.781,86 3.95,87 124.335,88 5.413,89 1.042,90 0.597,91 16.875,92 3.138,93 207.539,94 4.024,95 0.812,96 0.308,97 12.26,98 1.861,99 151.042,100 2.086,101 0.586,102 0.067,103 4.626,104 0.432,105 117.57,106 0.465,107 0.118,108 0.027,109 1.853,110 0.219,111 21.111,112 0.267,119 30,120 17,121 0.422,122 0.766,123 0.887,124 0.887,125 0.887,126 0.887,127 2.598,128 0.886,129 -1.95,130 -2.01,131 -2.01,132 33.3,133 2,134 1,137 1,139 1,140 1,146 1,147 1,149 1,151 3,152 1,153 1,155 1,156 3,158 3,159 4.509}
{0 CHEMBL159205,1 50.663,2 0.506,3 3.596,4 1.733,5 0.803,6 -0.579,7 1.005,8 1.115,9 2.663,10 5.061,11 1.321,12 3.596,13 0.623,14 -0.239,16 1.723,17 4.143,18 -1.209,19 1.462,20 25.065,21 6.942,23 2.801,24 2.962,25 2.19,26 1.993,27 4.154,28 2.029,29 3.194,30 3.411,31 2.298,32 2.201,33 4.647,34 2.171,35 3.379,36 3.649,37 2.016,38 2.131,39 4.543,40 2.057,41 3.148,42 3.43,43 1.842,44 1.799,45 4.481,46 1.723,47 2.7,48 2.984,49 1.535,50 1.331,51 4.355,52 1.282,53 2.077,54 2.288,55 0.44,56 0.73,57 3.466,58 0.704,59 1.02,60 1.365,61 0.014,62 0.255,63 1.099,64 0.13,71 0.117,72 0.14,73 3.665,74 0.891,75 17.79,76 1.482,77 0.224,78 0.147,79 5.733,80 1.119,81 39.076,82 2.156,83 0.297,84 0.11,85 7.36,86 0.956,87 52.058,88 2.213,89 0.29,90 0.067,91 5.993,92 0.66,93 41.407,94 1.602,95 0.197,96 0.029,97 3.804,98 0.375,99 35.492,100 0.938,101 0.128,102 0.008,103 2.025,104 0.102,105 23.372,106 0.33,107 0.017,108 0.002,109 0.488,110 0.055,111 2.62,112 0.15,119 17,120 6,121 0.441,122 0.782,123 0.898,124 0.898,125 0.898,126 0.764,127 2.138,128 0.962,129 -0.53,130 -0.66,131 -0.8,132 20,133 1,136 1,146 1,147 1,148 1,149 1,150 1,152 1,153 1,155 1,156 2,159 7.699}
{0 CHEMBL160520,1 50.663,3 1.22,4 -0.82,7 1.424,9 0.597,10 2.04,11 1.02,12 1.22,14 -0.303,16 1.224,17 1.667,18 -0.914,19 0.835,20 14.281,21 5.121,23 2.263,24 2.506,25 1.405,26 1.354,27 3.481,28 1.314,29 2.581,30 2.928,31 1.053,32 1.39,33 3.45,34 1.252,35 2.36,36 2.733,37 0.404,38 1.163,39 3.091,40 0.905,41 1.844,42 2.277,43 0.042,44 0.626,45 1.946,46 0.348,71 0.055,72 0.03,73 2.321,74 0.303,75 6.645,76 0.744,77 0.067,78 0.021,79 2.61,80 0.271,81 6.836,82 0.765,83 0.042,84 0.003,85 1.739,86 0.243,87 6.722,88 0.567,89 0.018,91 0.703,92 0.091,93 2.241,94 0.221,119 5,120 1,121 0.408,122 0.704,123 0.806,124 0.689,125 0.337,127 1.606,128 1.183,129 -0.35,130 -0.48,131 -0.64,132 11.1,135 1,148 1,150 1,159 5.606}
{0 CHEMBL163117,2 0.83,3 3.74,4 3.099,5 1.904,6 0.455,7 0.824,8 1.471,9 4.539,10 5.492,11 1.603,12 3.74,13 0.849,14 -0.079,15 -1.802,16 1.785,17 4.1,18 -0.113,19 0.013,20 32.241,21 7.358,23 3.104,24 3.23,25 2.589,26 2.499,27 4.313,28 2.507,29 3.682,30 3.852,31 2.981,32 2.926,33 5.007,34 2.894,35 4.057,36 4.304,37 2.929,38 2.937,39 5.351,40 2.871,41 3.945,42 4.232,43 2.462,44 2.483,45 5.24,46 2.443,47 3.242,48 3.5,49 2.217,50 1.709,51 5.293,52 1.706,53 2.326,54 2.579,55 0.527,56 0.851,57 3.714,58 0.816,59 1.02,60 1.365,61 0.014,62 0.255,63 1.099,64 0.13,71 0.119,72 0.325,73 4.446,74 1.912,75 29.502,76 2.406,77 0.285,78 0.527,79 8.633,80 3.3,81 70.968,82 4.383,83 0.533,84 0.542,85 14.47,86 3.483,87 113.345,88 5.309,89 0.676,90 0.303,91 14.575,92 2.214,93 130.623,94 3.679,95 0.527,96 0.094,97 7.326,98 0.929,99 103.571,100 1.738,101 0.176,102 0.031,103 2.885,104 0.248,105 32.265,106 0.447,107 0.017,108 0.003,109 0.559,110 0.082,111 2.801,112 0.192,119 18,120 14,121 0.406,122 0.715,123 0.87,124 0.916,125 0.916,126 0.916,127 2.444,128 0.97,129 -1.55,130 -1.63,131 -1.67,132 30,133 2,134 1,137 2,146 1,147 1,149 1,151 2,152 1,153 1,155 1,156 2,158 1,159 4.921}
{0 CHEMBL2147347,1 18.952,2 0.886,3 3.582,4 2.744,5 1.8,6 0.548,7 0.789,8 1.194,9 3.196,10 5.414,11 1.464,12 3.582,13 0.956,14 0.14,15 -2.559,16 1.739,17 4.7,18 0.227,19 0.051,20 33.558,21 8.302,22 0.5,23 2.979,24 3.07,25 2.576,26 2.362,27 4.347,28 2.421,29 3.378,30 3.494,31 2.885,32 2.621,33 4.924,34 2.672,35 3.498,36 3.655,37 2.727,38 2.505,39 4.995,40 2.519,41 3.304,42 3.468,43 2.406,44 2.291,45 4.717,46 2.305,47 3.014,48 3.264,49 1.768,50 1.93,51 4.151,52 1.827,53 2.679,54 2.888,55 1.575,56 1.345,57 4.464,58 1.344,59 2.182,60 2.426,61 0.445,62 0.797,63 3.497,64 0.738,65 1.02,66 1.365,67 0.014,68 0.255,69 1.099,70 0.13,71 0.133,72 0.221,73 3.131,74 1.365,75 20.058,76 1.51,77 0.252,78 0.297,79 5.223,80 2.061,81 40.255,82 2.498,83 0.467,84 0.271,85 7.526,86 2.087,87 41.958,88 2.726,89 0.277,90 0.229,91 5.839,92 1.557,93 33.617,94 2.041,95 0.186,96 0.16,97 4.952,98 1.251,99 32.005,100 1.979,101 0.226,102 0.083,103 3.834,104 0.627,105 43.016,106 0.958,107 0.148,108 0.039,109 2.583,110 0.291,111 26.305,112 0.44,113 0.021,114 0.009,115 0.737,116 0.121,117 3.052,118 0.272,119 14,120 13,121 0.399,122 0.83,123 0.857,124 0.884,125 0.884,126 0.884,127 2.441,128 0.828,129 -0.63,130 -0.75,131 -0.88,132 35.3,136 1,141 2,145 2,146 1,147 1,149 1,151 1,153 2,154 1,155 1,159 2.678}
{0 CHEMBL2147348,1 18.952,2 0.888,3 3.582,4 2.744,5 1.8,6 0.548,7 0.769,8 1.124,9 3.3,10 5.414,11 1.464,12 3.582,13 0.962,14 0.029,15 -2.559,16 1.902,17 4.7,18 0.785,19 0.616,20 40.002,21 9.248,22 0.5,23 2.953,24 3.043,25 2.761,26 2.565,27 4.273,28 2.502,29 3.343,30 3.458,31 3.146,32 2.919,33 4.833,34 2.795,35 3.438,36 3.589,37 3.038,38 2.766,39 4.724,40 2.635,41 3.278,42 3.435,43 2.436,44 2.42,45 4.671,46 2.342,47 3.014,48 3.264,49 1.768,50 1.93,51 4.151,52 1.827,53 2.679,54 2.888,55 1.575,56 1.345,57 4.464,58 1.344,59 2.182,60 2.426,61 0.445,62 0.797,63 3.497,64 0.738,65 1.02,66 1.365,67 0.014,68 0.255,69 1.099,70 0.13,71 0.086,72 0.244,73 3.049,74 1.71,75 16.64,76 1.647,77 0.18,78 0.361,79 5.583,80 2.948,81 35.95,82 2.975,83 0.161,84 0.378,85 12.823,86 3.707,87 22.973,88 3.501,89 0.155,90 0.288,91 8.067,92 2.57,93 25.512,94 2.495,95 0.141,96 0.191,97 5.007,98 1.611,99 28.089,100 2.018,101 0.212,102 0.112,103 3.873,104 0.929,105 41.775,106 0.974,107 0.13,108 0.058,109 2.755,110 0.529,111 24.551,112 0.44,113 0.015,114 0.014,115 0.941,116 0.2,117 2.587,118 0.314,119 14,120 13,121 0.436,122 0.83,123 0.857,124 0.884,125 0.884,126 0.884,127 2.441,128 1.072,129 -1.44,130 -1.52,131 -1.57,132 35.3,136 1,141 2,145 2,146 1,147 1,149 1,151 1,155 1,158 2,159 2.201}
{0 CHEMBL2147349,1 18.952,2 0.89,3 3.582,4 2.744,5 1.8,6 0.548,7 0.866,8 1.284,9 3.258,10 5.414,11 1.464,12 3.582,13 0.981,14 0.08,15 -2.559,16 1.753,17 4.7,18 0.217,19 0.047,20 35.804,21 7.787,22 0.5,23 3.017,24 3.147,25 2.558,26 2.415,27 4.337,28 2.446,29 3.419,30 3.574,31 2.857,32 2.721,33 4.896,34 2.719,35 3.571,36 3.788,37 2.704,38 2.66,39 4.896,40 2.61,41 3.523,42 3.754,43 2.434,44 2.42,45 4.866,46 2.39,47 3.137,48 3.418,49 1.772,50 1.991,51 4.197,52 1.86,53 2.679,54 2.888,55 1.575,56 1.345,57 4.464,58 1.344,59 2.182,60 2.426,61 0.445,62 0.797,63 3.497,64 0.738,65 1.02,66 1.365,67 0.014,68 0.255,69 1.099,70 0.13,71 0.102,72 0.255,73 3.703,74 1.25,75 16.537,76 1.717,77 0.194,78 0.358,79 5.882,80 1.995,81 36.391,82 2.946,83 0.261,84 0.335,85 7.862,86 2.221,87 24.562,88 3.39,89 0.269,90 0.259,91 8.151,92 1.736,93 41.383,94 2.765,95 0.163,96 0.154,97 5.862,98 1.407,99 30.772,100 2.321,101 0.212,102 0.07,103 3.803,104 0.612,105 41.457,106 0.945,107 0.13,108 0.03,109 2.473,110 0.28,111 24.074,112 0.438,113 0.015,114 0.007,115 0.637,116 0.117,117 2.469,118 0.246,119 14,120 13,121 0.396,122 0.807,123 0.867,124 0.892,125 0.892,126 0.892,127 2.441,128 0.855,129 -0.63,130 -0.75,131 -0.88,132 33.3,136 1,141 2,145 2,146 1,147 1,149 1,151 1,155 1,156 2,157 1,159 2.022}
{0 CHEMBL2147350,1 21.216,2 0.831,3 3.582,4 2.744,5 1.8,6 0.548,7 0.789,8 1.089,9 3.196,10 5.414,11 1.464,12 3.582,13 0.931,14 0.148,15 -2.559,16 1.739,17 4.7,18 -0.064,19 0.004,20 33.681,21 8.302,22 0.5,23 2.979,24 3.07,25 2.576,26 2.362,27 4.354,28 2.421,29 3.378,30 3.495,31 2.868,32 2.645,33 4.912,34 2.686,35 3.469,36 3.627,37 2.723,38 2.557,39 4.943,40 2.546,41 3.415,42 3.613,43 2.444,44 2.286,45 4.815,46 2.298,47 2.991,48 3.222,49 1.761,50 1.83,51 4.135,52 1.77,53 2.549,54 2.711,55 1.572,56 1.266,57 4.441,58 1.307,59 2.182,60 2.426,61 0.445,62 0.797,63 3.497,64 0.738,65 1.02,66 1.365,67 0.014,68 0.255,69 1.099,70 0.13,71 0.133,72 0.221,73 3.131,74 1.365,75 19.715,76 1.51,77 0.266,78 0.302,79 5.322,80 2.087,81 41.524,82 2.498,83 0.37,84 0.291,85 6.684,86 2.192,87 36.054,88 2.972,89 0.343,90 0.234,91 7.204,92 1.647,93 41.284,94 2.324,95 0.223,96 0.14,97 5.067,98 1.152,99 32.368,100 1.723,101 0.205,102 0.073,103 3.097,104 0.506,105 39.964,106 0.686,107 0.148,108 0.039,109 2.583,110 0.291,111 26.305,112 0.44,113 0.021,114 0.009,115 0.737,116 0.121,117 3.052,118 0.272,119 14,120 13,121 0.399,122 0.857,123 0.884,124 0.884,125 0.884,126 0.884,127 2.441,128 0.824,129 -0.63,130 -0.75,131 -0.88,132 35.3,136 1,141 1,142 1,144 1,145 1,146 1,147 1,149 1,151 1,153 2,154 1,155 1,156 1,159 3.509}
{0 CHEMBL2147351,1 17.125,2 0.852,3 3.582,4 2.744,5 1.8,6 0.548,7 0.769,8 1.053,9 3.3,10 5.414,11 1.464,12 3.582,13 0.945,14 0.016,15 -2.559,16 1.902,17 4.7,18 0.494,19 0.244,20 40.124,21 9.248,22 0.5,23 2.953,24 3.043,25 2.761,26 2.565,27 4.272,28 2.502,29 3.343,30 3.458,31 3.078,32 2.897,33 4.831,34 2.786,35 3.433,36 3.59,37 3.008,38 2.749,39 4.739,40 2.641,41 3.381,42 3.573,43 2.596,44 2.48,45 4.716,46 2.369,47 2.967,48 3.194,49 1.799,50 1.966,51 4.08,52 1.811,53 2.549,54 2.711,55 1.572,56 1.266,57 4.441,58 1.307,59 2.182,60 2.426,61 0.445,62 0.797,63 3.497,64 0.738,65 1.02,66 1.365,67 0.014,68 0.255,69 1.099,70 0.13,71 0.086,72 0.244,73 3.049,74 1.71,75 16.584,76 1.647,77 0.181,78 0.358,79 6.345,80 2.956,81 36.468,82 2.986,83 0.149,84 0.357,85 8.795,86 3.238,87 21.252,88 3.301,89 0.189,90 0.327,91 10.255,92 2.843,93 31.096,94 2.889,95 0.133,96 0.19,97 7.027,98 1.998,99 26.35,100 2.127,101 0.197,102 0.097,103 2.932,104 0.729,105 39.188,106 0.66,107 0.13,108 0.058,109 2.755,110 0.529,111 24.551,112 0.44,113 0.015,114 0.014,115 0.941,116 0.2,117 2.587,118 0.314,119 14,120 13,121 0.436,122 0.857,123 0.884,124 0.884,125 0.884,126 0.884,127 2.441,128 1.088,129 -1.44,130 -1.52,131 -1.57,132 35.3,136 1,141 1,142 1,144 1,145 1,146 1,147 1,149 1,151 1,155 1,156 1,158 2,159 2.77}
{0 CHEMBL2147352,1 18.524,2 0.869,3 3.582,4 2.744,5 1.8,6 0.548,7 0.866,8 1.275,9 3.258,10 5.414,11 1.464,12 3.582,13 0.978,14 0.084,15 -2.559,16 1.753,17 4.7,18 -0.075,19 0.006,20 35.926,21 7.787,22 0.5,23 3.017,24 3.147,25 2.558,26 2.415,27 4.339,28 2.446,29 3.419,30 3.576,31 2.848,32 2.736,33 4.892,34 2.731,35 3.557,36 3.762,37 2.699,38 2.68,39 4.875,40 2.62,41 3.529,42 3.762,43 2.45,44 2.399,45 4.882,46 2.373,47 3.15,48 3.441,49 1.777,50 1.951,51 4.212,52 1.84,53 2.679,54 2.888,55 1.575,56 1.345,57 4.464,58 1.344,59 2.182,60 2.426,61 0.445,62 0.797,63 3.497,64 0.738,65 1.02,66 1.365,67 0.014,68 0.255,69 1.099,70 0.13,71 0.102,72 0.255,73 3.703,74 1.25,75 16.444,76 1.717,77 0.2,78 0.359,79 5.917,80 2.046,81 36.623,82 2.955,83 0.223,84 0.336,85 7.552,86 2.352,87 23.281,88 3.586,89 0.283,90 0.258,91 8.238,92 1.735,93 41.907,94 2.73,95 0.181,96 0.154,97 6.049,98 1.226,99 31.389,100 2.151,101 0.212,102 0.07,103 3.803,104 0.612,105 41.457,106 0.945,107 0.13,108 0.03,109 2.473,110 0.28,111 24.074,112 0.438,113 0.015,114 0.007,115 0.637,116 0.117,117 2.469,118 0.246,119 14,120 13,121 0.396,122 0.832,123 0.892,124 0.892,125 0.892,126 0.892,127 2.441,128 0.853,129 -0.63,130 -0.75,131 -0.88,132 33.3,136 1,141 1,142 1,144 1,145 1,146 1,147 1,149 1,151 1,155 1,156 3,157 1,159 2.854}
{0 CHEMBL2147353,1 23.479,2 0.925,3 3.614,4 2.764,5 1.56,6 0.512,7 0.789,8 1.076,9 3.326,10 5.457,11 1.464,12 3.614,13 0.986,14 -0.014,15 -2.48,16 1.739,17 4.1,18 -0.356,19 0.127,20 33.803,21 8.302,22 0.5,23 2.979,24 3.07,25 2.576,26 2.362,27 4.362,28 2.421,29 3.377,30 3.496,31 2.85,32 2.669,33 4.895,34 2.7,35 3.444,36 3.606,37 2.745,38 2.616,39 4.763,40 2.617,41 3.519,42 3.668,43 2.731,44 2.37,45 5.131,46 2.421,47 3.277,48 3.507,49 1.75,50 1.852,51 4.807,52 1.776,53 2.445,54 2.753,55 0.458,56 0.976,57 3.584,58 0.833,59 1.02,60 1.365,61 0.014,62 0.255,63 1.099,64 0.13,71 0.133,72 0.221,73 3.131,74 1.365,75 19.483,76 1.51,77 0.28,78 0.307,79 5.421,80 2.112,81 42.465,82 2.497,83 0.216,84 0.306,85 6.067,86 2.283,87 30.329,88 3.019,89 0.464,90 0.259,91 7.412,92 1.771,93 49.711,94 2.442,95 0.415,96 0.154,97 7.368,98 1.236,99 64.343,100 1.835,101 0.178,102 0.052,103 3.689,104 0.472,105 30.883,106 0.848,107 0.021,108 0.009,109 0.737,110 0.121,111 3.052,112 0.272,119 14,120 13,121 0.399,122 0.83,123 0.857,124 0.884,125 0.884,126 0.884,127 2.444,128 0.821,129 -0.63,130 -0.75,131 -0.88,132 35.3,136 1,142 2,144 2,146 1,147 1,149 1,151 1,152 1,153 3,155 1,156 2,159 2.553}
{0 CHEMBL2147354,1 15.298,2 0.952,3 3.614,4 2.764,5 1.56,6 0.512,7 0.769,8 1.208,9 3.393,10 5.457,11 1.464,12 3.614,13 1.009,14 -0.004,15 -2.48,16 1.902,17 4.1,18 0.202,19 0.041,20 40.247,21 9.248,22 0.5,23 2.953,24 3.043,25 2.761,26 2.565,27 4.273,28 2.502,29 3.343,30 3.457,31 3.005,32 2.875,33 4.826,34 2.778,35 3.428,36 3.59,37 2.903,38 2.777,39 4.717,40 2.684,41 3.476,42 3.622,43 3.03,44 2.598,45 4.924,46 2.529,47 3.25,48 3.475,49 1.807,50 2.046,51 4.765,52 1.837,53 2.445,54 2.753,55 0.458,56 0.976,57 3.584,58 0.833,59 1.02,60 1.365,61 0.014,62 0.255,63 1.099,64 0.13,71 0.086,72 0.244,73 3.049,74 1.71,75 16.64,76 1.647,77 0.182,78 0.355,79 7.106,80 2.965,81 36.513,82 2.996,83 0.135,84 0.35,85 6.051,86 2.912,87 23.558,88 3.251,89 0.2,90 0.363,91 10.544,92 3.094,93 32.438,94 2.841,95 0.31,96 0.238,97 10.241,98 2.494,99 57.908,100 2.403,101 0.153,102 0.08,103 4.167,104 0.829,105 28.431,106 0.912,107 0.015,108 0.014,109 0.941,110 0.2,111 2.587,112 0.314,119 14,120 13,121 0.436,122 0.83,123 0.857,124 0.884,125 0.884,126 0.884,127 2.444,128 1.104,129 -1.44,130 -1.52,131 -1.57,132 35.3,136 1,142 2,144 2,146 1,147 1,149 1,151 1,152 1,153 1,155 1,156 2,158 2,159 2}
{0 CHEMBL344794,1 18.952,2 0.806,3 3.769,4 2.788,5 1.962,6 0.445,7 0.914,8 1.344,9 3.24,10 5.416,11 1.518,12 3.769,13 0.818,14 -0.079,15 -2.345,16 1.612,17 4,18 -0.396,19 0.157,20 33.534,21 7.064,23 2.991,24 3.115,25 2.455,26 2.439,27 4.208,28 2.43,29 3.487,30 3.644,31 2.787,32 2.832,33 4.823,34 2.773,35 3.795,36 4.039,37 2.568,38 2.786,39 4.942,40 2.669,41 3.614,42 3.894,43 2.212,44 2.306,45 4.832,46 2.222,47 2.947,48 3.219,49 1.598,50 1.568,51 4.529,52 1.476,53 2.182,54 2.426,55 0.445,56 0.797,57 3.497,58 0.738,59 1.02,60 1.365,61 0.014,62 0.255,63 1.099,64 0.13,71 0.066,72 0.242,73 4.072,74 1.623,75 15.361,76 2.156,77 0.154,78 0.374,79 6.951,80 2.764,81 38.448,82 3.863,83 0.201,84 0.384,85 10.479,86 2.93,87 41.007,88 4.598,89 0.27,90 0.235,91 9.515,92 1.91,93 53.65,94 3.173,95 0.226,96 0.102,97 4.97,98 0.867,99 44.164,100 1.475,101 0.114,102 0.035,103 2.3,104 0.249,105 21.824,106 0.43,107 0.011,108 0.008,109 0.508,110 0.104,111 1.963,112 0.209,119 11,120 12,121 0.373,122 0.785,123 0.888,124 0.913,125 0.913,126 0.913,127 2.357,128 0.955,129 -1.27,130 -1.36,131 -1.42,132 33.3,133 1,134 1,137 1,138 2,146 1,147 1,149 1,151 3,152 1,153 1,155 1,156 3,158 3,159 4.284}
{0 CHEMBL349501,1 52.16,2 0.837,3 3.614,4 2.419,5 1.68,6 0.383,7 0.977,8 1.207,9 3.037,10 5.163,11 1.389,12 3.614,13 0.853,14 -0.001,16 1.676,17 4.222,18 -1.155,19 1.333,20 32.529,21 7.286,23 2.972,24 3.091,25 2.398,26 2.274,27 4.347,28 2.302,29 3.356,30 3.523,31 2.582,32 2.506,33 4.895,34 2.488,35 3.492,36 3.707,37 2.598,38 2.525,39 4.788,40 2.497,41 3.539,42 3.706,43 2.542,44 2.34,45 5.242,46 2.346,47 3.46,48 3.71,49 2.005,50 1.992,51 5.071,52 1.925,53 2.927,54 3.258,55 0.659,56 1.34,57 4.025,58 1.148,59 1.515,60 1.922,61 0.028,62 0.457,63 1.609,64 0.245,71 0.133,72 0.203,73 4.066,74 1.371,75 27.718,76 1.866,77 0.26,78 0.255,79 6.44,80 1.921,81 51.965,82 2.83,83 0.212,84 0.25,85 7.565,86 2.036,87 40.911,88 3.261,89 0.473,90 0.203,91 8.562,92 1.556,93 94.715,94 2.659,95 0.465,96 0.134,97 8.634,98 1.07,99 89.082,100 2.142,101 0.263,102 0.057,103 5.318,104 0.518,105 48.688,106 1.231,107 0.034,108 0.011,109 1.092,110 0.157,111 6.158,112 0.378,119 29,120 9,121 0.395,122 0.825,123 0.903,124 0.903,125 0.903,126 0.794,127 2.347,128 0.92,129 -0.47,130 -0.6,131 -0.75,132 27.8,136 2,138 1,139 1,146 1,147 1,149 1,151 1,152 1,153 1,155 1,156 3,159 5.151}
{0 CHEMBL352205,1 88.568,2 0.839,3 2.87,4 2.345,5 1.377,6 -0.055,7 0.984,8 0.72,9 2.971,10 4.87,11 1.384,12 2.87,13 0.883,14 -0.118,15 -2.155,16 1.578,17 4.8,18 0.403,19 0.162,20 40.588,21 6.909,22 0.6,23 3.092,24 3.241,25 2.547,26 2.537,27 4.332,28 2.519,29 3.482,30 3.669,31 2.742,32 2.845,33 4.603,34 2.788,35 3.69,36 3.912,37 2.655,38 2.874,39 4.761,40 2.766,41 3.648,42 3.936,43 2.397,44 2.614,45 4.618,46 2.477,47 3.358,48 3.625,49 2.035,50 2.246,51 4.509,52 2.115,53 3.082,54 3.421,55 1.53,56 1.816,57 4.21,58 1.629,59 2.408,60 2.727,61 0.48,62 1.152,63 3.367,64 0.948,65 1.515,66 1.922,67 0.028,68 0.457,69 1.609,70 0.245,71 0.076,72 0.284,73 4.679,74 1.638,75 10.842,76 2.31,77 0.061,78 0.392,79 7.026,80 2.471,81 9.582,82 3.656,83 0.089,84 0.412,85 9.034,86 3.016,87 18.803,88 4.518,89 0.095,90 0.339,91 9.046,92 2.466,93 17.47,94 4.108,95 0.166,96 0.24,97 6.93,98 1.495,99 23.187,100 2.633,101 0.139,102 0.151,103 5.397,104 1.101,105 22.626,106 2.049,107 0.075,108 0.062,109 2.707,110 0.507,111 12.624,112 0.892,113 0.015,114 0.017,115 0.965,116 0.24,117 2.351,118 0.435,119 7,120 12,121 0.349,122 0.704,123 0.823,124 0.911,125 0.911,126 0.911,127 2.439,128 0.912,129 -2.18,130 -2.23,131 -2.2,132 35,136 1,141 4,142 1,143 1,148 1,150 1,151 4,156 3,158 4,159 6.43}
{0 CHEMBL353363,1 9.476,2 0.791,3 3.622,4 2.541,5 1.825,6 0.407,7 0.828,8 1.14,9 3.591,10 5.17,11 1.442,12 3.622,13 0.822,14 -0.024,16 1.875,17 4.222,18 -0.215,19 0.046,20 30.837,21 7.832,23 2.913,24 3.038,25 2.411,26 2.241,27 4.308,28 2.276,29 3.336,30 3.521,31 2.597,32 2.454,33 4.938,34 2.457,35 3.415,36 3.618,37 2.627,38 2.446,39 4.818,40 2.452,41 3.5,42 3.685,43 2.6,44 2.231,45 5.377,46 2.275,47 3.331,48 3.609,49 2.01,50 1.827,51 5.062,52 1.798,53 2.718,54 3.039,55 0.618,56 1.112,57 3.97,58 0.997,59 1.02,60 1.365,61 0.014,62 0.255,63 1.099,64 0.13,71 0.138,72 0.256,73 3.419,74 1.397,75 30.447,76 1.716,77 0.326,78 0.312,79 6.309,80 1.953,81 65.808,82 2.574,83 0.264,84 0.316,85 6.802,86 2.005,87 51.977,88 2.869,89 0.599,90 0.235,91 8.532,92 1.532,93 123.509,94 2.312,95 0.483,96 0.148,97 8.139,98 1.007,99 93.728,100 1.784,101 0.283,102 0.045,103 4.829,104 0.462,105 53.775,106 0.882,107 0.022,108 0.003,109 0.645,110 0.081,111 4.098,112 0.207,119 29,120 9,121 0.45,122 0.839,123 0.896,124 0.896,125 0.896,126 0.78,127 2.347,128 0.901,129 -1.47,130 -1.55,131 -1.6,132 29.4,136 2,138 1,139 1,146 1,147 1,149 1,151 1,152 1,153 1,155 1,156 2,159 3.87}
{0 CHEMBL358450,1 18.952,2 0.806,3 3.769,4 2.788,5 1.962,6 0.445,7 0.914,8 1.344,9 3.24,10 5.416,11 1.518,12 3.769,13 0.818,14 -0.079,15 -2.345,16 1.612,17 4,18 -0.396,19 0.157,20 33.534,21 7.064,23 2.991,24 3.115,25 2.455,26 2.439,27 4.208,28 2.43,29 3.487,30 3.644,31 2.787,32 2.832,33 4.823,34 2.773,35 3.795,36 4.039,37 2.568,38 2.786,39 4.942,40 2.669,41 3.614,42 3.894,43 2.212,44 2.306,45 4.832,46 2.222,47 2.947,48 3.219,49 1.598,50 1.568,51 4.529,52 1.476,53 2.182,54 2.426,55 0.445,56 0.797,57 3.497,58 0.738,59 1.02,60 1.365,61 0.014,62 0.255,63 1.099,64 0.13,71 0.066,72 0.242,73 4.072,74 1.623,75 15.361,76 2.156,77 0.154,78 0.374,79 6.951,80 2.764,81 38.448,82 3.863,83 0.201,84 0.384,85 10.479,86 2.93,87 41.007,88 4.598,89 0.27,90 0.235,91 9.515,92 1.91,93 53.65,94 3.173,95 0.226,96 0.102,97 4.97,98 0.867,99 44.164,100 1.475,101 0.114,102 0.035,103 2.3,104 0.249,105 21.824,106 0.43,107 0.011,108 0.008,109 0.508,110 0.104,111 1.963,112 0.209,119 11,120 12,121 0.373,122 0.785,123 0.888,124 0.913,125 0.913,126 0.913,127 2.357,128 0.955,129 -1.27,130 -1.36,131 -1.42,132 33.3,133 1,134 1,137 1,138 2,146 1,147 1,149 1,151 3,152 1,153 1,155 1,156 3,158 3,159 2.638}
{0 CHEMBL439835,1 9.476,2 0.818,3 3.623,4 2.555,5 1.838,6 0.408,7 0.636,8 1.38,9 3.112,10 5.171,11 1.447,12 3.623,13 0.833,14 -0.03,16 1.875,17 4.222,18 0.049,19 0.002,20 35.58,21 8.799,23 2.903,24 3.019,25 2.527,26 2.335,27 4.226,28 2.321,29 3.316,30 3.48,31 2.71,32 2.585,33 4.83,34 2.513,35 3.402,36 3.597,37 2.808,38 2.594,39 4.696,40 2.526,41 3.474,42 3.638,43 2.923,44 2.435,45 5.05,46 2.391,47 3.304,48 3.555,49 2.242,50 2.06,51 4.872,52 1.906,53 2.695,54 2.992,55 0.735,56 1.32,57 3.812,58 1.08,59 1.02,60 1.365,61 0.014,62 0.255,63 1.099,64 0.13,71 0.107,72 0.192,73 3.134,74 1.401,75 20.638,76 1.745,77 0.248,78 0.238,79 7.939,80 2.264,81 44.067,82 2.956,83 0.196,84 0.232,85 7.188,86 2.435,87 33.319,88 3.194,89 0.428,90 0.185,91 10.995,92 2.203,93 72.144,94 2.7,95 0.378,96 0.118,97 11.73,98 1.587,99 64.707,100 2.37,101 0.218,102 0.044,103 7.239,104 0.889,105 36.102,106 1.254,107 0.018,108 0.007,109 0.841,110 0.131,111 2.893,112 0.242,119 29,120 9,121 0.45,122 0.839,123 0.896,124 0.896,125 0.896,126 0.78,127 2.347,128 1.102,129 -1.66,130 -1.73,131 -1.76,132 29.4,136 2,138 1,139 1,146 1,147 1,149 1,151 1,152 1,153 1,155 1,156 2,158 1,159 4.62}
{0 CHEMBL96,2 0.541,3 3.596,4 1.642,5 0.854,6 -0.519,7 1.052,8 1.126,9 2.703,10 5.144,11 1.307,12 3.596,13 0.633,14 -0.147,16 1.592,17 4.143,18 -0.622,19 0.387,20 25.457,21 6.446,23 2.827,24 2.972,25 2.157,26 2.136,27 4.072,28 2.123,29 3.279,30 3.491,31 2.295,32 2.374,33 4.656,34 2.282,35 3.508,36 3.795,37 2.005,38 2.307,39 4.563,40 2.167,41 3.242,42 3.535,43 1.786,44 1.954,45 4.369,46 1.849,47 2.846,48 3.106,49 1.579,50 1.452,51 4.498,52 1.397,53 2.182,54 2.426,55 0.445,56 0.797,57 3.497,58 0.738,59 1.02,60 1.365,61 0.014,62 0.255,63 1.099,64 0.13,71 0.068,72 0.174,73 3.861,74 1.218,75 15.945,76 1.848,77 0.173,78 0.209,79 6.206,80 1.697,81 40.245,82 2.794,83 0.236,84 0.179,85 7.96,86 1.529,87 49.538,88 2.874,89 0.195,90 0.117,91 6.136,92 0.936,93 39.884,94 1.956,95 0.221,96 0.057,97 4.3,98 0.519,99 43.346,100 1.097,101 0.117,102 0.019,103 2.135,104 0.152,105 22.198,106 0.403,107 0.012,108 0.004,109 0.41,110 0.064,111 2.042,112 0.147,119 17,120 6,121 0.398,122 0.726,123 0.875,124 0.875,125 0.875,126 0.75,127 2.138,128 1.095,129 1.23,130 1.02,131 0.7,132 25,133 2,136 1,146 1,147 1,149 1,151 1,152 1,153 1,155 1,156 2,159 2.62}
