"molecule_id","C.","AMW","H.","Me","Mi","Mp","Mv","MW","N.","pXC50"
{1 39.6,2 5.934,3 56.6,4 0.979,5 1.125,6 0.629,7 0.572,8 314.51,10 5.516}
{0 CHEMBL11,1 42.2,2 6.232,3 53.3,4 0.976,5 1.124,6 0.653,7 0.596,8 280.45,9 4.4,10 4.6}
{0 CHEMBL110739,1 38.2,2 6.3,3 54.5,4 0.992,5 1.128,6 0.623,7 0.577,8 346.51,10 4.664}
{0 CHEMBL1197556,1 47.9,2 6.822,3 47.9,4 0.979,5 1.112,6 0.688,7 0.637,8 327.48,9 4.2,10 5.461}
{0 CHEMBL1236196,1 30.2,2 4.576,3 67.9,4 0.963,5 1.146,6 0.572,7 0.495,8 242.53,9 1.9,10 4.407}
{0 CHEMBL1237044,1 36.4,2 5.987,3 56.8,4 0.985,5 1.134,6 0.615,7 0.563,8 263.42,9 2.3,10 4.28}
{0 CHEMBL1272,1 39.1,2 6.56,3 52.2,4 0.993,5 1.129,6 0.634,7 0.592,8 452.65,9 2.9,10 5.036}
{0 CHEMBL134,1 39.1,2 10.005,3 39.1,4 1.021,5 1.132,6 0.73,7 0.688,8 230.11,9 13,10 4.646}
{0 CHEMBL135,1 40.9,2 6.191,3 54.5,4 0.983,5 1.123,6 0.637,7 0.585,8 272.42,10 5.242}
{0 CHEMBL1626,1 42,2 6.879,3 52,4 0.985,5 1.121,6 0.664,7 0.608,8 343.93,9 2,10 5.31}
{0 CHEMBL163,1 37.8,2 7.358,3 49,4 1,5 1.129,6 0.659,7 0.614,8 721.05,9 6.1,10 4.47}
{0 CHEMBL170988,1 33.3,2 6.843,3 50,4 0.998,5 1.152,6 0.628,7 0.591,8 205.3,9 16.7,10 5}
{0 CHEMBL1724,1 41.2,2 6.676,3 51,4 0.993,5 1.124,6 0.645,7 0.603,8 340.48,9 2,10 4.188}
{0 CHEMBL182,1 29,2 8.235,3 41.9,4 1.044,5 1.161,6 0.609,7 0.615,8 255.27,9 16.1,10 3.287}
{0 CHEMBL184,1 29.6,2 8.342,3 40.7,4 1.042,5 1.162,6 0.618,7 0.623,8 225.24,9 18.5,10 3.82}
{0 CHEMBL197,1 38,2 6.404,3 53.5,4 0.992,5 1.131,6 0.627,7 0.583,8 454.67,9 2.8,10 5.353}
{0 CHEMBL2,1 38.8,2 7.826,3 42.9,4 1.018,5 1.136,6 0.652,7 0.636,8 383.45,9 10.2,10 5.37}
{0 CHEMBL2074647,1 34.3,2 6.438,3 54.3,4 1.001,5 1.139,6 0.606,7 0.569,8 225.32,9 2.9,10 4}
{0 CHEMBL2074704,1 30.8,2 4.595,3 67.7,4 0.963,5 1.145,6 0.575,7 0.498,8 298.65,9 1.5,10 5.127}
{0 CHEMBL2074726,1 29.5,2 4.555,3 68.2,4 0.964,5 1.148,6 0.569,7 0.492,8 200.44,9 2.3,10 4.276}
{0 CHEMBL2074727,1 33.3,2 6.581,3 52.4,4 0.996,5 1.148,6 0.618,7 0.579,8 276.41,9 11.9,10 3.996}
{0 CHEMBL2074760,1 40.4,2 6.529,3 51.9,4 0.989,5 1.127,6 0.643,7 0.597,8 339.5,9 3.8,10 4.93}
{0 CHEMBL2074837,1 31.2,2 4.607,3 67.5,4 0.963,5 1.144,6 0.577,7 0.499,8 354.77,9 1.3,10 5.523}
{0 CHEMBL2074857,1 29.3,2 4.547,3 68.3,4 0.964,5 1.149,6 0.568,7 0.491,8 186.41,9 2.4,10 4.046}
{0 CHEMBL2074900,1 47.1,2 7.582,3 47.1,4 0.985,5 1.111,6 0.705,7 0.649,8 257.78,9 2.9,10 6.523}
{0 CHEMBL21578,1 41.7,2 6.76,3 50,4 0.991,5 1.125,6 0.652,7 0.61,8 324.46,9 4.2,10 4.694}
{0 CHEMBL22,1 35.9,2 7.445,3 46.2,4 1.015,5 1.142,6 0.634,7 0.613,8 290.36,9 10.3,10 4.246}
{0 CHEMBL23,1 40,2 7.538,3 47.3,4 1.003,5 1.122,6 0.666,7 0.626,8 414.57,9 3.6,10 4.907}
{0 CHEMBL2364536,1 40.4,2 6.529,3 51.9,4 0.989,5 1.127,6 0.643,7 0.597,8 339.5,9 3.8,10 4.705}
{0 CHEMBL27,1 40,2 6.484,3 52.5,4 0.99,5 1.127,6 0.638,7 0.593,8 259.38,9 2.5,10 4.199}
{0 CHEMBL290106,1 48,2 14.242,3 24,4 1.058,5 1.088,6 0.872,7 0.822,8 356.05,10 5.409}
{0 CHEMBL30,1 30.3,2 7.648,3 48.5,4 1.003,5 1.151,6 0.651,7 0.605,8 252.39,9 18.2,10 4}
{0 CHEMBL311617,1 48,2 6.81,3 48,4 0.978,5 1.111,6 0.688,7 0.637,8 170.25,9 4,10 4.873}
{0 CHEMBL321582,1 42.3,2 6.99,3 48.1,4 0.994,5 1.125,6 0.66,7 0.621,8 363.5,9 5.8,10 4.565}
{0 CHEMBL387326,1 41.7,2 6.76,3 50,4 0.991,5 1.125,6 0.652,7 0.61,8 324.46,9 4.2,10 4.464}
{0 CHEMBL415,1 42.2,2 6.998,3 51.1,4 0.983,5 1.122,6 0.672,7 0.615,8 314.89,9 4.4,10 4.714}
{0 CHEMBL42055,1 41.8,2 7.901,3 45.5,4 1.011,5 1.137,6 0.67,7 0.635,8 434.57,9 3.6,10 4.048}
{0 CHEMBL43,1 44.7,2 8.372,3 40.4,4 1.009,5 1.114,6 0.705,7 0.673,8 393.5,9 6.4,10 5.301}
{0 CHEMBL46,1 43.9,2 7.156,3 46.3,4 0.993,5 1.123,6 0.672,7 0.634,8 293.4,9 7.3,10 4.345}
{0 CHEMBL481,1 40.7,2 7.244,3 46.9,4 1.005,5 1.127,6 0.651,7 0.621,8 586.75,9 4.9,10 4.682}
{0 CHEMBL493682,1 39.1,2 6.9,3 50,4 1.003,5 1.128,6 0.635,7 0.602,8 317.42,9 2.2,10 4.329}
{0 CHEMBL517,1 38.9,2 6.288,3 53.7,4 0.984,5 1.132,6 0.636,7 0.586,8 339.53,9 5.6,10 4.044}
{0 CHEMBL517712,1 38.6,2 6.577,3 52.3,4 0.996,5 1.129,6 0.631,7 0.59,8 289.41,9 2.3,10 4.914}
{0 CHEMBL53,1 45.9,2 7.226,3 45.9,4 0.995,5 1.115,6 0.676,7 0.64,8 267.35,9 2.7,10 4.682}
{0 CHEMBL546,1 35.7,2 6.319,3 54.8,4 0.995,5 1.136,6 0.613,7 0.57,8 265.39,9 2.4,10 4.544}
{0 CHEMBL548,1 35.1,2 6.185,3 56.1,4 0.996,5 1.135,6 0.604,7 0.561,8 352.52,10 6.182}
{0 CHEMBL549,1 44.4,2 7.21,3 46.7,4 0.997,5 1.127,6 0.667,7 0.631,8 324.43,9 4.4,10 4.726}
{0 CHEMBL55,1 38.8,2 6.948,3 49,4 0.998,5 1.134,6 0.644,7 0.608,8 340.47,9 8.2,10 4.656}
{0 CHEMBL564,1 42.5,2 7.111,3 50,4 0.981,5 1.116,6 0.688,7 0.624,8 284.46,9 5,10 4.764}
{0 CHEMBL58,1 36.7,2 7.409,3 46.7,4 1.016,5 1.137,6 0.631,7 0.612,8 444.54,9 6.7,10 4.358}
{0 CHEMBL611,1 35.8,2 7.311,3 47.2,4 1.012,5 1.141,6 0.631,7 0.608,8 387.49,9 9.4,10 4.625}
{0 CHEMBL629,1 45.5,2 6.305,3 52.3,4 0.973,5 1.115,6 0.668,7 0.609,8 277.44,9 2.3,10 4.772}
{0 CHEMBL631,1 40.4,2 6.567,3 51.9,4 0.992,5 1.125,6 0.64,7 0.596,8 341.49,9 1.9,10 4.955}
{0 CHEMBL640,1 34.2,2 6.194,3 55.3,4 0.989,5 1.143,6 0.614,7 0.566,8 235.37,9 7.9,10 4.131}
{0 CHEMBL642,1 34.6,2 6.471,3 53.8,4 1,5 1.139,6 0.61,7 0.572,8 336.48,9 3.8,10 4.019}
{0 CHEMBL643,1 42.5,2 7.111,3 50,4 0.981,5 1.116,6 0.688,7 0.624,8 284.46,9 5,10 4.455}
{0 CHEMBL644,1 41.7,2 6.135,3 54.2,4 0.975,5 1.125,6 0.649,7 0.591,8 294.48,9 4.2,10 4.558}
{0 CHEMBL655,1 50,2 9.05,3 36.1,4 1.012,5 1.119,6 0.733,7 0.707,8 325.79,9 8.3,10 5.432}
{0 CHEMBL70,1 42.5,2 7.134,3 47.5,4 1.001,5 1.122,6 0.656,7 0.623,8 285.37,9 2.5,10 4.553}
{0 CHEMBL71,1 42.5,2 7.972,3 47.5,4 0.989,5 1.115,6 0.709,7 0.645,8 318.9,9 5,10 4.569}
{0 CHEMBL72,1 42.9,2 6.343,3 52.4,4 0.977,5 1.123,6 0.658,7 0.603,8 266.42,9 4.8,10 4.246}
{0 CHEMBL728,1 40.8,2 7.632,3 49,4 0.988,5 1.121,6 0.692,7 0.63,8 373.99,9 6.1,10 4.305}
{0 CHEMBL753,1 41.9,2 7.067,3 51.2,4 0.988,5 1.121,6 0.667,7 0.613,8 303.86,9 2.3,10 4.821}
{0 CHEMBL757,1 39.1,2 5.966,3 56.5,4 0.981,5 1.126,6 0.626,7 0.571,8 274.44,10 4.455}
{0 CHEMBL790,1 34.4,2 7.899,3 46.9,4 1.006,5 1.147,6 0.659,7 0.62,8 505.52,9 15.6,10 6.678}
{0 CHEMBL807,1 35.3,2 5.275,3 61.8,4 0.969,5 1.137,6 0.606,7 0.538,8 179.34,9 2.9,10 4.565}
{0 CHEMBL815,1 33.9,2 6.009,3 57.6,4 0.994,5 1.137,6 0.597,7 0.551,8 354.54,10 6.321}
{0 CHEMBL841,1 43.3,2 7.121,3 49.3,4 0.99,5 1.119,6 0.671,7 0.623,8 477.09,9 3,10 4.625}
{0 CHEMBL86,1 33.3,2 7.139,3 52.4,4 1.003,5 1.143,6 0.629,7 0.585,8 299.84,9 7.1,10 4.023}
{0 CHEMBL900,1 41.9,2 6.266,3 53.5,4 0.98,5 1.123,6 0.647,7 0.594,8 269.42,9 2.3,10 4.45}
{0 CHEMBL908,1 46.2,2 8.1,3 46.2,4 0.986,5 1.105,6 0.727,7 0.661,8 315.89,9 2.6,10 4.109}
{0 CHEMBL932,1 31.6,2 6.641,3 52.6,4 1.003,5 1.151,6 0.606,7 0.572,8 504.72,9 10.5,10 4.092}
{0 CHEMBL9324,1 27.6,2 4.493,3 69,4 0.965,5 1.153,6 0.56,7 0.484,8 130.29,9 3.4,10 3.64}
{0 CHEMBL945,1 26.1,2 9.985,3 34.8,4 1.054,5 1.176,6 0.657,7 0.662,8 229.66,9 30.4,10 4.244}
{0 CHEMBL95,1 44.8,2 6.838,3 48.3,4 0.983,5 1.12,6 0.675,7 0.628,8 198.29,9 6.9,10 4.081}
