{
  "data_set_description": {
    "collection_date": "November 2013",
    "creator": "Dr Jeremy Besnard, Dr Ivan Olier, Dr Noureddin Sadawi, Dr Larisa Soldatova, Dr Crina Grosan, Prof Ross King, Dr Richard Bickerton, Prof Andrew Hopkins and Dr Willem van Hoorn",
    "default_target_attribute": "pXC50",
    "description": "This dataset contains QSAR data (from ChEMBL version 17) showing activity values (unit is pseudo-pCI50) of several compounds on drug target ChEMBL_ID: CHEMBL2553 (TID: 10929), and it has 154 rows and 1326 features (not including molecule IDs and class feature: molecule_id and pXC50). The features represent Molecular Descriptors which were generated from SMILES strings. Missing value imputation was applied to this dataset (By choosing the Median).",
    "description_version": "1",
    "file_id": "3455228",
    "format": "ARFF",
    "id": "31632",
    "licence": "Public",
    "md5_checksum": "8f8ce4e74ebf73bca3c5fc5caf406998",
    "minio_url": "https://data.openml.org/datasets/0003/31632/dataset_31632.pq",
    "name": "QSAR-DATASET-FOR-DRUG-TARGET-CHEMBL2553",
    "original_data_url": "https://www.ebi.ac.uk/chembl/target/inspect/CHEMBL2553",
    "parquet_url": "https://data.openml.org/datasets/0003/31632/dataset_31632.pq",
    "processing_date": "2018-10-04 02:26:25",
    "row_id_attribute": "molecule_id",
    "status": "deactivated",
    "tag": [
      "MetaQSAR",
      "study_13"
    ],
    "upload_date": "2016-07-15T08:06:15",
    "url": "https://api.openml.org/data/v1/download/3455228/QSAR-DATASET-FOR-DRUG-TARGET-CHEMBL2553.arff",
    "version": "10",
    "visibility": "public"
  }
}