"molecule_id","AMW","C.","H.","Me","Mi","Mp","Mv","MW","N.","nAB","nAT","nB","nBM","nBO","nBR","nBT","nC","nCL","nCsp","nCsp2","nCsp3","nDB","nF","nH","nHet","nHM","nI","nN","nO","nP","nS","nSK","nTB","nX","O.","RBF","RBN","SCBO","Se","Si","Sp","Sv","X.","pXC50"
{1 8.029,2 39.6,3 43.4,4 1.01,5 1.128,6 0.677,7 0.645,8 425.56,9 9.4,10 16,11 53,13 19,14 32,16 55,17 21,20 16,21 5,22 3,24 23,25 9,26 1,28 5,29 3,31 1,32 30,35 5.7,36 0.2,37 11,38 43,39 53.52,40 59.777,41 35.892,42 34.18,44 6.222}
{0 CHEMBL1079694,1 7.413,2 38.6,3 45.6,4 1.008,5 1.136,6 0.649,7 0.624,8 422.54,9 10.5,10 16,11 57,13 19,14 33,16 59,17 22,20 16,21 6,22 3,24 26,25 9,28 6,29 3,32 31,35 5.3,36 0.169,37 10,38 44,39 57.429,40 64.77,41 37.012,42 35.541,44 4.416}
{0 CHEMBL1080400,1 7.389,2 38,3 46,4 1.009,5 1.137,6 0.645,7 0.62,8 369.47,9 10,10 12,11 50,13 15,14 28,16 51,17 19,20 14,21 5,22 3,24 23,25 8,28 5,29 3,32 27,35 6,36 0.216,37 11,38 37,39 50.443,40 56.857,41 32.245,42 30.993,44 4.208}
{0 CHEMBL1080401,1 7.989,2 36.2,3 44.7,4 1.014,5 1.135,6 0.662,7 0.631,8 375.5,9 10.6,10 11,11 47,13 14,14 27,16 48,17 17,20 12,21 5,22 3,24 21,25 9,26 1,28 5,29 3,31 1,32 26,35 6.4,36 0.229,37 11,38 35.5,39 47.636,40 53.361,41 31.131,42 29.653,44 5.658}
{0 CHEMBL1081308,1 7.297,2 42.5,3 46.6,4 1.003,5 1.133,6 0.657,7 0.626,8 532.69,9 5.5,10 18,11 73,13 20,14 42,16 76,17 31,19 1,20 19,21 11,22 1,23 2,24 34,25 8,28 4,29 2,32 39,33 1,34 2,35 2.7,36 0.158,37 12,38 54,39 73.225,40 82.735,41 47.989,42 45.711,43 2.7,44 4}
{0 CHEMBL1081863,1 7.689,2 37.5,3 46.4,4 1.009,5 1.131,6 0.658,7 0.624,8 430.58,9 7.1,10 12,11 56,13 17,14 31,16 57,17 21,20 16,21 5,22 5,24 26,25 9,26 1,28 4,29 4,31 1,32 30,35 7.1,36 0.211,37 12,38 42,39 56.512,40 63.318,41 36.864,42 34.927,44 5.409}
{0 CHEMBL1081864,1 7.795,2 41.2,3 45.1,4 1.004,5 1.121,6 0.679,7 0.64,8 397.54,9 5.9,10 16,11 51,13 18,14 30,16 53,17 21,20 15,21 6,22 2,24 23,25 7,26 1,28 3,29 3,31 1,32 28,35 5.9,36 0.189,37 10,38 40,39 51.2,40 57.195,41 34.642,42 32.664,44 5.796}
{0 CHEMBL1081865,1 7.85,2 39.3,3 44.6,4 1.007,5 1.128,6 0.672,7 0.638,8 439.59,9 8.9,10 16,11 56,13 19,14 33,16 58,17 22,20 16,21 6,22 3,24 25,25 9,26 1,28 5,29 3,31 1,32 31,35 5.4,36 0.207,37 12,38 44,39 56.403,40 63.192,41 37.654,42 35.706,44 5.398}
{0 CHEMBL1082042,1 7.482,2 37.5,3 47.2,4 1.005,5 1.133,6 0.655,7 0.619,8 538.74,9 8.3,10 16,11 72,13 20,14 40,16 74,17 27,20 17,21 10,22 4,24 34,25 11,26 1,28 6,29 4,31 1,32 38,35 5.6,36 0.189,37 14,38 52,39 72.367,40 81.56,41 47.159,42 44.55,44 5.854}
{0 CHEMBL1082043,1 7.604,2 37.7,3 46.4,4 1.007,5 1.133,6 0.658,7 0.624,8 524.71,9 8.7,10 16,11 69,13 20,14 39,16 71,17 26,20 17,21 9,22 4,24 32,25 11,26 1,28 6,29 4,31 1,32 37,35 5.8,36 0.183,37 13,38 51,39 69.483,40 78.145,41 45.398,42 43.023,44 5.959}
{0 CHEMBL1089374,1 7.234,2 35,3 47.5,4 1.009,5 1.145,6 0.632,7 0.606,8 289.38,9 12.5,10 6,11 40,13 9,14 21,16 40,17 14,19 1,20 8,21 5,22 2,24 19,25 7,28 5,29 2,32 21,33 1,35 5,36 0.225,37 9,38 28,39 40.349,40 45.817,41 25.267,42 24.224,44 5.721}
{0 CHEMBL1089375,1 7.574,2 43.6,3 43.6,4 1.004,5 1.124,6 0.673,7 0.646,8 295.37,9 7.7,10 12,11 39,13 14,14 23,16 40,17 17,19 1,20 13,21 3,22 1,24 17,25 5,28 3,29 2,32 22,33 1,35 5.1,36 0.15,37 6,38 32,39 39.145,40 43.82,41 26.256,42 25.181,44 4}
{0 CHEMBL1089376,1 7.669,2 40.9,3 43.2,4 1.008,5 1.132,6 0.665,7 0.641,8 337.42,9 11.4,10 12,11 44,13 15,14 26,16 45,17 18,19 1,20 14,21 3,22 2,24 19,25 7,28 5,29 2,32 25,33 1,35 4.5,36 0.178,37 8,38 36,39 44.349,40 49.817,41 29.267,42 28.224,44 4}
{0 CHEMBL1089377,1 7.009,2 38.5,3 48.7,4 1.001,5 1.134,6 0.641,7 0.608,8 273.37,9 7.7,10 6,11 39,13 8,14 21,16 40,17 15,19 1,20 7,21 7,22 1,24 19,25 5,28 3,29 2,32 20,33 1,35 5.1,36 0.125,37 5,38 27,39 39.029,40 44.235,41 25.017,42 23.708,44 4}
{0 CHEMBL1091088,1 7.09,2 37.8,3 48.6,4 1.007,5 1.134,6 0.634,7 0.605,8 262.34,9 5.4,10 6,11 37,13 8,14 19,16 37,17 14,19 1,20 7,21 6,22 1,24 18,25 5,28 2,29 3,32 19,33 1,35 8.1,36 0.216,37 8,38 25,39 37.254,40 41.946,41 23.466,42 22.402,44 4}
{0 CHEMBL1091471,1 6.572,2 37.5,3 52.1,4 0.993,5 1.135,6 0.631,7 0.589,8 315.46,9 6.3,10 6,11 48,13 8,14 24,16 49,17 18,19 1,20 7,21 10,22 1,24 25,25 5,28 3,29 2,32 23,33 1,35 4.2,36 0.184,37 9,38 30,39 47.68,40 54.481,41 30.302,42 28.289,44 4}
{0 CHEMBL1091472,1 7.265,2 39.5,3 46.5,4 1.003,5 1.133,6 0.652,7 0.622,8 312.41,9 9.3,10 11,11 43,13 13,14 24,16 44,17 17,19 1,20 10,21 6,22 1,24 20,25 6,28 4,29 2,32 23,33 1,35 4.7,36 0.205,37 9,38 32.5,39 43.131,40 48.734,41 28.023,42 26.73,44 4}
{0 CHEMBL1091473,1 6.461,2 37.3,3 52.9,4 0.991,5 1.135,6 0.629,7 0.585,8 329.49,9 5.9,10 6,11 51,13 8,14 25,16 52,17 19,19 1,20 7,21 11,22 1,24 27,25 5,28 3,29 2,32 24,33 1,35 3.9,36 0.173,37 9,38 31,39 50.563,40 57.896,41 32.063,42 29.815,44 4}
{0 CHEMBL1094051,1 7.076,2 40,3 48.3,4 1.001,5 1.136,6 0.646,7 0.612,8 424.57,9 6.7,10 12,11 60,13 14,14 33,16 62,17 24,19 1,20 13,21 10,22 1,23 1,24 29,25 7,28 4,29 2,32 31,33 1,34 1,35 3.3,36 0.161,37 10,38 42,39 60.061,40 68.149,41 38.767,42 36.747,43 1.7,44 4}
