{
  "data_set_description": {
    "collection_date": "November 2013",
    "creator": "Dr Jeremy Besnard, Dr Ivan Olier, Dr Noureddin Sadawi, Dr Larisa Soldatova, Dr Crina Grosan, Prof Ross King, Dr Richard Bickerton, Prof Andrew Hopkins and Dr Willem van Hoorn",
    "default_target_attribute": "pXC50",
    "description": "This dataset contains QSAR data (from ChEMBL version 17) showing activity values (unit is pseudo-pCI50) of several compounds on drug target ChEMBL_ID: CHEMBL4045 (TID: 11364), and it has 969 rows and 1387 features (not including molecule IDs and class feature: molecule_id and pXC50). The features represent Molecular Descriptors which were generated from SMILES strings. Missing value imputation was applied to this dataset (By choosing the Median).",
    "description_version": "1",
    "file_id": "3453413",
    "format": "ARFF",
    "id": "31583",
    "licence": "Public",
    "md5_checksum": "ad95ce91f5f04ac68121c1af882ab2c7",
    "minio_url": "https://data.openml.org/datasets/0003/31583/dataset_31583.pq",
    "name": "QSAR-DATASET-FOR-DRUG-TARGET-CHEMBL4045",
    "original_data_url": "https://www.ebi.ac.uk/chembl/target/inspect/CHEMBL4045",
    "parquet_url": "https://data.openml.org/datasets/0003/31583/dataset_31583.pq",
    "processing_date": "2018-10-04 02:40:59",
    "row_id_attribute": "molecule_id",
    "status": "deactivated",
    "tag": [
      "MetaQSAR",
      "study_13"
    ],
    "upload_date": "2016-07-15T07:57:18",
    "url": "https://api.openml.org/data/v1/download/3453413/QSAR-DATASET-FOR-DRUG-TARGET-CHEMBL4045.arff",
    "version": "9",
    "visibility": "public"
  }
}