"molecule_id","AMW","C.","H.","Me","Mi","Mp","Mv","MW","N.","nAB","nAT","nB","nBM","nBO","nBR","nBT","nC","nCL","nCsp","nCsp2","nCsp3","nDB","nF","nH","nHet","nHM","nI","nN","nO","nP","nS","nSK","nTB","nX","O.","RBF","RBN","SCBO","Se","Si","Sp","Sv","X.","pXC50"
{1 8.778,2 48.8,3 37.2,4 1.009,5 1.113,6 0.73,7 0.699,8 377.47,9 7,10 23,11 43,13 24,14 30,16 46,17 21,20 20,21 1,22 1,23 1,24 16,25 6,26 1,28 3,29 1,31 1,32 27,34 1,35 2.3,36 0.087,37 4,38 42.5,39 43.407,40 47.87,41 31.387,42 30.037,43 2.3,44 5.4}
{0 CHEMBL101253,1 8.671,2 50,3 37.5,4 1.001,5 1.111,6 0.736,7 0.702,8 346.84,9 10,10 23,11 40,13 23,14 28,16 43,17 20,18 1,20 19,21 1,24 15,25 5,26 1,28 4,32 25,34 1,36 0.093,37 4,38 39.5,39 40.033,40 44.428,41 29.449,42 28.074,43 2.5,44 5.4}
{0 CHEMBL101311,1 8.46,2 39.6,3 43.4,4 1.012,5 1.131,6 0.684,7 0.65,8 448.39,9 9.4,10 18,11 53,13 18,14 32,16 55,17 21,18 2,20 16,21 5,24 23,25 9,26 2,28 5,29 2,32 30,34 2,35 3.8,36 0.164,37 9,38 41,39 53.647,40 59.95,41 36.267,42 34.46,43 3.8,44 5.4}
{0 CHEMBL103667,1 6.944,2 40.8,3 48.7,4 0.995,5 1.128,6 0.652,7 0.614,8 527.73,9 6.6,10 22,11 76,13 23,14 43,16 80,17 31,20 20,21 11,22 1,24 37,25 8,28 5,29 3,32 39,35 3.9,36 0.1,37 8,38 55,39 75.629,40 85.763,41 49.574,42 46.68,44 4.523}
{0 CHEMBL1081312,1 7.79,2 41.5,3 41.5,4 1.003,5 1.136,6 0.679,7 0.653,8 319.41,9 17.1,10 20,11 41,13 20,14 28,16 45,17 17,20 12,21 5,24 17,25 7,28 7,32 24,36 0.044,37 2,38 38,39 41.131,40 46.564,41 27.847,42 26.784,44 5.4}
{0 CHEMBL1084546,1 9.228,2 38.2,3 36.4,4 1.043,5 1.152,6 0.672,7 0.67,8 507.55,9 12.7,10 18,11 55,13 21,14 38,16 58,17 21,20 16,21 5,22 3,23 3,24 20,25 14,26 1,28 7,29 3,31 1,32 35,34 3,35 5.5,36 0.121,37 7,38 50,39 57.378,40 63.377,41 36.955,42 36.846,43 5.5,44 5.6}
{0 CHEMBL1164180,1 8.246,2 41,3 42.6,4 1.018,5 1.146,6 0.67,7 0.646,8 503.02,9 9.8,10 18,11 61,13 18,14 39,16 65,17 25,18 1,20 16,21 9,23 3,24 26,25 10,26 1,28 6,32 35,34 4,36 0.062,37 4,38 48,39 62.076,40 69.935,41 40.841,42 39.427,43 6.6,44 5.4}
{0 CHEMBL117697,1 7.853,2 46.9,3 40.6,4 1.002,5 1.118,6 0.696,7 0.669,8 251.31,9 9.4,10 17,11 32,13 17,14 21,16 34,17 15,20 14,21 1,24 13,25 4,28 3,29 1,32 19,35 3.1,36 0.088,37 3,38 29.5,39 32.051,40 35.78,41 22.279,42 21.413,44 4.3}
{0 CHEMBL119385,1 11.791,2 51.4,3 24.3,4 1.049,5 1.115,6 0.798,7 0.784,8 436.28,9 8.1,10 12,11 37,13 17,14 31,16 40,17 19,18 2,20 19,22 5,23 2,24 9,25 9,26 3,28 3,29 1,31 1,32 28,34 4,35 2.7,36 0.075,37 3,38 42,39 38.8,40 41.268,41 29.517,42 29.022,43 10.8,44 5.4}
{0 CHEMBL1233887,1 7.953,2 45.7,3 40,4 1.004,5 1.122,6 0.694,7 0.67,8 278.34,9 11.4,10 20,11 35,13 20,14 24,16 38,17 16,20 14,21 2,24 14,25 5,28 4,29 1,32 21,35 2.9,36 0.053,37 2,38 34,39 35.153,40 39.279,41 24.284,42 23.434,44 5.4}
{0 CHEMBL124660,1 6.781,2 37.3,3 50.6,4 0.998,5 1.136,6 0.633,7 0.596,8 562.79,9 7.2,10 17,11 83,13 18,14 45,16 87,17 31,20 15,21 16,22 1,24 42,25 10,28 6,29 4,32 41,35 4.8,36 0.115,37 10,38 54.5,39 82.825,40 94.301,41 52.557,42 49.47,44 5.4}
{0 CHEMBL1336,1 9.685,2 43.8,3 33.3,4 1.048,5 1.144,6 0.691,7 0.696,8 464.86,9 8.3,10 18,11 48,13 20,14 34,16 50,17 21,18 1,20 19,21 2,22 2,23 3,24 16,25 11,26 1,28 4,29 3,32 32,34 4,35 6.3,36 0.1,37 5,38 45,39 50.32,40 54.906,41 33.148,42 33.422,43 8.3,44 5.4}
{0 CHEMBL1421,1 8.272,2 37.3,3 44.1,4 1.01,5 1.134,6 0.679,7 0.642,8 488.07,9 11.9,10 17,11 59,13 18,14 36,16 62,17 22,18 1,20 14,21 8,22 1,24 26,25 11,26 2,28 7,29 2,31 1,32 33,34 1,35 3.4,36 0.113,37 7,38 45.5,39 59.603,40 66.923,41 40.068,42 37.862,43 1.7,44 5.4}
{0 CHEMBL1421720,1 9.8,2 46.4,3 35.7,4 1.008,5 1.097,6 0.779,7 0.723,8 274.39,9 7.1,10 15,11 28,13 16,14 20,16 30,17 13,20 12,21 1,22 1,24 10,25 5,26 2,28 2,29 1,31 2,32 18,35 3.6,36 0.1,37 3,38 28.5,39 28.218,40 30.707,41 21.807,42 20.239,44 6.2}
{0 CHEMBL1825138,1 8.661,2 40.4,3 42.3,4 1.016,5 1.136,6 0.688,7 0.656,8 450.38,9 9.6,10 17,11 52,13 17,14 33,16 55,17 21,18 2,20 14,21 7,23 1,24 22,25 9,26 2,28 5,29 1,32 30,34 3,35 1.9,36 0.091,37 5,38 41.5,39 52.832,40 59.081,41 35.75,42 34.128,43 5.8,44 5.4}
{0 CHEMBL1870106,1 7.963,2 34.9,3 41.9,4 1.021,5 1.151,6 0.646,7 0.633,8 342.41,9 18.6,10 15,11 43,13 16,14 28,16 46,17 15,20 9,21 6,22 1,24 18,25 10,28 8,29 2,32 25,35 4.7,36 0.065,37 3,38 36.5,39 43.887,40 49.481,41 27.762,42 27.235,44 5.4}
{0 CHEMBL1879463,1 7.959,2 50.8,3 39,4 0.996,5 1.109,6 0.718,7 0.688,8 469.58,9 8.5,10 28,11 59,13 30,14 41,16 64,17 30,19 1,20 25,21 4,22 1,24 23,25 6,28 5,29 1,32 36,33 1,35 1.7,36 0.047,37 3,38 58,39 58.789,40 65.438,41 42.336,42 40.563,44 5.4}
{0 CHEMBL189963,1 7.219,2 38.7,3 46.8,4 1.001,5 1.137,6 0.65,7 0.619,8 447.6,9 11.3,10 12,11 62,13 15,14 37,16 66,17 24,20 13,21 11,22 3,24 29,25 9,28 7,29 2,32 33,35 3.2,36 0.076,37 5,38 46,39 62.087,40 70.474,41 40.324,42 38.374,44 5.4}
{0 CHEMBL191003,1 10.113,2 38.5,3 30.8,4 1.057,5 1.151,6 0.691,7 0.701,8 394.4,9 15.4,10 17,11 39,13 20,14 29,16 41,17 15,20 15,22 3,23 2,24 12,25 12,26 1,28 6,29 3,31 1,32 27,34 2,35 7.7,36 0.098,37 4,38 40.5,39 41.229,40 44.878,41 26.966,42 27.334,43 5.1,44 6}
{0 CHEMBL1929238,1 8.038,2 36.2,3 47.8,4 1.007,5 1.133,6 0.669,7 0.623,8 554.6,9 7.2,10 11,11 69,13 14,14 38,16 71,17 25,18 2,20 13,21 12,22 3,24 33,25 11,26 3,28 5,29 3,31 1,32 36,34 2,35 4.3,36 0.099,37 7,38 46.5,39 69.469,40 78.156,41 46.176,42 42.995,43 2.9,44 4.523}
{0 CHEMBL1949855,1 10.624,2 47.1,3 29.4,4 1.037,5 1.116,6 0.756,7 0.743,8 180.6,9 11.8,10 6,11 17,13 8,14 13,16 18,17 8,18 1,20 8,22 2,24 5,25 4,26 1,28 2,29 1,32 12,34 1,35 5.9,38 18,39 17.622,40 18.98,41 12.847,42 12.639,43 5.9,44 5.3}
{0 CHEMBL1964382,1 19.329,2 45.5,3 36.4,4 1.01,5 1.087,6 0.91,7 0.768,8 637.87,10 12,11 33,13 12,14 22,15 2,16 34,17 15,20 12,21 3,24 12,25 6,26 4,27 2,29 2,32 21,34 4,35 6.1,36 0.059,37 2,38 28,39 33.32,40 35.865,41 30.023,42 25.328,43 12.1,44 5.4}
{0 CHEMBL1964441,1 8.029,2 45.5,3 41.8,4 0.998,5 1.116,6 0.709,7 0.668,8 441.6,9 9.1,10 22,11 55,13 24,14 35,16 58,17 25,19 2,20 20,21 3,22 1,24 23,25 7,26 1,28 5,29 1,31 1,32 32,33 1,35 1.8,36 0.069,37 4,38 49,39 54.865,40 61.358,41 38.983,42 36.75,44 5.4}
{0 CHEMBL1964444,1 9.114,2 44.7,3 34.2,4 1.041,5 1.15,6 0.68,7 0.687,8 346.34,9 10.5,10 17,11 38,13 18,14 27,16 40,17 17,20 15,21 2,22 1,23 3,24 13,25 8,28 4,29 1,32 25,34 3,35 2.6,36 0.05,37 2,38 36.5,39 39.574,40 43.713,41 25.858,42 26.111,43 7.9,44 5.4}
{0 CHEMBL1964718,1 7.771,2 38.1,3 42.9,4 1.014,5 1.14,6 0.655,7 0.636,8 163.2,9 14.3,11 21,13 4,14 13,16 22,17 8,20 6,21 2,22 4,24 9,25 4,28 3,29 1,32 12,35 4.8,38 17,39 21.284,40 23.95,41 13.756,42 13.359,44 4.3}
{0 CHEMBL1964902,1 7.859,2 45,3 41.7,4 1.011,5 1.118,6 0.678,7 0.657,8 471.55,9 5,10 22,11 60,13 25,14 38,16 63,17 27,20 22,21 5,22 3,24 25,25 8,28 3,29 5,32 35,35 8.3,36 0.127,37 8,38 52,39 60.662,40 67.109,41 40.665,42 39.433,44 5.4}
{0 CHEMBL1964948,1 6.841,2 40.3,3 49.4,4 0.992,5 1.131,6 0.651,7 0.61,8 526.75,9 7.8,10 22,11 77,13 24,14 42,16 80,17 31,20 21,21 10,22 2,24 38,25 8,28 6,29 2,32 39,35 2.6,36 0.113,37 9,38 55,39 76.403,40 87.052,41 50.126,42 46.987,44 5.4}
{0 CHEMBL1965033,1 9.45,2 44.2,3 32.6,4 1.053,5 1.155,6 0.675,7 0.692,8 406.37,9 9.3,10 12,11 43,13 16,14 31,16 45,17 19,20 17,21 2,22 4,23 4,24 14,25 10,28 4,29 2,32 29,34 4,35 4.7,36 0.067,37 3,38 41,39 45.298,40 49.677,41 29.012,42 29.736,43 9.3,44 5.4}
{0 CHEMBL1965169,1 10.673,2 48.1,3 37,4 1.003,5 1.111,6 0.756,7 0.711,8 288.16,9 11.1,10 16,11 27,13 16,14 19,15 1,16 29,17 13,20 12,21 1,24 10,25 4,26 1,28 3,32 17,34 1,36 0.034,37 1,38 27,39 27.069,40 29.997,41 20.415,42 19.197,43 3.7,44 5.4}
{0 CHEMBL1965170,1 8.292,2 42.2,3 40.6,4 1.013,5 1.123,6 0.689,7 0.663,8 530.66,9 9.4,10 27,11 64,13 28,14 42,16 68,17 27,20 23,21 4,22 1,24 26,25 11,26 1,28 6,29 4,31 1,32 38,35 6.3,36 0.118,37 8,38 56.5,39 64.832,40 71.899,41 44.114,42 42.443,44 5.4}
{0 CHEMBL1965387,1 8.214,2 44.3,3 41,4 1.007,5 1.123,6 0.695,7 0.666,8 501.03,9 9.8,10 27,11 61,13 28,14 40,16 65,17 27,18 1,20 24,21 3,22 1,24 25,25 9,26 1,28 6,29 2,32 36,34 1,35 3.3,36 0.123,37 8,38 54.5,39 61.425,40 68.505,41 42.415,42 40.653,43 1.6,44 5.4}
{0 CHEMBL1965660,1 10.241,2 44.1,3 32.4,4 1.03,5 1.125,6 0.742,7 0.723,8 348.21,9 14.7,10 17,11 34,13 18,14 25,16 36,17 15,18 2,20 15,22 1,24 11,25 8,26 2,28 5,29 1,32 23,34 2,35 2.9,36 0.083,37 3,38 34.5,39 35.018,40 38.25,41 25.244,42 24.584,43 5.9,44 5.6}
{0 CHEMBL1966175,1 7.676,2 40.5,3 42.9,4 1.006,5 1.135,6 0.668,7 0.643,8 322.41,9 14.3,10 14,11 42,13 16,14 27,16 45,17 17,19 1,20 9,21 7,22 1,24 18,25 7,28 6,29 1,32 24,33 1,35 2.4,36 0.044,37 2,38 37,39 42.24,40 47.69,41 28.057,42 27.004,44 5.4}
{0 CHEMBL1966799,1 10.538,2 37.5,3 31.3,4 1.038,5 1.147,6 0.728,7 0.715,8 168.6,9 25,10 10,11 16,13 10,14 12,16 17,17 6,18 1,20 6,24 5,25 5,26 1,28 4,32 11,34 1,38 17,39 16.615,40 18.352,41 11.642,42 11.44,43 6.3,44 4.3}
{0 CHEMBL1967252,1 7.751,2 48.1,3 40.7,4 0.994,5 1.117,6 0.706,7 0.673,8 209.27,9 11.1,10 16,11 27,13 16,14 18,16 29,17 13,20 12,21 1,24 11,25 3,28 3,32 16,36 0.034,37 1,38 26,39 26.84,40 30.156,41 19.063,42 18.171,44 4.8}
{0 CHEMBL1967336,1 9.719,2 45.2,3 29,4 1.049,5 1.149,6 0.698,7 0.715,8 301.28,9 16.1,10 17,11 31,13 18,14 24,16 33,17 14,20 14,22 1,23 2,24 9,25 8,28 5,29 1,32 22,34 2,35 3.2,36 0.061,37 2,38 33.5,39 32.513,40 35.626,41 21.642,42 22.169,43 6.5,44 5.4}
{0 CHEMBL1967513,1 10.479,2 45.7,3 28.6,4 1.058,5 1.15,6 0.713,7 0.726,8 366.75,9 11.4,10 17,11 35,13 18,14 27,16 37,17 16,18 1,20 15,21 1,22 1,23 3,24 10,25 9,26 1,28 4,29 1,32 25,34 4,35 2.9,36 0.054,37 2,38 36.5,39 37.014,40 40.242,41 24.955,42 25.412,43 11.4,44 5.4}
{0 CHEMBL1967612,1 12.802,2 41.2,3 23.5,4 1.074,5 1.107,6 0.788,7 0.778,8 217.64,9 5.9,10 6,11 17,13 9,14 14,16 18,17 7,18 1,20 7,22 3,24 4,25 6,26 2,28 1,29 3,31 1,32 13,34 1,35 17.6,38 20,39 18.251,40 18.821,41 13.398,42 13.234,43 5.9,44 4.6}
{0 CHEMBL1967878,1 7.168,2 38.1,3 47.6,4 1.002,5 1.143,6 0.644,7 0.612,8 451.61,9 11.1,10 12,11 63,13 14,14 37,16 67,17 24,20 13,21 11,22 2,23 1,24 30,25 9,28 7,29 1,32 33,34 1,35 1.6,36 0.09,37 6,38 45,39 63.156,40 72.02,41 40.569,42 38.569,43 1.6,44 5.4}
{0 CHEMBL1967992,1 7.713,2 51.4,3 40.5,4 0.989,5 1.108,6 0.719,7 0.682,8 285.37,9 8.1,10 18,11 37,13 19,14 24,16 39,17 19,19 1,20 17,21 1,24 15,25 3,28 3,32 22,33 1,36 0.103,37 4,38 35,39 36.607,40 40.986,41 26.586,42 25.225,44 5.4}
{0 CHEMBL1967998,1 7.877,2 40.4,3 43.9,4 1.002,5 1.135,6 0.68,7 0.645,8 449.01,9 14,10 22,11 57,13 22,14 36,16 61,17 23,18 1,20 17,21 6,24 25,25 9,26 1,28 8,32 32,34 1,36 0.098,37 6,38 47,39 57.091,40 64.667,41 38.756,42 36.74,43 1.8,44 5.4}
{0 CHEMBL1968130,1 11.306,2 33.3,3 26.7,4 1.056,5 1.162,6 0.726,7 0.729,8 169.59,9 33.3,10 10,11 15,13 10,14 12,16 16,17 5,18 1,20 5,24 4,25 6,26 1,28 5,32 11,34 1,38 17,39 15.833,40 17.436,41 10.886,42 10.935,43 6.7,44 5.1}
{0 CHEMBL1968515,1 8.468,2 41.7,3 37.5,4 1.025,5 1.132,6 0.675,7 0.67,8 203.22,9 12.5,10 6,11 24,13 8,14 17,16 26,17 10,20 8,21 2,22 2,24 9,25 5,28 3,29 2,32 15,35 8.3,38 22,39 24.611,40 27.159,41 16.21,42 16.074,44 4.5}
{0 CHEMBL1968705,1 7.338,2 42.5,3 45.2,4 0.998,5 1.127,6 0.669,7 0.636,8 535.71,9 9.6,10 27,11 73,13 28,14 45,16 78,17 31,20 22,21 9,22 1,24 33,25 9,28 7,29 2,32 40,35 2.7,36 0.128,37 10,38 59.5,39 72.854,40 82.305,41 48.847,42 46.428,44 5.4}
{0 CHEMBL1968868,1 9.926,2 47.2,3 27.8,4 1.053,5 1.149,6 0.704,7 0.724,8 357.32,9 13.9,10 17,11 36,13 19,14 28,16 38,17 17,19 1,20 15,21 1,22 1,23 3,24 10,25 9,28 5,29 1,32 26,33 1,34 3,35 2.8,36 0.053,37 2,38 39.5,39 37.909,40 41.381,41 25.341,42 26.079,43 8.3,44 5.4}
{0 CHEMBL1969151,1 7.57,2 38.8,3 46.9,4 0.998,5 1.136,6 0.668,7 0.626,8 370.93,9 12.2,10 16,11 49,13 16,14 29,16 52,17 19,18 1,20 11,21 8,24 23,25 7,26 1,28 6,32 26,34 1,36 0.077,37 4,38 37,39 48.887,40 55.671,41 32.745,42 30.697,43 2,44 6.2}
{0 CHEMBL1969664,1 7.777,2 44.2,3 41.9,4 1.006,5 1.124,6 0.681,7 0.656,8 334.41,9 9.3,10 16,11 43,13 17,14 28,16 46,17 19,19 1,20 13,21 5,24 18,25 6,28 4,29 2,32 25,33 1,35 4.7,36 0.065,37 3,38 38,39 43.247,40 48.318,41 29.262,42 28.203,44 5.4}
{0 CHEMBL1969942,1 8.449,2 48.8,3 36.6,4 1.013,5 1.123,6 0.707,7 0.691,8 346.39,9 9.8,10 22,11 41,13 23,14 29,16 44,17 20,20 20,22 1,23 1,24 15,25 6,28 4,29 1,32 26,34 1,35 2.4,36 0.068,37 3,38 41,39 41.549,40 46.034,41 28.983,42 28.345,43 2.4,44 5.4}
{0 CHEMBL1970290,1 6.841,2 40.3,3 49.4,4 0.992,5 1.131,6 0.651,7 0.61,8 526.75,9 7.8,10 22,11 77,13 24,14 42,16 80,17 31,20 21,21 10,22 2,24 38,25 8,28 6,29 2,32 39,35 2.6,36 0.125,37 10,38 55,39 76.403,40 87.052,41 50.126,42 46.987,44 5.9}
{0 CHEMBL1970317,1 8.818,2 46.2,3 36.5,4 1.014,5 1.122,6 0.719,7 0.694,8 458.56,9 11.5,10 27,11 52,13 28,14 37,16 56,17 24,20 23,21 1,22 1,23 1,24 19,25 9,26 1,28 6,29 1,31 1,32 33,34 1,35 1.9,36 0.071,37 4,38 51.5,39 52.712,40 58.365,41 37.404,42 36.101,43 1.9,44 5.4}
{0 CHEMBL1970340,1 8.38,2 48.1,3 37,4 1.015,5 1.114,6 0.702,7 0.688,8 226.25,9 7.4,10 16,11 27,13 16,14 19,16 29,17 13,20 13,24 10,25 4,28 2,29 2,32 17,35 7.4,36 0.034,37 1,38 27,39 27.393,40 30.076,41 18.966,42 18.58,44 4.1}
{0 CHEMBL1970352,1 10.474,2 48.9,3 40,4 1.002,5 1.102,6 0.753,7 0.694,8 471.31,9 2.2,10 21,11 45,13 22,14 30,16 48,17 22,20 19,21 3,22 1,24 18,25 5,26 1,27 1,28 1,29 3,32 27,34 1,35 6.7,36 0.083,37 4,38 41.5,39 45.105,40 49.584,41 33.881,42 31.224,43 2.2,44 5.9}
{0 CHEMBL1971132,1 8.304,2 43.2,3 40.9,4 1.033,5 1.143,6 0.654,7 0.65,8 365.38,9 2.3,10 12,11 44,13 13,14 28,16 46,17 19,20 13,21 6,22 1,23 3,24 18,25 7,28 1,29 3,32 26,34 3,35 6.8,36 0.13,37 6,38 35,39 45.458,40 50.298,41 28.796,42 28.584,43 6.8,44 5.4}
{0 CHEMBL1971223,1 7.037,2 41.1,3 47.9,4 0.997,5 1.128,6 0.655,7 0.619,8 513.7,9 6.8,10 22,11 73,13 24,14 41,16 76,17 30,20 21,21 9,22 2,24 35,25 8,28 5,29 3,32 38,35 4.1,36 0.105,37 8,38 54,39 72.745,40 82.348,41 47.813,42 45.153,44 5.4}
{0 CHEMBL1971227,1 9.31,2 44,3 36,4 1.044,5 1.133,6 0.687,7 0.684,8 465.48,9 2,10 18,11 50,13 21,14 34,16 52,17 22,20 19,21 3,22 3,23 3,24 18,25 10,26 1,28 1,29 5,31 1,32 32,34 3,35 10,36 0.115,37 6,38 46,39 52.189,40 56.636,41 34.352,42 34.2,43 6,44 5.5}
{0 CHEMBL1971289,1 8.811,2 40,3 40,4 1.023,5 1.121,6 0.694,7 0.667,8 264.33,9 6.7,10 6,11 30,13 9,14 19,16 31,17 12,20 10,21 2,22 3,24 12,25 6,26 1,28 2,29 3,31 1,32 18,35 10,36 0.097,37 3,38 25,39 30.68,40 33.621,41 20.83,42 20.008,44 5.4}
{0 CHEMBL1971519,1 8.417,2 48.1,3 37,4 1.013,5 1.129,6 0.704,7 0.687,8 227.26,9 11.1,10 16,11 27,13 16,14 19,16 29,17 13,20 13,23 1,24 10,25 4,28 3,32 17,34 1,36 0.034,37 1,38 27,39 27.353,40 30.495,41 19,42 18.555,43 3.7,44 4.5}
{0 CHEMBL1971534,1 9.902,2 44.4,3 33.3,4 1.021,5 1.109,6 0.758,7 0.722,8 178.23,9 11.1,10 10,11 18,13 11,14 13,16 19,17 8,20 8,22 1,24 6,25 4,26 1,28 2,29 1,31 1,32 12,35 5.6,36 0.053,37 1,38 19,39 18.375,40 19.956,41 13.636,42 12.998,44 4.8}
{0 CHEMBL1971606,1 7.421,2 45.1,3 45.1,4 1.002,5 1.124,6 0.671,7 0.64,8 378.48,9 3.9,10 18,11 51,13 19,14 30,16 53,17 23,20 18,21 5,22 1,23 1,24 23,25 5,28 2,29 2,32 28,34 1,35 3.9,36 0.132,37 7,38 40,39 51.091,40 57.322,41 34.233,42 32.651,43 2,44 5.4}
{0 CHEMBL1971943,1 9.825,2 43.9,3 31.7,4 1.042,5 1.144,6 0.708,7 0.709,8 402.82,9 14.6,10 22,11 41,13 22,14 31,16 44,17 18,18 1,20 17,21 1,23 2,24 13,25 10,26 1,28 6,29 1,32 28,34 3,35 2.4,36 0.091,37 4,38 42,39 42.705,40 46.899,41 29.029,42 29.071,43 7.3,44 5.4}
{0 CHEMBL1972220,1 8.943,2 43.3,3 36.7,4 1.027,5 1.133,6 0.696,7 0.683,8 536.61,9 10,10 27,11 60,13 28,14 42,16 64,17 26,20 23,21 3,22 1,23 2,24 22,25 12,26 1,28 6,29 3,31 1,32 38,34 2,35 5,36 0.109,37 7,38 56.5,39 61.647,40 67.954,41 41.773,42 40.968,43 3.3,44 5.4}
{0 CHEMBL1972346,1 8.142,2 46.7,3 40,4 1.02,5 1.111,6 0.68,7 0.667,8 244.26,10 12,11 30,13 13,14 19,16 31,17 14,20 14,22 1,24 12,25 4,29 4,32 18,35 13.3,36 0.065,37 2,38 26,39 30.611,40 33.329,41 20.386,42 20.02,44 6.3}
{0 CHEMBL1972355,1 8.483,2 47.4,3 36.8,4 1.021,5 1.114,6 0.695,7 0.686,8 322.34,9 5.3,10 16,11 38,13 18,14 27,16 41,17 18,20 16,21 2,22 2,24 14,25 6,28 2,29 4,32 24,35 10.5,36 0.049,37 2,38 37,39 38.814,40 42.325,41 26.398,42 26.063,44 6.2}
{0 CHEMBL1972462,1 6.619,2 41.5,3 51.2,4 0.99,5 1.124,6 0.647,7 0.603,8 271.39,9 2.4,10 6,11 41,13 8,14 21,16 42,17 17,19 2,20 7,21 8,22 1,24 21,25 3,28 1,29 2,32 20,33 1,35 4.9,36 0.119,37 5,38 27,39 40.592,40 46.069,41 26.529,42 24.719,44 5.4}
{0 CHEMBL1973013,1 10.258,2 34.4,3 43.8,4 1.007,5 1.135,6 0.714,7 0.655,8 328.27,9 15.6,10 11,11 32,13 11,14 19,15 1,16 33,17 11,20 7,21 4,24 14,25 7,26 2,28 5,31 1,32 18,34 1,36 0.121,37 4,38 24.5,39 32.233,40 36.329,41 22.836,42 20.953,43 3.1,44 5.4}
{0 CHEMBL1973016,1 8.299,2 40,3 42.2,4 1.017,5 1.124,6 0.679,7 0.652,8 373.47,9 6.7,10 16,11 45,13 19,14 28,16 47,17 18,20 14,21 4,22 3,24 19,25 8,26 1,28 3,29 4,31 1,32 26,35 8.9,36 0.128,37 6,38 39,39 45.76,40 50.574,41 30.574,42 29.325,44 5.4}
{0 CHEMBL1973138,1 7.247,2 42.5,3 46.3,4 0.999,5 1.125,6 0.663,7 0.63,8 579.76,9 6.3,10 18,11 80,13 23,14 47,16 84,17 34,20 24,21 10,22 5,24 37,25 9,28 5,29 4,32 43,35 5,36 0.083,37 7,38 61,39 79.956,40 89.972,41 53.029,42 50.395,44 5.4}
{0 CHEMBL1973359,1 9.723,2 42.9,3 28.6,4 1.053,5 1.131,6 0.692,7 0.714,8 272.24,9 14.3,10 15,11 28,13 18,14 22,16 30,17 12,20 12,22 3,24 8,25 8,28 4,29 4,32 20,35 14.3,36 0.1,37 3,38 32.5,39 29.484,40 31.661,41 19.364,42 19.998,44 6.8}
{0 CHEMBL1973516,1 7.579,2 41.4,3 43.1,4 1,5 1.135,6 0.675,7 0.645,8 439.58,9 15.5,10 22,11 58,13 23,14 37,16 62,17 24,19 1,20 17,21 6,24 25,25 9,28 9,32 33,33 1,36 0.097,37 6,38 50,39 57.985,40 65.806,41 39.142,42 37.407,44 5.4}
{0 CHEMBL1973720,1 7.974,2 39.5,3 44.2,4 1.003,5 1.136,6 0.68,7 0.643,8 342.87,9 14,10 16,11 43,13 16,14 27,16 46,17 17,18 1,20 11,21 6,24 19,25 7,26 1,28 6,32 24,34 1,36 0.065,37 3,38 35,39 43.12,40 48.84,41 29.222,42 27.644,43 2.3,44 6.2}
{0 CHEMBL1973793,1 11.008,2 48.7,3 33.3,4 1.02,5 1.099,6 0.768,7 0.732,8 429.31,9 5.1,10 18,11 39,13 21,14 29,15 1,16 42,17 19,20 19,22 3,24 13,25 7,26 2,28 2,29 3,31 1,32 26,34 1,35 7.7,36 0.071,37 3,38 41,39 39.793,40 42.878,41 29.943,42 28.56,43 2.6,44 5.4}
{0 CHEMBL1973868,1 8.232,2 51.9,3 37,4 1.002,5 1.106,6 0.723,7 0.699,8 222.26,9 7.4,10 17,11 27,13 17,14 19,16 29,17 14,20 14,24 10,25 3,28 2,29 1,32 17,35 3.7,36 0.034,37 1,38 27.5,39 27.065,40 29.867,41 19.512,42 18.865,44 5.4}
{0 CHEMBL1973936,1 7.9,2 43.5,3 43.5,4 1.022,5 1.141,6 0.654,7 0.639,8 363.41,9 2.2,10 12,11 46,13 13,14 28,16 48,17 20,20 13,21 7,22 1,23 3,24 20,25 6,28 1,29 2,32 26,34 3,35 4.3,36 0.125,37 6,38 35,39 47.014,40 52.503,41 30.103,42 29.396,43 6.5,44 6.1}
{0 CHEMBL1973961,1 7.803,2 42.9,3 42.9,4 1.013,5 1.136,6 0.666,7 0.645,8 491.59,9 7.9,10 22,11 63,13 23,14 40,16 67,17 27,20 20,21 7,22 1,23 2,24 27,25 9,28 5,29 2,32 36,34 2,35 3.2,36 0.09,37 6,38 52,39 63.792,40 71.572,41 41.949,42 40.625,43 3.2,44 5.4}
{0 CHEMBL1974328,1 6.949,2 36.7,3 49,4 0.998,5 1.142,6 0.64,7 0.604,8 340.48,9 12.2,10 12,11 49,13 13,14 27,16 51,17 18,20 11,21 7,22 1,24 24,25 7,28 6,29 1,32 25,35 2,36 0.098,37 5,38 34,39 48.891,40 55.936,41 31.341,42 29.584,44 5.8}
{0 CHEMBL1974480,1 10.974,2 40.6,3 34.4,4 1.036,5 1.129,6 0.712,7 0.699,8 351.18,9 12.5,10 11,11 32,13 13,14 23,15 1,16 34,17 13,20 10,21 3,22 2,24 11,25 8,26 1,28 4,29 3,32 21,34 1,35 9.4,36 0.118,37 4,38 30.5,39 33.153,40 36.124,41 22.784,42 22.362,43 3.1,44 5.9}
{0 CHEMBL1974574,1 8.443,2 46.7,3 36.7,4 1.016,5 1.119,6 0.699,7 0.687,8 253.28,9 10,10 16,11 30,13 17,14 21,16 32,17 14,20 14,22 1,24 11,25 5,28 3,29 2,32 19,35 6.7,36 0.063,37 2,38 30,39 30.494,40 33.575,41 20.972,42 20.601,44 5.4}
{0 CHEMBL1974617,1 8.609,2 44,3 36,4 1.024,5 1.126,6 0.688,7 0.683,8 215.23,9 12,10 15,11 25,13 15,14 18,16 27,17 11,20 10,21 1,24 9,25 5,28 3,29 2,32 16,35 8,36 0.074,37 2,38 25.5,39 25.611,40 28.159,41 17.21,42 17.074,44 4.4}
{0 CHEMBL1974875,1 9.648,2 36.4,3 36.4,4 1.041,5 1.127,6 0.696,7 0.68,8 212.25,9 9.1,10 5,11 22,13 7,14 15,16 23,17 8,20 6,21 2,22 2,24 8,25 6,26 1,28 2,29 3,31 1,32 14,35 13.6,36 0.043,37 1,38 19.5,39 22.913,40 24.79,41 15.307,42 14.955,44 4.8}
{0 CHEMBL1974998,1 7.383,2 43.3,3 44.8,4 0.998,5 1.125,6 0.673,7 0.64,8 494.65,9 9,10 22,11 67,13 25,14 40,16 70,17 29,19 1,20 21,21 7,22 2,24 30,25 8,28 6,29 2,32 37,33 1,35 3,36 0.1,37 7,38 55,39 66.869,40 75.391,41 45.08,42 42.88,44 5.4}
{0 CHEMBL1975121,1 7.387,2 46.7,3 44.4,4 0.996,5 1.114,6 0.684,7 0.649,8 332.43,9 4.4,10 18,11 45,13 19,14 27,16 47,17 21,20 18,21 3,22 1,24 20,25 4,28 2,29 2,32 25,35 4.4,36 0.106,37 5,38 37,39 44.811,40 50.152,41 30.773,42 29.214,44 5.4}
{0 CHEMBL1975903,1 8.463,2 42.9,3 40.5,4 1.013,5 1.118,6 0.699,7 0.669,8 355.45,9 7.1,10 18,11 42,13 20,14 27,16 44,17 18,20 16,21 2,22 2,24 17,25 7,26 1,28 3,29 3,31 1,32 25,35 7.1,36 0.114,37 5,38 38,39 42.549,40 46.95,41 29.358,42 28.083,44 5.4}
{0 CHEMBL1975921,1 14.269,2 40,3 26.7,4 1.05,5 1.131,6 0.772,7 0.755,8 214.03,9 20,10 6,11 15,13 7,14 12,15 1,16 16,17 6,20 6,22 1,24 4,25 5,26 1,28 3,29 1,32 11,34 1,35 6.7,38 16,39 15.745,40 16.961,41 11.585,42 11.331,43 6.7,44 4.8}
{0 CHEMBL1975923,1 7.358,2 39.5,3 46.5,4 1.011,5 1.13,6 0.644,7 0.62,8 316.39,9 4.7,10 12,11 43,13 13,14 24,16 44,17 17,20 13,21 4,22 1,24 20,25 6,28 2,29 4,32 23,35 9.3,36 0.114,37 5,38 31,39 43.465,40 48.571,41 27.682,42 26.643,44 5.8}
{0 CHEMBL1975927,1 7.817,2 42.3,3 42.3,4 1.013,5 1.126,6 0.667,7 0.648,8 406.48,9 7.7,10 22,11 52,13 22,14 33,16 55,17 22,20 18,21 4,24 22,25 8,28 4,29 4,32 30,35 7.7,36 0.127,37 7,38 44,39 52.669,40 58.568,41 34.693,42 33.686,44 5.4}
{0 CHEMBL1976040,1 7.256,2 39.1,3 46.4,4 1.001,5 1.136,6 0.653,7 0.622,8 500.67,9 11.6,10 18,11 69,13 20,14 41,16 73,17 27,20 18,21 9,22 2,24 32,25 10,28 8,29 2,32 37,35 2.9,36 0.096,37 7,38 52,39 69.072,40 78.388,41 45.091,42 42.922,44 5.4}
{0 CHEMBL1976158,1 12.832,2 51.7,3 20.7,4 1.056,5 1.104,6 0.783,7 0.793,8 372.14,9 10.3,10 12,11 29,13 17,14 26,15 1,16 32,17 15,20 15,22 5,24 6,25 8,26 1,28 3,29 4,32 23,34 1,35 13.8,36 0.031,37 1,38 37,39 30.611,40 32.005,41 22.71,42 23.002,43 3.4,44 5.7}
{0 CHEMBL1976196,1 9.884,2 43.9,3 34.1,4 1.033,5 1.122,6 0.724,7 0.708,8 405.26,9 9.8,10 16,11 41,13 19,14 30,16 44,17 18,18 2,20 15,21 3,22 3,24 14,25 9,26 2,28 4,29 3,32 27,34 2,35 7.3,36 0.045,37 2,38 41,39 42.338,40 46.001,41 29.671,42 29.046,43 4.9,44 5.4}
{0 CHEMBL1976376,1 7.74,2 44.2,3 42.3,4 1.007,5 1.122,6 0.678,7 0.653,8 402.49,9 7.7,10 22,11 52,13 22,14 34,16 56,17 23,20 18,21 5,24 22,25 7,28 4,29 3,32 30,35 5.8,36 0.089,37 5,38 45,39 52.342,40 58.358,41 35.239,42 33.971,44 5.4}
{0 CHEMBL1976420,1 7.035,2 42.5,3 47.5,4 0.993,5 1.126,6 0.664,7 0.625,8 281.39,9 7.5,10 16,11 40,13 16,14 23,16 42,17 17,20 12,21 5,24 19,25 4,28 3,29 1,32 21,35 2.5,36 0.071,37 3,38 31,39 39.702,40 45.026,41 26.563,42 24.993,44 5.4}
{0 CHEMBL1977134,1 9.181,2 46.6,3 32.8,4 1.038,5 1.137,6 0.695,7 0.701,8 532.52,9 10.3,10 28,11 58,13 29,14 44,16 63,17 27,20 25,21 2,22 1,23 3,24 19,25 12,28 6,29 3,32 39,34 3,35 5.2,36 0.063,37 4,38 59,39 60.2,40 65.959,41 40.301,42 40.637,43 5.2,44 5.4}
{0 CHEMBL1977138,1 8.534,2 47.6,3 35.7,4 1.013,5 1.129,6 0.709,7 0.694,8 358.41,9 14.3,10 22,11 42,13 23,14 30,16 45,17 20,19 1,20 17,21 2,23 1,24 15,25 7,28 6,32 27,33 1,34 1,36 0.089,37 4,38 43,39 42.542,40 47.406,41 29.779,42 29.146,43 2.4,44 6.1}
{0 CHEMBL1977634,1 7.714,2 44.3,3 42.6,4 1.007,5 1.121,6 0.676,7 0.651,8 470.57,9 6.6,10 22,11 61,13 25,14 38,16 64,17 27,20 22,21 5,22 3,24 26,25 8,28 4,29 4,32 35,35 6.6,36 0.125,37 8,38 52,39 61.436,40 68.398,41 41.216,42 39.74,44 5.4}
{0 CHEMBL1977749,1 7.704,2 50,3 41.7,4 0.998,5 1.106,6 0.701,7 0.671,8 277.34,9 2.8,10 12,11 36,13 15,14 23,16 38,17 18,20 17,21 1,22 3,24 15,25 3,28 1,29 2,32 21,35 5.6,36 0.079,37 3,38 32,39 35.942,40 39.824,41 25.245,42 24.139,44 5.4}
{0 CHEMBL1977814,1 7.995,2 40,3 45,4 1.009,5 1.129,6 0.672,7 0.638,8 319.82,9 7.5,10 11,11 40,13 12,14 24,16 42,17 16,18 1,20 10,21 6,22 1,24 18,25 6,26 1,28 3,29 2,32 22,34 1,35 5,36 0.071,37 3,38 30.5,39 40.353,40 45.179,41 26.875,42 25.536,43 2.5,44 5.4}
{0 CHEMBL1977931,1 8.182,2 48.3,3 37.9,4 1.006,5 1.116,6 0.707,7 0.686,8 237.28,9 10.3,10 16,11 29,13 17,14 20,16 31,17 14,20 13,21 1,22 1,24 11,25 4,28 3,29 1,32 18,35 3.4,36 0.065,37 2,38 29,39 29.167,40 32.365,41 20.517,42 19.886,44 4.4}
{0 CHEMBL1978083,1 7.676,2 42.9,3 42.9,4 1.006,5 1.127,6 0.673,7 0.648,8 322.4,9 9.5,10 12,11 42,13 15,14 26,16 44,17 18,20 15,21 3,22 3,24 18,25 6,28 4,29 2,32 24,35 4.8,36 0.068,37 3,38 35,39 42.247,40 47.318,41 28.262,42 27.203,44 5.4}
{0 CHEMBL1978166,1 7.202,2 42.5,3 47.9,4 0.989,5 1.121,6 0.679,7 0.629,8 525.78,9 6.8,10 22,11 73,13 24,14 41,16 76,17 31,19 2,20 20,21 9,22 1,24 35,25 7,26 1,28 5,29 1,31 1,32 38,33 1,35 1.4,36 0.132,37 10,38 55,39 72.167,40 81.849,41 49.552,42 45.911,44 5.6}
{0 CHEMBL1978167,1 10.555,2 48.4,3 35.5,4 1.006,5 1.113,6 0.756,7 0.717,8 327.2,9 12.9,10 20,11 31,13 20,14 23,15 1,16 34,17 15,20 14,21 1,24 11,25 5,26 1,28 4,32 20,34 1,36 0.029,37 1,38 33,39 31.171,40 34.496,41 23.421,42 22.218,43 3.2,44 5.4}
{0 CHEMBL1978195,1 11.901,2 50,3 32.1,4 1.013,5 1.094,6 0.804,7 0.753,8 333.22,9 7.1,10 16,11 28,13 17,14 21,15 1,16 30,17 14,20 14,22 1,24 9,25 5,26 2,28 2,29 1,31 1,32 19,34 1,35 3.6,36 0.067,37 2,38 30,39 28.371,40 30.628,41 22.512,42 21.077,43 3.6,44 5.7}
{0 CHEMBL1978271,1 7.263,2 40.8,3 46.5,4 1.003,5 1.129,6 0.655,7 0.625,8 515.67,9 7,10 22,11 71,13 24,14 41,16 74,17 29,20 21,21 8,22 2,24 33,25 9,28 5,29 4,32 38,35 5.6,36 0.135,37 10,38 54,39 71.189,40 80.142,41 46.506,42 44.341,44 5.4}
{0 CHEMBL1978371,1 8.581,2 54.2,3 37.5,4 1.001,5 1.096,6 0.742,7 0.709,8 411.9,9 2.1,10 18,11 48,13 22,14 33,16 51,17 26,18 1,19 1,20 22,21 3,22 3,24 18,25 4,26 1,28 1,29 2,32 30,33 1,34 1,35 4.2,36 0.078,37 4,38 47,39 48.033,40 52.598,41 35.625,42 34.02,43 2.1,44 5.9}
{0 CHEMBL1978448,1 8.286,2 40,3 42.5,4 1.014,5 1.124,6 0.684,7 0.652,8 331.43,9 7.5,10 11,11 40,13 14,14 26,16 43,17 16,20 11,21 5,22 3,24 17,25 7,26 1,28 3,29 3,31 1,32 23,35 7.5,36 0.093,37 4,38 34.5,39 40.549,40 44.95,41 27.358,42 26.083,44 5.4}
{0 CHEMBL1978562,1 11.007,2 50,3 31.3,4 1.012,5 1.112,6 0.771,7 0.741,8 352.21,9 15.6,10 20,11 32,13 21,14 25,15 1,16 35,17 16,19 1,20 14,21 1,24 10,25 6,26 1,28 5,32 22,33 1,34 1,36 0.029,37 1,38 37,39 32.389,40 35.579,41 24.665,42 23.713,43 3.1,44 5.4}
{0 CHEMBL1978567,1 8.034,2 43.2,3 43.2,4 1.002,5 1.117,6 0.697,7 0.657,8 353.48,9 6.8,10 17,11 44,13 18,14 27,16 46,17 19,20 15,21 4,22 1,24 19,25 6,26 1,28 3,29 2,31 1,32 25,35 4.5,36 0.109,37 5,38 36.5,39 44.105,40 49.155,41 30.665,42 28.895,44 5.4}
{0 CHEMBL1979690,1 8.055,2 40.7,3 42.6,4 1.004,5 1.134,6 0.685,7 0.652,8 434.98,9 14.8,10 22,11 54,13 22,14 35,16 58,17 22,18 1,20 17,21 5,24 23,25 9,26 1,28 8,32 31,34 1,36 0.086,37 5,38 46,39 54.207,40 61.252,41 36.995,42 35.213,43 1.9,44 5.4}
{0 CHEMBL1979773,1 7.127,2 41.2,3 47.1,4 0.996,5 1.13,6 0.659,7 0.624,8 484.66,9 8.8,10 22,11 68,13 24,14 39,16 71,17 28,20 21,21 7,22 2,24 32,25 8,28 6,29 2,32 36,35 2.9,36 0.099,37 7,38 52,39 67.752,40 76.806,41 44.841,42 42.406,44 5.4}
{0 CHEMBL1980167,1 8.607,2 42.1,3 38.6,4 1.019,5 1.124,6 0.695,7 0.673,8 490.59,9 10.5,10 24,11 57,13 28,14 38,16 60,17 24,20 22,21 2,22 4,24 22,25 11,26 1,28 6,29 4,31 1,32 35,35 7,36 0.117,37 7,38 54,39 58.065,40 64.069,41 39.591,42 38.389,44 5.9}
{0 CHEMBL1980246,1 7.929,2 43.2,3 40.5,4 1.007,5 1.129,6 0.684,7 0.661,8 293.36,9 13.5,10 18,11 37,13 18,14 24,16 39,17 16,20 15,21 1,24 15,25 6,28 5,29 1,32 22,35 2.7,36 0.103,37 4,38 33,39 37.254,40 41.777,41 25.29,42 24.456,44 5.4}
{0 CHEMBL1980297,1 8.725,2 44.6,3 37.5,4 1.016,5 1.125,6 0.707,7 0.685,8 488.59,9 10.7,10 27,11 56,13 28,14 39,16 60,17 25,20 23,21 2,22 1,23 1,24 21,25 10,26 1,28 6,29 2,31 1,32 35,34 1,35 3.6,36 0.1,37 6,38 53.5,39 56.923,40 62.99,41 39.62,42 38.343,43 1.8,44 5.4}
{0 CHEMBL1980329,1 8.172,2 51.4,3 37.8,4 1.004,5 1.106,6 0.716,7 0.693,8 302.35,9 5.4,10 17,11 37,13 19,14 26,16 40,17 19,20 19,22 2,24 14,25 4,28 2,29 2,32 23,35 5.4,36 0.05,37 2,38 36.5,39 37.16,40 40.907,41 26.489,42 25.633,44 6.3}
{0 CHEMBL1980376,1 7.734,2 48.3,3 41.4,4 0.998,5 1.113,6 0.699,7 0.669,8 224.28,9 6.9,10 16,11 29,13 16,14 19,16 31,17 14,20 13,21 1,24 12,25 3,28 2,29 1,32 17,35 3.4,36 0.032,37 1,38 27,39 28.949,40 32.282,41 20.273,42 19.392,44 4.1}
{0 CHEMBL1980391,1 9.149,2 46.2,3 35.9,4 1.022,5 1.128,6 0.714,7 0.697,8 356.81,9 10.3,10 17,11 39,13 18,14 28,16 42,17 18,18 1,20 16,21 2,22 1,23 1,24 14,25 7,26 1,28 4,29 1,32 25,34 2,35 2.6,36 0.048,37 2,38 37.5,39 39.873,40 43.978,41 27.841,42 27.172,43 5.1,44 6.1}
{0 CHEMBL1980407,1 7.659,2 47.4,3 42.1,4 0.998,5 1.115,6 0.694,7 0.663,8 436.55,9 7,10 23,11 57,13 25,14 37,16 61,17 27,20 24,21 3,22 2,24 24,25 6,28 4,29 2,32 33,35 3.5,36 0.115,37 7,38 50.5,39 56.898,40 63.564,41 39.546,42 37.783,44 7.4}
{0 CHEMBL1980763,1 7.567,2 39.2,3 47.1,4 1,5 1.133,6 0.666,7 0.626,8 385.94,9 9.8,10 16,11 51,13 16,14 30,16 54,17 20,18 1,20 12,21 8,24 24,25 7,26 1,28 5,29 1,32 27,34 1,35 2,36 0.093,37 5,38 38,39 50.996,40 57.797,41 33.955,42 31.917,43 2,44 5.4}
{0 CHEMBL1980995,1 7.649,2 45.9,3 42.6,4 1.002,5 1.118,6 0.685,7 0.656,8 466.58,9 6.6,10 24,11 61,13 25,14 42,16 68,17 28,20 19,21 9,22 1,24 26,25 7,28 4,29 3,32 35,35 4.9,36 0.029,37 2,38 55,39 61.109,40 68.189,41 41.762,42 40.025,44 7.6}
{0 CHEMBL1981047,1 7.302,2 40,3 46.2,4 1.003,5 1.132,6 0.654,7 0.625,8 474.62,9 9.2,10 17,11 65,13 19,14 39,16 69,17 26,20 17,21 9,22 2,24 30,25 9,28 6,29 3,32 35,35 4.6,36 0.087,37 6,38 49.5,39 65.196,40 73.6,41 42.534,42 40.594,44 5.4}
{0 CHEMBL1981133,1 7.587,2 48.1,3 42.3,4 0.994,5 1.114,6 0.699,7 0.664,8 394.51,9 7.7,10 27,11 52,13 27,14 34,16 56,17 25,20 22,21 3,24 22,25 5,28 4,29 1,32 30,35 1.9,36 0.107,37 6,38 47.5,39 51.687,40 57.939,41 36.33,42 34.542,44 5.4}
{0 CHEMBL1981215,1 10.213,2 43.6,3 28.2,4 1.075,5 1.169,6 0.671,7 0.708,8 398.32,9 10.3,10 17,11 39,13 18,14 30,16 41,17 17,20 15,21 2,22 1,23 5,24 11,25 11,28 4,29 2,32 28,34 5,35 5.1,36 0.073,37 3,38 39.5,39 41.927,40 45.602,41 26.188,42 27.593,43 12.8,44 5.4}
{0 CHEMBL1981492,1 8.313,2 39.1,3 39.1,4 1.027,5 1.137,6 0.661,7 0.655,8 191.21,9 13,10 10,11 23,13 11,14 15,16 24,17 9,20 8,21 1,22 1,24 9,25 5,28 3,29 2,32 14,35 8.7,36 0.083,37 2,38 21,39 23.611,40 26.159,41 15.21,42 15.074,44 4.4}
{0 CHEMBL1981671,1 7.561,2 37.9,3 44.8,4 1.013,5 1.138,6 0.646,7 0.625,8 219.27,9 10.3,10 10,11 29,13 11,14 17,16 30,17 11,20 8,21 3,22 1,24 13,25 5,28 3,29 2,32 16,35 6.9,36 0.133,37 4,38 23,39 29.378,40 32.99,41 18.733,42 18.128,44 5.4}
{0 CHEMBL1981744,1 10.479,2 45.7,3 28.6,4 1.058,5 1.15,6 0.713,7 0.726,8 366.75,9 11.4,10 17,11 35,13 18,14 27,16 37,17 16,18 1,20 15,21 1,22 1,23 3,24 10,25 9,26 1,28 4,29 1,32 25,34 4,35 2.9,36 0.054,37 2,38 36.5,39 37.014,40 40.242,41 24.955,42 25.412,43 11.4,44 5.4}
{0 CHEMBL1981792,1 10.523,2 45.7,3 25.7,4 1.078,5 1.171,6 0.685,7 0.724,8 368.29,9 11.4,10 17,11 35,13 18,14 28,16 37,17 16,20 15,21 1,22 1,23 5,24 9,25 10,28 4,29 1,32 26,34 5,35 2.9,36 0.054,37 2,38 37.5,39 37.716,40 40.977,41 23.972,42 25.351,43 14.3,44 5.4}
{0 CHEMBL1982413,1 7.258,2 40.5,3 50,4 0.993,5 1.126,6 0.665,7 0.616,8 304.85,9 4.8,10 11,11 42,13 11,14 23,16 44,17 17,18 1,20 9,21 8,24 21,25 4,26 1,28 2,29 1,32 21,34 1,35 2.4,36 0.068,37 3,38 28.5,39 41.691,40 47.302,41 27.938,42 25.853,43 2.4,44 5.4}
{0 CHEMBL1982660,1 9.291,2 43.6,3 33.3,4 1.049,5 1.152,6 0.675,7 0.688,8 362.34,9 10.3,10 17,11 39,13 18,14 28,16 41,17 17,20 15,21 2,22 1,23 3,24 13,25 9,28 4,29 2,32 26,34 3,35 5.1,36 0.073,37 3,38 37.5,39 40.902,40 44.922,41 26.313,42 26.826,43 7.7,44 5.4}
{0 CHEMBL1982700,1 6.571,2 36.8,3 52.6,4 0.998,5 1.134,6 0.623,7 0.584,8 374.53,9 3.5,10 6,11 57,13 9,14 28,16 58,17 21,20 10,21 11,22 3,24 30,25 6,28 2,29 4,32 27,35 7,36 0.155,37 9,38 34,39 56.883,40 64.647,41 35.489,42 33.277,44 5.4}
{0 CHEMBL1982711,1 9.37,2 48.3,3 34.5,4 1.017,5 1.114,6 0.737,7 0.714,8 271.72,9 10.3,10 16,11 29,13 17,14 21,16 31,17 14,18 1,20 14,22 1,24 10,25 5,26 1,28 3,29 1,32 19,34 1,35 3.4,36 0.065,37 2,38 30,39 29.491,40 32.309,41 21.375,42 20.714,43 3.4,44 5.8}
{0 CHEMBL1982753,1 7.657,2 38.3,3 46.8,4 1.002,5 1.136,6 0.664,7 0.625,8 359.9,9 10.6,10 12,11 47,13 13,14 27,16 49,17 18,18 1,20 12,21 6,22 1,24 22,25 7,26 1,28 5,29 1,32 25,34 1,35 2.1,36 0.102,37 5,38 34,39 47.112,40 53.382,41 31.194,42 29.391,43 2.1,44 5.4}
{0 CHEMBL1983070,1 7.676,2 46.7,3 42.2,4 1.001,5 1.116,6 0.689,7 0.66,8 345.43,9 6.7,10 22,11 45,13 22,14 29,16 48,17 21,20 18,21 3,24 19,25 5,28 3,29 2,32 26,35 4.4,36 0.083,37 4,38 40,39 45.029,40 50.235,41 31.017,42 29.708,44 5.4}
{0 CHEMBL1983111,1 8.043,2 39,3 42.4,4 1.026,5 1.152,6 0.646,7 0.636,8 474.54,9 10.2,10 12,11 59,13 14,14 38,16 63,17 23,20 12,21 11,22 2,23 3,24 25,25 11,28 6,29 2,32 34,34 3,35 3.4,36 0.095,37 6,38 46,39 60.523,40 67.995,41 38.131,42 37.503,43 5.1,44 6.2}
{0 CHEMBL1983268,1 7.476,2 41.3,3 45.3,4 1.007,5 1.138,6 0.657,7 0.63,8 560.71,9 8,10 22,11 75,13 23,14 46,16 80,17 31,20 20,21 11,22 1,23 2,24 34,25 10,28 6,29 2,32 41,34 2,35 2.7,36 0.088,37 7,38 58,39 75.545,40 85.316,41 49.239,42 47.227,43 2.7,44 5.6}
{0 CHEMBL1983348,1 7.578,2 43.1,3 43.1,4 1,5 1.128,6 0.678,7 0.648,8 386.5,9 11.8,10 20,11 51,13 22,14 32,16 54,17 22,19 1,20 15,21 6,22 1,24 22,25 7,28 6,29 1,32 29,33 1,35 2,36 0.13,37 7,38 45,39 51.007,40 57.521,41 34.58,42 33.058,44 5.4}
{0 CHEMBL1983393,1 8.449,2 48.8,3 36.6,4 1.013,5 1.123,6 0.707,7 0.691,8 346.39,9 9.8,10 22,11 41,13 23,14 29,16 44,17 20,20 20,22 1,23 1,24 15,25 6,28 4,29 1,32 26,34 1,35 2.4,36 0.068,37 3,38 41,39 41.549,40 46.034,41 28.983,42 28.345,43 2.4,44 5.4}
{0 CHEMBL1983575,1 12.909,2 43.8,3 34.4,4 1.026,5 1.115,6 0.764,7 0.724,8 413.08,9 9.4,10 12,11 32,13 14,14 22,15 2,16 33,17 14,20 14,22 2,24 11,25 7,26 2,28 3,29 2,32 21,34 2,35 6.3,36 0.091,37 3,38 30,39 32.836,40 35.673,41 24.438,42 23.178,43 6.3,44 5.8}
{0 CHEMBL1983630,1 8.087,2 50,3 38.5,4 1.003,5 1.11,6 0.712,7 0.687,8 210.25,9 7.7,10 12,11 26,13 13,14 18,16 28,17 13,20 12,21 1,22 1,24 10,25 3,28 2,29 1,32 16,35 3.8,36 0.036,37 1,38 25,39 26.065,40 28.867,41 18.512,42 17.865,44 4.6}
{0 CHEMBL1983640,1 7.93,2 44.4,3 41.3,4 1.011,5 1.127,6 0.678,7 0.658,8 499.59,9 7.9,10 22,11 63,13 24,14 41,16 67,17 28,19 2,20 20,21 6,22 1,23 1,24 26,25 9,28 5,29 3,32 37,33 1,34 1,35 4.8,36 0.06,37 4,38 55,39 63.723,40 71.027,41 42.705,42 41.429,43 1.6,44 5.4}
{0 CHEMBL1983715,1 7.545,2 37.9,3 46.6,4 0.999,5 1.134,6 0.668,7 0.626,8 437.63,9 12.1,10 17,11 58,13 18,14 34,16 61,17 22,20 14,21 8,22 1,24 27,25 9,26 1,28 7,29 1,31 1,32 31,35 1.7,36 0.098,37 6,38 43.5,39 57.952,40 65.77,41 38.756,42 36.32,44 5.4}
{0 CHEMBL1983884,1 8.82,2 42.9,3 33.3,4 1.019,5 1.138,6 0.704,7 0.697,8 185.21,9 23.8,10 15,11 21,13 15,14 16,16 23,17 9,20 9,24 7,25 5,28 5,32 14,38 23.5,39 21.393,40 23.907,41 14.79,42 14.634,44 4.1}
{0 CHEMBL1983923,1 7.085,2 39.6,3 47.2,4 0.994,5 1.136,6 0.658,7 0.621,8 375.53,9 13.2,10 17,11 53,13 18,14 31,16 56,17 21,20 15,21 6,22 1,24 25,25 7,28 7,32 28,36 0.089,37 5,38 40.5,39 52.665,40 60.225,41 34.893,42 32.891,44 5.4}
{0 CHEMBL1983945,1 7.67,2 46,3 42,4 0.998,5 1.12,6 0.691,7 0.661,8 383.49,9 10,10 22,11 50,13 24,14 32,16 53,17 23,20 21,21 2,22 2,24 21,25 6,28 5,29 1,32 29,35 2,36 0.113,37 6,38 45,39 49.905,40 56.023,41 34.574,42 33.036,44 5.4}
{0 CHEMBL1983980,1 9.045,2 46.7,3 36.7,4 1.014,5 1.107,6 0.733,7 0.701,8 542.68,9 6.7,10 27,11 60,13 29,14 43,16 65,17 28,20 24,21 4,22 2,24 22,25 10,26 2,28 4,29 4,31 2,32 38,35 6.7,36 0.092,37 6,38 58.5,39 60.822,40 66.408,41 43.989,42 42.06,44 6}
{0 CHEMBL1984038,1 8.268,2 43.9,3 40.9,4 1.014,5 1.116,6 0.69,7 0.665,8 545.66,9 4.5,10 24,11 66,13 27,14 43,16 70,17 29,20 25,21 4,22 3,24 27,25 10,26 1,28 3,29 6,31 1,32 39,35 9.1,36 0.1,37 7,38 58,39 66.949,40 73.654,41 45.529,42 43.862,44 5.4}
{0 CHEMBL1984236,1 10.092,2 41.7,3 41.7,4 1,5 1.118,6 0.739,7 0.679,8 363.31,9 11.1,10 16,11 36,13 16,14 23,15 1,16 38,17 15,20 13,21 2,24 15,25 6,26 2,28 4,31 1,32 21,34 1,36 0.105,37 4,38 31,39 36.014,40 40.246,41 26.591,42 24.459,43 2.8,44 5.4}
{0 CHEMBL1984296,1 7.782,2 50,3 40.9,4 0.998,5 1.108,6 0.705,7 0.675,8 342.42,9 4.5,10 22,11 44,13 23,14 29,16 47,17 22,20 20,21 2,22 1,24 18,25 4,28 2,29 2,32 26,35 4.5,36 0.064,37 3,38 41,39 43.927,40 48.737,41 31.012,42 29.687,44 6.1}
{0 CHEMBL1984500,1 12.474,2 47.1,3 35.3,4 1.018,5 1.106,6 0.77,7 0.726,8 212.05,9 5.9,10 6,11 17,13 7,14 12,15 1,16 18,17 8,20 7,21 1,22 1,24 6,25 3,26 1,28 1,29 1,32 11,34 1,35 5.9,38 16,39 17.309,40 18.795,41 13.097,42 12.342,43 5.9,44 4.1}
{0 CHEMBL1984686,1 11.154,2 48.1,3 33.3,4 1.011,5 1.114,6 0.765,7 0.729,8 301.16,9 14.8,10 17,11 27,13 17,14 20,15 1,16 29,17 13,20 13,24 9,25 5,26 1,28 4,32 18,34 1,36 0.069,37 2,38 28.5,39 27.287,40 30.08,41 20.659,42 19.691,43 3.7,44 5.4}
{0 CHEMBL1984760,1 8.155,2 39.6,3 41.7,4 1.028,5 1.155,6 0.649,7 0.64,8 391.44,9 10.4,10 16,11 48,13 17,14 30,16 50,17 19,20 13,21 6,22 1,23 3,24 20,25 9,28 5,29 1,32 28,34 3,35 2.1,36 0.14,37 7,38 39,39 49.327,40 55.457,41 31.148,42 30.713,43 6.3,44 5.4}
{0 CHEMBL1984842,1 7.375,2 39.7,3 46,4 1.006,5 1.139,6 0.651,7 0.623,8 464.6,9 9.5,10 22,11 63,13 22,14 37,16 66,17 25,20 16,21 9,23 1,24 29,25 9,28 6,29 2,32 34,34 1,35 3.2,36 0.136,37 9,38 48,39 63.381,40 71.731,41 41.017,42 39.263,43 1.6,44 5.4}
{0 CHEMBL1984847,1 11.106,2 42.5,3 32.5,4 1.056,5 1.147,6 0.697,7 0.702,8 444.23,9 7.5,10 11,11 40,13 14,14 29,15 1,16 42,17 17,20 13,21 4,22 3,23 3,24 13,25 10,26 1,28 3,29 3,32 27,34 4,35 7.5,36 0.119,37 5,38 37.5,39 42.24,40 45.89,41 27.875,42 28.071,43 10,44 5.4}
{0 CHEMBL1985042,1 8.32,2 44.8,3 37.9,4 1.017,5 1.123,6 0.689,7 0.676,8 241.27,9 10.3,10 11,11 29,13 13,14 20,16 31,17 13,20 12,21 1,22 2,24 11,25 5,28 3,29 2,32 18,35 6.9,36 0.032,37 1,38 27.5,39 29.494,40 32.575,41 19.972,42 19.601,44 4.3}
{0 CHEMBL1985206,1 8.511,2 50,3 38.9,4 0.997,5 1.1,6 0.741,7 0.697,8 306.41,9 5.6,10 16,11 36,13 17,14 25,16 39,17 18,19 2,20 13,21 3,24 14,25 4,26 1,28 2,29 1,31 1,32 22,33 1,35 2.8,36 0.051,37 2,38 35,39 35.909,40 39.617,41 26.682,42 25.106,44 5.4}
{0 CHEMBL1985367,1 7.469,2 45.9,3 43.2,4 0.992,5 1.121,6 0.692,7 0.655,8 276.37,9 10.8,10 18,11 37,13 18,14 23,16 39,17 17,20 15,21 2,24 16,25 4,28 4,32 21,36 0.077,37 3,38 32,39 36.709,40 41.484,41 25.591,42 24.246,44 5.4}
{0 CHEMBL1985469,1 7.373,2 40.9,3 45.5,4 1.003,5 1.13,6 0.66,7 0.63,8 324.42,9 9.1,10 12,11 44,13 14,14 26,16 46,17 18,20 14,21 4,22 2,24 20,25 6,28 4,29 2,32 24,35 4.5,36 0.087,37 4,38 34,39 44.131,40 49.734,41 29.023,42 27.73,44 5.4}
{0 CHEMBL1985681,1 8.036,2 47.4,3 39.5,4 1.007,5 1.116,6 0.697,7 0.675,8 305.36,9 7.9,10 12,11 38,13 14,14 26,16 41,17 18,19 1,20 12,21 5,22 1,24 15,25 5,28 3,29 2,32 23,33 1,35 5.3,36 0.024,37 1,38 35,39 38.262,40 42.405,41 26.495,42 25.655,44 6.4}
{0 CHEMBL1986143,1 7.387,2 46.7,3 44.4,4 0.996,5 1.114,6 0.684,7 0.649,8 332.43,9 4.4,10 18,11 45,13 19,14 27,16 47,17 21,20 18,21 3,22 1,24 20,25 4,28 2,29 2,32 25,35 4.4,36 0.128,37 6,38 37,39 44.811,40 50.152,41 30.773,42 29.214,44 5.4}
{0 CHEMBL1986177,1 10.023,2 41.9,3 34.9,4 1.019,5 1.118,6 0.755,7 0.713,8 430.98,9 14,10 21,11 43,13 22,14 31,16 46,17 18,18 1,20 16,21 2,22 1,24 15,25 10,26 3,28 6,29 1,31 2,32 28,34 1,35 2.3,36 0.13,37 6,38 42.5,39 43.833,40 48.059,41 32.449,42 30.679,43 2.3,44 5.4}
{0 CHEMBL1986265,1 9.087,2 43.2,3 38.6,4 1.04,5 1.142,6 0.674,7 0.668,8 399.82,9 2.3,10 12,11 44,13 13,14 29,16 46,17 19,18 1,20 13,21 6,22 1,23 3,24 17,25 8,26 1,28 1,29 3,32 27,34 4,35 6.8,36 0.13,37 6,38 36,39 45.782,40 50.242,41 29.654,42 29.411,43 9.1,44 5.4}
{0 CHEMBL1986391,1 10.312,2 45,3 30,4 1.035,5 1.108,6 0.755,7 0.736,8 206.24,9 10,10 6,11 20,13 9,14 15,16 21,17 9,20 9,22 3,24 6,25 5,26 1,28 2,29 2,31 1,32 14,35 10,36 0.048,37 1,38 21,39 20.702,40 22.166,41 15.091,42 14.713,44 4.1}
{0 CHEMBL1986503,1 12.154,2 41.2,3 17.6,4 1.062,5 1.148,6 0.772,7 0.79,8 206.61,9 35.3,10 15,11 17,13 15,14 16,16 19,17 7,18 1,20 7,24 3,25 7,26 1,28 6,32 14,34 1,38 23.5,39 18.051,40 19.519,41 13.131,42 13.429,43 5.9,44 5.4}
{0 CHEMBL1986590,1 8.135,2 53.1,3 37.5,4 0.998,5 1.103,6 0.727,7 0.7,8 260.31,9 6.3,10 16,11 32,13 18,14 23,16 35,17 17,20 17,22 2,24 12,25 3,28 2,29 1,32 20,35 3.1,36 0.029,37 1,38 33,39 31.949,40 35.282,41 23.273,42 22.392,44 5.5}
{0 CHEMBL1986756,1 8.79,2 43.9,3 36.6,4 1.036,5 1.149,6 0.674,7 0.674,8 360.37,9 9.8,10 17,11 41,13 18,14 28,16 43,17 18,20 15,21 3,22 1,23 3,24 15,25 8,28 4,29 1,32 26,34 3,35 2.4,36 0.07,37 3,38 37.5,39 42.458,40 47.128,41 27.62,42 27.638,43 7.3,44 5.4}
{0 CHEMBL1986899,1 7.497,2 48.7,3 43.6,4 0.994,5 1.119,6 0.693,7 0.657,8 292.38,9 5.1,10 18,11 39,13 18,14 24,16 41,17 19,20 17,21 2,23 1,24 17,25 3,28 2,32 22,34 1,36 0.098,37 4,38 33,39 38.785,40 43.658,41 27.04,42 25.641,43 2.6,44 5.4}
{0 CHEMBL1986943,1 8.187,2 40.5,3 42.9,4 1.008,5 1.132,6 0.683,7 0.651,8 343.85,9 11.9,10 16,11 42,13 16,14 27,16 45,17 17,18 1,20 11,21 6,24 18,25 7,26 1,28 5,29 1,32 24,34 1,35 2.4,36 0.067,37 3,38 35,39 42.345,40 47.551,41 28.671,42 27.337,43 2.4,44 5.8}
{0 CHEMBL1987003,1 12.802,2 41.2,3 23.5,4 1.074,5 1.107,6 0.788,7 0.778,8 217.64,9 5.9,10 6,11 17,13 9,14 14,16 18,17 7,18 1,20 7,22 3,24 4,25 6,26 2,28 1,29 3,31 1,32 13,34 1,35 17.6,38 20,39 18.251,40 18.821,41 13.398,42 13.234,43 5.9,44 4.3}
{0 CHEMBL1987430,1 8.509,2 43.2,3 38.6,4 1.03,5 1.149,6 0.668,7 0.663,8 374.4,9 9.1,10 17,11 44,13 18,14 29,16 46,17 19,20 15,21 4,22 1,23 3,24 17,25 8,28 4,29 1,32 27,34 3,35 2.3,36 0.087,37 4,38 38.5,39 45.341,40 50.543,41 29.381,42 29.165,43 6.8,44 5.4}
{0 CHEMBL1987535,1 7.833,2 42.2,3 44.4,4 0.997,5 1.121,6 0.694,7 0.649,8 352.5,9 8.9,10 15,11 45,13 17,14 28,16 48,17 19,20 14,21 5,22 2,24 20,25 6,26 1,28 4,29 1,31 1,32 25,35 2.2,36 0.083,37 4,38 37.5,39 44.88,40 50.444,41 31.216,42 29.202,44 5.4}
{0 CHEMBL1987998,1 8.093,2 43.9,3 43.9,4 1.009,5 1.117,6 0.685,7 0.652,8 331.82,9 2.4,10 12,11 41,13 13,14 25,16 43,17 18,18 1,20 13,21 5,22 1,24 18,25 5,26 1,28 1,29 3,32 23,34 1,35 7.3,36 0.14,37 6,38 32,39 41.36,40 45.807,41 28.08,42 26.735,43 2.4,44 5.4}
{0 CHEMBL1988141,1 7.112,2 35.9,3 48.7,4 1.009,5 1.14,6 0.627,7 0.601,8 277.36,9 7.7,10 6,11 39,13 8,14 21,16 40,17 14,20 8,21 6,22 2,24 19,25 6,28 3,29 3,32 20,35 7.7,36 0.075,37 3,38 26,39 39.356,40 44.445,41 24.472,42 23.423,44 7.1}
{0 CHEMBL1988437,1 8.402,2 47.8,3 39.1,4 1,5 1.109,6 0.727,7 0.689,8 386.51,9 8.7,10 22,11 46,13 24,14 31,16 49,17 22,20 21,21 1,22 2,24 18,25 6,26 1,28 4,29 1,31 1,32 28,35 2.2,36 0.102,37 5,38 44,39 45.996,40 51.029,41 33.455,42 31.675,44 5.4}
{0 CHEMBL1988581,1 7.291,2 37.5,3 46.9,4 1.008,5 1.138,6 0.64,7 0.614,8 233.3,9 9.4,11 32,13 5,14 18,16 33,17 12,20 8,21 4,22 5,24 15,25 5,28 3,29 2,32 17,35 6.3,36 0.061,37 2,38 23,39 32.262,40 36.405,41 20.495,42 19.655,44 7.1}
{0 CHEMBL1988692,1 7.454,2 41.7,3 44.4,4 1.001,5 1.13,6 0.668,7 0.638,8 268.35,9 11.1,10 10,11 36,13 13,14 22,16 38,17 15,20 12,21 3,22 3,24 16,25 5,28 4,29 1,32 20,35 2.8,36 0.079,37 3,38 30,39 36.036,40 40.694,41 24.046,42 22.961,44 5.4}
{0 CHEMBL1988805,1 10.054,2 45.8,3 29.2,4 1.02,5 1.118,6 0.768,7 0.743,8 241.3,9 20.8,10 15,11 24,13 16,14 19,16 26,17 11,19 1,20 10,24 7,25 6,26 1,28 5,31 1,32 17,33 1,36 0.038,37 1,38 28.5,39 24.469,40 26.827,41 18.438,42 17.821,44 5.4}
{0 CHEMBL1989043,1 9.067,2 41.2,3 41.2,4 1.01,5 1.122,6 0.72,7 0.675,8 462.44,9 9.8,10 17,11 51,13 18,14 33,16 54,17 21,18 2,20 16,21 5,22 1,24 21,25 9,26 3,28 5,29 1,31 1,32 30,34 2,35 2,36 0.093,37 5,38 42.5,39 51.513,40 57.246,41 36.699,42 34.405,43 3.9,44 5.4}
{0 CHEMBL1989267,1 7.791,2 42.5,3 43.8,4 1.002,5 1.122,6 0.684,7 0.648,8 568.76,9 8.2,10 26,11 73,13 29,14 45,16 77,17 31,20 25,21 6,22 3,24 32,25 10,26 1,28 6,29 3,31 1,32 41,35 4.1,36 0.117,37 9,38 61,39 73.156,40 81.936,41 49.944,42 47.308,44 5.4}
{0 CHEMBL1989471,1 7.21,2 45.7,3 45.7,4 0.992,5 1.117,6 0.68,7 0.641,8 252.34,9 5.7,10 16,11 35,13 16,14 21,16 37,17 16,20 12,21 4,24 16,25 3,28 2,29 1,32 19,35 2.9,36 0.027,37 1,38 29,39 34.716,40 39.112,41 23.796,42 22.445,44 5.4}
{0 CHEMBL1989708,1 8.043,2 43.5,3 41.9,4 1.003,5 1.121,6 0.697,7 0.662,8 498.66,9 9.7,10 27,11 62,13 28,14 40,16 66,17 27,20 23,21 4,22 1,24 26,25 9,26 1,28 6,29 2,31 1,32 36,35 3.2,36 0.091,37 6,38 54.5,39 62.178,40 69.481,41 43.205,42 41.013,44 5.4}
{0 CHEMBL1990223,1 8.643,2 43.2,3 43.2,4 1.013,5 1.117,6 0.698,7 0.661,8 380.29,9 2.3,10 12,11 44,13 13,14 27,16 46,17 19,18 2,20 13,21 6,22 1,24 19,25 6,26 2,28 1,29 3,32 25,34 2,35 6.8,36 0.13,37 6,38 34,39 44.567,40 49.167,41 30.699,42 29.089,43 4.5,44 5.4}
{0 CHEMBL1990254,1 7.382,2 46.5,3 44.2,4 0.993,5 1.117,6 0.688,7 0.651,8 317.42,9 7,10 18,11 43,13 19,14 26,16 45,17 20,20 18,21 2,22 1,24 19,25 4,28 3,29 1,32 24,35 2.3,36 0.111,37 5,38 36,39 42.702,40 48.026,41 29.563,42 27.993,44 5.4}
{0 CHEMBL1990496,1 7.445,2 46.8,3 43.5,4 0.993,5 1.117,6 0.691,7 0.655,8 461.61,9 8.1,10 23,11 62,13 26,14 39,16 66,17 29,20 25,21 4,22 3,24 27,25 6,28 5,29 1,32 35,35 1.6,36 0.106,37 7,38 53.5,39 61.556,40 69.268,41 42.858,42 40.617,44 5.4}
{0 CHEMBL1990590,1 8.837,2 50,3 36.8,4 1.007,5 1.109,6 0.734,7 0.704,8 335.81,9 7.9,10 22,11 38,13 22,14 27,16 41,17 19,18 1,20 18,21 1,24 14,25 5,26 1,28 3,29 1,32 24,34 1,35 2.6,36 0.049,37 2,38 38,39 38.258,40 42.14,41 27.898,42 26.767,43 2.6,44 5.4}
{0 CHEMBL1990885,1 7.117,2 39.3,3 48.2,4 1.003,5 1.138,6 0.643,7 0.611,8 398.53,9 7.1,10 11,11 56,13 14,14 31,16 58,17 22,20 14,21 8,22 3,23 1,24 27,25 7,28 4,29 2,32 29,34 1,35 3.6,36 0.121,37 7,38 39.5,39 56.178,40 63.734,41 36.006,42 34.22,43 1.8,44 5.4}
{0 CHEMBL1991078,1 8.117,2 44.6,3 39.3,4 1.012,5 1.124,6 0.687,7 0.669,8 454.53,9 10.7,10 27,11 56,13 28,14 38,16 60,17 25,20 22,21 3,22 1,24 22,25 9,28 6,29 3,32 34,35 5.4,36 0.117,37 7,38 52.5,39 56.662,40 62.94,41 38.489,42 37.487,44 6.4}
{0 CHEMBL1991377,1 9.46,2 45.2,3 32.3,4 1.051,5 1.155,6 0.68,7 0.696,8 293.27,9 9.7,10 16,11 31,13 16,14 23,16 33,17 14,20 12,21 2,23 3,24 10,25 7,28 3,29 1,32 21,34 3,35 3.2,36 0.03,37 1,38 31,39 32.589,40 35.799,41 21.091,42 21.563,43 9.7,44 5.4}
{0 CHEMBL1991410,1 10.126,2 50,3 28.9,4 1.04,5 1.129,6 0.737,7 0.738,8 384.79,9 10.5,10 22,11 38,13 23,14 30,16 41,17 19,18 1,20 19,22 1,23 2,24 11,25 8,26 1,28 4,29 1,32 27,34 3,35 2.6,36 0.073,37 3,38 42,39 39.502,40 42.902,41 28.017,42 28.029,43 7.9,44 5.4}
{0 CHEMBL1991674,1 8.187,2 40.5,3 42.9,4 1.008,5 1.132,6 0.683,7 0.651,8 343.85,9 11.9,10 16,11 42,13 16,14 27,16 45,17 17,18 1,20 11,21 6,24 18,25 7,26 1,28 5,29 1,32 24,34 1,35 2.4,36 0.067,37 3,38 35,39 42.345,40 47.551,41 28.671,42 27.337,43 2.4,44 5.4}
{0 CHEMBL1991678,1 8.009,2 41.5,3 41.5,4 1.017,5 1.144,6 0.664,7 0.648,8 424.5,9 11.3,10 22,11 53,13 22,14 34,16 56,17 22,20 16,21 6,23 2,24 22,25 9,28 6,29 1,32 31,34 2,35 1.9,36 0.107,37 6,38 45,39 53.916,40 60.615,41 35.216,42 34.351,43 3.8,44 5.4}
{0 CHEMBL1991734,1 7.177,2 47.6,3 45.2,4 0.985,5 1.115,6 0.693,7 0.649,8 301.42,9 7.1,10 18,11 42,13 18,14 26,16 45,17 20,20 18,21 2,24 19,25 3,28 3,32 23,36 0.022,37 1,38 35,39 41.374,40 46.817,41 29.108,42 27.279,44 6}
{0 CHEMBL1991782,1 8.97,2 50,3 37.5,4 1.002,5 1.095,6 0.756,7 0.71,8 215.29,9 4.2,10 11,11 24,13 12,14 17,16 26,17 12,20 11,21 1,22 1,24 9,25 3,26 1,28 1,29 1,31 1,32 15,35 4.2,36 0.038,37 1,38 23.5,39 24.04,40 26.289,41 18.154,42 17.031,44 4.1}
{0 CHEMBL1991818,1 7.205,2 45.7,3 45.7,4 0.991,5 1.118,6 0.681,7 0.642,8 331.45,9 6.5,10 18,11 46,13 18,14 28,16 49,17 21,20 18,21 3,24 21,25 4,28 3,29 1,32 25,35 2.2,36 0.041,37 2,38 37,39 45.585,40 51.441,41 31.324,42 29.52,44 5.4}
{0 CHEMBL1991867,1 13.433,2 30.8,3 23.1,4 1.062,5 1.143,6 0.81,7 0.777,8 174.63,9 30.8,10 9,11 13,13 9,14 11,16 14,17 4,18 1,20 4,24 3,25 6,26 2,28 4,31 1,32 10,34 1,38 15.5,39 13.807,40 14.857,41 10.528,42 10.1,43 7.7,44 4.6}
{0 CHEMBL1991973,1 7.921,2 37.5,3 44.6,4 1.013,5 1.132,6 0.663,7 0.633,8 443.58,9 8.9,10 16,11 56,13 18,14 35,16 60,17 21,20 12,21 9,22 2,24 25,25 10,26 1,28 5,29 4,31 1,32 31,35 7.1,36 0.1,37 6,38 45,39 56.731,40 63.401,41 37.108,42 35.421,44 5.6}
{0 CHEMBL1992042,1 7.76,2 51.8,3 41.1,4 0.996,5 1.109,6 0.71,7 0.677,8 434.54,9 3.6,10 23,11 56,13 25,14 38,16 61,17 29,20 25,21 4,22 2,23 1,24 23,25 4,28 2,29 1,32 33,34 1,35 1.8,36 0.049,37 3,38 51.5,39 55.763,40 62.113,41 39.779,42 37.936,43 1.8,44 5.9}
{0 CHEMBL1992073,1 7.623,2 36.7,3 46.9,4 1.004,5 1.134,6 0.662,7 0.622,8 373.53,9 10.2,10 14,11 49,13 16,14 30,16 53,17 18,20 8,21 10,22 2,24 23,25 8,26 1,28 5,29 2,31 1,32 26,35 4.1,36 0.094,37 5,38 39,39 49.192,40 55.567,41 32.438,42 30.465,44 6.4}
{0 CHEMBL1992125,1 7.409,2 40,3 45.5,4 1.006,5 1.132,6 0.655,7 0.628,8 407.52,9 9.1,10 18,11 55,13 18,14 33,16 58,17 22,20 15,21 7,24 25,25 8,28 5,29 3,32 30,35 5.5,36 0.103,37 6,38 42,39 55.327,40 62.272,41 36.006,42 34.519,44 6}
{0 CHEMBL1992371,1 8.494,2 45.5,3 36.4,4 1.018,5 1.123,6 0.696,7 0.686,8 280.31,9 12.1,10 17,11 33,13 18,14 23,16 35,17 15,20 15,22 1,24 12,25 6,28 4,29 2,32 21,35 6.1,36 0.057,37 2,38 32.5,39 33.596,40 37.073,41 22.977,42 22.622,44 5.6}
{0 CHEMBL1992581,1 8.82,2 47.6,3 38.1,4 1.017,5 1.122,6 0.716,7 0.689,8 370.45,9 4.8,10 18,11 42,13 19,14 28,16 44,17 20,20 18,21 2,22 1,23 2,24 16,25 6,26 1,28 2,29 1,31 1,32 26,34 2,35 2.4,36 0.114,37 5,38 38,39 42.702,40 47.127,41 30.08,42 28.926,43 4.8,44 5.4}
{0 CHEMBL1992607,1 8.146,2 31.8,3 40.9,4 1.027,5 1.161,6 0.637,7 0.631,8 179.21,9 22.7,10 6,11 22,13 7,14 14,16 23,17 7,20 5,21 2,22 1,24 9,25 6,28 5,29 1,32 13,35 4.5,38 18,39 22.604,40 25.531,41 14.006,42 13.875,44 4.7}
{0 CHEMBL1992937,1 8.687,2 41.9,3 35.5,4 1.026,5 1.134,6 0.685,7 0.681,8 269.29,9 16.1,10 16,11 31,13 18,14 22,16 33,17 13,20 12,21 1,22 2,24 11,25 7,28 5,29 2,32 20,35 6.5,36 0.091,37 3,38 32,39 31.814,40 35.156,41 21.222,42 21.117,44 5.4}
{0 CHEMBL1993335,1 11.135,2 48.4,3 32.3,4 1.022,5 1.124,6 0.753,7 0.729,8 345.19,9 12.9,10 20,11 31,13 20,14 24,15 1,16 34,17 15,20 14,21 1,23 1,24 10,25 6,26 1,28 4,32 21,34 2,36 0.029,37 1,38 34,39 31.683,40 34.835,41 23.358,42 22.601,43 6.5,44 5.4}
{0 CHEMBL1993374,1 8.51,2 34.3,3 45.7,4 1.006,5 1.138,6 0.689,7 0.637,8 297.85,9 14.3,10 11,11 35,13 11,14 20,16 36,17 12,18 1,20 7,21 5,24 16,25 7,26 2,28 5,31 1,32 19,34 1,36 0.139,37 5,38 25.5,39 35.211,40 39.847,41 24.103,42 22.282,43 2.9,44 5.4}
{0 CHEMBL1993413,1 9.179,2 50,3 34.2,4 1.013,5 1.111,6 0.741,7 0.717,8 348.81,9 10.5,10 22,11 38,13 23,14 28,16 41,17 19,18 1,20 19,22 1,24 13,25 6,26 1,28 4,29 1,32 25,34 1,35 2.6,36 0.073,37 3,38 40,39 38.476,40 42.223,41 28.142,42 27.262,43 2.6,44 5.4}
{0 CHEMBL1993661,1 8.889,2 37,3 40.7,4 1.028,5 1.132,6 0.679,7 0.656,8 479.99,9 9.3,10 18,11 54,13 20,14 34,16 56,17 20,18 1,20 16,21 4,22 2,24 22,25 12,26 2,28 5,29 5,31 1,32 32,34 1,35 9.3,36 0.161,37 9,38 45,39 55.498,40 61.139,41 36.659,42 35.437,43 1.9,44 6}
{0 CHEMBL1993877,1 7.3,2 41.9,3 45.2,4 0.994,5 1.131,6 0.672,7 0.636,8 226.31,9 12.9,10 10,11 31,13 11,14 19,16 33,17 13,19 2,20 6,21 5,24 14,25 4,28 4,32 17,33 1,36 0.03,37 1,38 26,39 30.825,40 35.069,41 20.83,42 19.72,44 5.4}
{0 CHEMBL1993904,1 9.125,2 47.7,3 34.1,4 1.015,5 1.112,6 0.736,7 0.713,8 401.48,9 11.4,10 26,11 44,13 27,14 33,16 48,17 21,20 21,22 1,24 15,25 8,26 1,28 5,29 2,31 1,32 29,35 4.5,36 0.083,37 4,38 47,39 44.658,40 48.906,41 32.392,42 31.358,44 5.4}
{0 CHEMBL1994308,1 9.497,2 43.5,3 34.8,4 1.043,5 1.146,6 0.689,7 0.689,8 436.85,9 8.7,10 16,11 46,13 19,14 32,16 48,17 20,18 1,20 17,21 3,22 3,23 3,24 16,25 10,26 1,28 4,29 2,32 30,34 4,35 4.3,36 0.125,37 6,38 43,39 47.992,40 52.697,41 31.693,42 31.707,43 8.7,44 5.4}
{0 CHEMBL1994318,1 6.841,2 40.3,3 49.4,4 0.992,5 1.131,6 0.651,7 0.61,8 526.75,9 7.8,10 22,11 77,13 24,14 42,16 80,17 31,20 21,21 10,22 2,24 38,25 8,28 6,29 2,32 39,35 2.6,36 0.113,37 9,38 55,39 76.403,40 87.052,41 50.126,42 46.987,44 5.4}
{0 CHEMBL1994526,1 6.343,2 35.9,3 53.8,4 0.989,5 1.14,6 0.624,7 0.577,8 247.38,9 7.7,10 6,11 39,13 7,14 19,16 40,17 14,20 6,21 8,22 1,24 21,25 4,28 3,29 1,32 18,35 2.6,36 0.075,37 3,38 23,39 38.585,40 44.441,41 24.324,42 22.52,44 5.4}
{0 CHEMBL1994555,1 7.581,2 45.7,3 42.9,4 0.998,5 1.12,6 0.687,7 0.655,8 265.34,9 8.6,10 16,11 35,13 17,14 22,16 37,17 16,20 13,21 3,22 1,24 15,25 4,28 3,29 1,32 20,35 2.9,36 0.081,37 3,38 31,39 34.934,40 39.196,41 24.04,42 22.94,44 5.4}
{0 CHEMBL1994724,1 8.059,2 45.2,3 42.9,4 1,5 1.111,6 0.706,7 0.664,8 338.46,9 4.8,10 17,11 42,13 18,14 26,16 44,17 19,20 16,21 3,22 1,24 18,25 5,26 1,28 2,29 2,31 1,32 24,35 4.8,36 0.114,37 5,38 35.5,39 42.003,40 46.657,41 29.659,42 27.874,44 6}
{0 CHEMBL1994808,1 8.532,2 47.8,3 34.8,4 1.008,5 1.123,6 0.719,7 0.702,8 196.23,9 17.4,10 12,11 23,13 13,14 16,16 24,17 11,19 1,20 9,21 1,24 8,25 4,28 4,32 15,33 1,36 0.042,37 1,38 24,39 23.174,40 25.824,41 16.546,42 16.139,44 4.4}
{0 CHEMBL1994977,1 7.138,2 41.4,3 47.1,4 0.998,5 1.128,6 0.658,7 0.623,8 499.67,9 7.1,10 22,11 70,13 24,14 40,16 73,17 29,20 21,21 8,22 2,24 33,25 8,28 5,29 3,32 37,35 4.3,36 0.123,37 9,38 53,39 69.861,40 78.933,41 46.052,42 43.627,44 5.4}
{0 CHEMBL1995172,1 11.755,2 50,3 35,4 1.004,5 1.104,6 0.782,7 0.732,8 235.09,9 10,10 11,11 20,13 11,14 15,15 1,16 22,17 10,20 9,21 1,24 7,25 3,26 1,28 2,32 13,34 1,38 20.5,39 20.084,40 22.084,41 15.648,42 14.648,43 5,44 5.4}
{0 CHEMBL1995211,1 7.01,2 42.1,3 47.4,4 0.989,5 1.129,6 0.667,7 0.626,8 266.38,9 10.5,10 16,11 38,13 16,14 22,16 40,17 16,20 12,21 4,24 18,25 4,28 4,32 20,36 0.075,37 3,38 30,39 37.592,40 42.9,41 25.353,42 23.773,44 5.4}
{0 CHEMBL1995765,1 8.39,2 38.1,3 38.1,4 1.024,5 1.144,6 0.667,7 0.66,8 176.2,9 19,10 6,11 21,13 8,14 14,16 22,17 8,20 8,22 2,24 8,25 5,28 4,29 1,32 13,35 4.8,36 0.045,37 1,38 19,39 21.502,40 24.033,41 14,42 13.854,44 4.8}
{0 CHEMBL1995811,1 8.968,2 47.9,3 33.3,4 1.026,5 1.133,6 0.707,7 0.704,8 430.45,9 12.5,10 27,11 48,13 28,14 36,16 52,17 23,20 22,21 1,22 1,23 2,24 16,25 9,28 6,29 1,32 32,34 2,35 2.1,36 0.096,37 5,38 50.5,39 49.265,40 54.37,41 33.932,42 33.771,43 4.2,44 6.6}
{0 CHEMBL1996048,1 7.173,2 41.9,3 46.5,4 0.995,5 1.128,6 0.664,7 0.628,8 308.42,9 9.3,10 16,11 43,13 17,14 25,16 45,17 18,20 15,21 3,22 1,24 20,25 5,28 4,29 1,32 23,35 2.3,36 0.111,37 5,38 34,39 42.803,40 48.524,41 28.569,42 27.015,44 5.4}
{0 CHEMBL1996176,1 8.087,2 50,3 38.5,4 1.003,5 1.11,6 0.712,7 0.687,8 210.25,9 7.7,10 11,11 26,13 13,14 18,16 28,17 13,20 13,22 2,24 10,25 3,28 2,29 1,32 16,35 3.8,36 0.036,37 1,38 25.5,39 26.065,40 28.867,41 18.512,42 17.865,44 5.4}
{0 CHEMBL1996208,1 7.358,2 34.9,3 46.5,4 1.01,5 1.147,6 0.634,7 0.61,8 316.41,9 14,10 12,11 43,13 12,14 25,16 45,17 15,20 9,21 6,24 20,25 8,28 6,29 2,32 23,35 4.7,36 0.133,37 6,38 31,39 43.451,40 49.315,41 27.273,42 26.246,44 5.4}
{0 CHEMBL1996345,1 8.688,2 44.1,3 38.2,4 1.004,5 1.12,6 0.727,7 0.688,8 295.4,9 14.7,10 15,11 34,13 16,14 24,16 37,17 15,19 1,20 10,21 4,24 13,25 6,26 1,28 5,31 1,32 21,33 1,36 0.027,37 1,38 33.5,39 34.12,40 38.072,41 24.722,42 23.401,44 5.4}
{0 CHEMBL1996500,1 8.209,2 42,3 40,4 1.021,5 1.144,6 0.669,7 0.656,8 410.47,9 12,10 22,11 50,13 22,14 33,16 53,17 21,20 16,21 5,23 2,24 20,25 9,28 6,29 1,32 30,34 2,35 2,36 0.094,37 5,38 44,39 51.032,40 57.2,41 33.455,42 32.824,43 4,44 5.4}
{0 CHEMBL1996510,1 8.163,2 46.2,3 38.5,4 1.009,5 1.121,6 0.698,7 0.678,8 424.5,9 11.5,10 21,11 52,13 24,14 37,16 57,17 24,20 20,21 4,22 3,24 20,25 8,28 6,29 2,32 32,35 3.8,36 0.053,37 3,38 50.5,39 52.451,40 58.315,41 36.273,42 35.246,44 6.6}
{0 CHEMBL1996576,1 7.92,2 42.9,3 42.9,4 1.02,5 1.141,6 0.658,7 0.642,8 443.51,9 5.4,10 16,11 56,13 17,14 36,16 60,17 24,20 15,21 9,22 1,23 3,24 24,25 8,28 3,29 2,32 32,34 3,35 3.6,36 0.05,37 3,38 45,39 57.101,40 63.915,41 36.875,42 35.965,43 5.4,44 5.4}
{0 CHEMBL1996646,1 7.491,2 40.4,3 47.4,4 1,5 1.129,6 0.665,7 0.626,8 426.99,9 7,10 17,11 57,13 17,14 33,16 60,17 23,18 1,20 14,21 9,24 27,25 7,26 1,28 4,29 2,32 30,34 1,35 3.5,36 0.117,37 7,38 41.5,39 56.989,40 64.338,41 37.926,42 35.664,43 1.8,44 5.4}
{0 CHEMBL1996649,1 7.75,2 40.6,3 44.9,4 1.005,5 1.131,6 0.673,7 0.637,8 534.72,9 8.7,10 22,11 69,13 24,14 41,16 72,17 28,20 21,21 7,22 2,23 1,24 31,25 10,26 1,28 6,29 2,31 1,32 38,34 1,35 2.9,36 0.139,37 10,38 54,39 69.341,40 78.066,41 46.427,42 43.977,43 1.4,44 5.4}
{0 CHEMBL1996702,1 7.429,2 41.9,3 45.2,4 1.005,5 1.126,6 0.661,7 0.633,8 460.58,9 6.5,10 18,11 62,13 20,14 37,16 65,17 26,20 20,21 6,22 2,24 28,25 8,28 4,29 4,32 34,35 6.5,36 0.108,37 7,38 48,39 62.32,40 69.813,41 40.978,42 39.266,44 5.4}
{0 CHEMBL1996795,1 7.926,2 42.4,3 44.1,4 1.008,5 1.125,6 0.68,7 0.646,8 467.61,9 5.1,10 18,11 59,13 21,14 36,16 62,17 25,20 19,21 6,22 3,23 1,24 26,25 8,26 1,28 3,29 3,31 1,32 33,34 1,35 5.1,36 0.097,37 6,38 48,39 59.48,40 66.365,41 40.103,42 38.101,43 1.7,44 5.5}
{0 CHEMBL1997007,1 7.188,2 40,3 46.7,4 0.998,5 1.134,6 0.657,7 0.623,8 323.44,9 11.1,10 16,11 45,13 17,14 26,16 47,17 18,20 13,21 5,22 1,24 21,25 6,28 5,29 1,32 24,35 2.2,36 0.128,37 6,38 35,39 44.905,40 51.023,41 29.574,42 28.036,44 5.4}
{0 CHEMBL1997041,1 8.417,2 48.1,3 37,4 1.013,5 1.129,6 0.704,7 0.687,8 227.26,9 11.1,10 16,11 27,13 16,14 19,16 29,17 13,20 12,21 1,23 1,24 10,25 4,28 3,32 17,34 1,36 0.034,37 1,38 27,39 27.353,40 30.495,41 19,42 18.555,43 3.7,44 5.2}
{0 CHEMBL1997193,1 11.39,2 50,3 32.4,4 1.017,5 1.096,6 0.786,7 0.745,8 387.27,9 5.9,10 11,11 34,13 15,14 25,15 1,16 36,17 17,19 1,20 15,21 1,22 3,24 11,25 6,26 2,28 2,29 2,31 1,32 23,33 1,34 1,35 5.9,36 0.056,37 2,38 35.5,39 34.582,40 37.253,41 26.727,42 25.319,43 2.9,44 6}
{0 CHEMBL1997197,1 8.28,2 41.5,3 41.5,4 1.005,5 1.125,6 0.7,7 0.663,8 339.46,9 12.2,10 17,11 41,13 18,14 26,16 43,17 17,20 15,21 2,22 1,24 17,25 7,26 1,28 5,29 1,31 1,32 24,35 2.4,36 0.14,37 6,38 35.5,39 41.214,40 46.112,41 28.699,42 27.17,44 5.4}
{0 CHEMBL1997275,1 8.065,2 50,3 38.9,4 1.004,5 1.109,6 0.708,7 0.684,8 290.34,9 5.6,10 16,11 36,13 18,14 25,16 39,17 18,20 17,21 1,22 2,24 14,25 4,28 2,29 2,32 22,35 5.6,36 0.051,37 2,38 35,39 36.16,40 39.907,41 25.489,42 24.633,44 5.4}
{0 CHEMBL1997335,1 7.777,2 46.5,3 41.9,4 1.006,5 1.115,6 0.685,7 0.661,8 334.4,9 4.7,10 17,11 43,13 18,14 28,16 46,17 20,20 17,21 3,22 1,24 18,25 5,28 2,29 3,32 25,35 7,36 0.087,37 4,38 37.5,39 43.254,40 47.946,41 29.466,42 28.402,44 6.1}
{0 CHEMBL1997611,1 8.89,2 38.1,3 35.7,4 1.045,5 1.139,6 0.656,7 0.667,8 373.36,9 11.9,10 11,11 42,13 16,14 29,16 44,17 16,20 12,21 4,22 5,24 15,25 11,28 5,29 6,32 27,35 14.3,36 0.114,37 5,38 39.5,39 43.891,40 47.824,41 27.563,42 28.03,44 5.5}
{0 CHEMBL1997846,1 7.996,2 41.5,3 43.9,4 1,5 1.13,6 0.688,7 0.649,8 327.85,9 12.2,10 16,11 41,13 16,14 26,16 44,17 17,18 1,20 11,21 6,24 18,25 6,26 1,28 5,32 23,34 1,36 0.068,37 3,38 34,39 41.018,40 46.342,41 28.216,42 26.622,43 2.4,44 5.4}
{0 CHEMBL1997892,1 10.251,2 44.2,3 30.2,4 1.061,5 1.154,6 0.695,7 0.711,8 440.81,9 9.3,10 12,11 43,13 16,14 32,16 45,17 19,18 1,20 17,21 2,22 4,23 4,24 13,25 11,26 1,28 4,29 2,32 30,34 5,35 4.7,36 0.067,37 3,38 42,39 45.622,40 49.621,41 29.87,42 30.564,43 11.6,44 5.4}
{0 CHEMBL1998110,1 8.034,2 43.2,3 43.2,4 1.002,5 1.117,6 0.697,7 0.657,8 353.48,9 6.8,10 17,11 44,13 18,14 27,16 46,17 19,20 15,21 4,22 1,24 19,25 6,26 1,28 3,29 2,31 1,32 25,35 4.5,36 0.109,37 5,38 36.5,39 44.105,40 49.155,41 30.665,42 28.895,44 5.5}
{0 CHEMBL1998253,1 6.653,2 42.9,3 50,4 0.982,5 1.125,6 0.664,7 0.614,8 186.28,9 7.1,10 11,11 28,13 11,14 15,16 29,17 12,20 10,21 2,24 14,25 2,28 2,32 14,36 0.034,37 1,38 20.5,39 27.505,40 31.488,41 18.58,42 17.204,44 5.4}
{0 CHEMBL1998470,1 8.508,2 43.2,3 40.5,4 1.01,5 1.125,6 0.7,7 0.67,8 314.8,9 10.8,10 16,11 37,13 17,14 24,16 39,17 16,18 1,20 13,21 3,22 1,24 15,25 6,26 1,28 4,29 1,32 22,34 1,35 2.7,36 0.103,37 4,38 33,39 37.36,40 41.638,41 25.904,42 24.789,43 2.7,44 5.4}
{0 CHEMBL1998680,1 7.568,2 42.6,3 44.1,4 1.008,5 1.124,6 0.665,7 0.64,8 514.63,9 5.9,10 22,11 68,13 25,14 41,16 71,17 29,20 22,21 7,22 3,24 30,25 9,28 4,29 5,32 38,35 7.4,36 0.141,37 10,38 55,39 68.531,40 76.438,41 45.193,42 43.508,44 5.4}
{0 CHEMBL1998953,1 7.138,2 43.6,3 46.2,4 0.99,5 1.126,6 0.676,7 0.635,8 278.39,9 10.3,10 16,11 39,13 16,14 24,16 42,17 17,20 12,21 5,24 18,25 4,28 4,32 21,36 0.048,37 2,38 32,39 38.592,40 43.9,41 26.353,42 24.773,44 5.4}
{0 CHEMBL1999120,1 7.729,2 36,3 44,4 1.02,5 1.143,6 0.639,7 0.624,8 193.23,9 12,10 5,11 25,13 7,14 15,16 26,17 9,20 6,21 3,22 2,24 11,25 5,28 3,29 2,32 14,35 8,36 0.038,37 1,38 19.5,39 25.494,40 28.575,41 15.972,42 15.601,44 4.7}
{0 CHEMBL1999414,1 7.372,2 40.3,3 47.2,4 0.996,5 1.127,6 0.67,7 0.627,8 530.76,9 8.3,10 22,11 72,13 24,14 41,16 75,17 29,20 21,21 8,22 2,24 34,25 9,26 1,28 6,29 2,31 1,32 38,35 2.8,36 0.133,37 10,38 54,39 71.712,40 81.141,41 48.25,42 45.12,44 5.4}
{0 CHEMBL1999484,1 7.631,2 38,3 46,4 0.997,5 1.135,6 0.676,7 0.631,8 381.56,9 14,10 17,11 50,13 17,14 30,16 53,17 19,20 13,21 6,24 23,25 8,26 1,28 7,31 1,32 27,36 0.094,37 5,38 38.5,39 49.858,40 56.73,41 33.779,42 31.551,44 5.4}
{0 CHEMBL1999506,1 7.329,2 41.7,3 45.8,4 1.003,5 1.127,6 0.66,7 0.63,8 527.68,9 6.9,10 22,11 72,13 25,14 42,16 75,17 30,20 22,21 8,22 3,24 33,25 9,28 5,29 4,32 39,35 5.6,36 0.133,37 10,38 56,39 72.189,40 81.142,41 47.506,42 45.341,44 5.4}
{0 CHEMBL1999632,1 7.894,2 38.5,3 42.3,4 1.019,5 1.137,6 0.653,7 0.639,8 205.24,9 11.5,10 10,11 26,13 12,14 16,16 27,17 10,20 7,21 3,22 2,24 11,25 5,28 3,29 2,32 15,35 7.7,36 0.037,37 1,38 23,39 26.494,40 29.575,41 16.972,42 16.601,44 5.4}
{0 CHEMBL2000029,1 7.765,2 46.9,3 40.8,4 0.996,5 1.12,6 0.701,7 0.67,8 380.49,9 12.2,10 27,11 49,13 27,14 33,16 53,17 23,20 21,21 2,24 20,25 6,28 6,32 29,36 0.075,37 4,38 46.5,39 48.796,40 54.896,41 34.364,42 32.816,44 5.4}
{0 CHEMBL2000568,1 7.876,2 50,3 40,4 0.998,5 1.109,6 0.709,7 0.68,8 236.29,9 6.7,10 16,11 30,13 17,14 20,16 32,17 15,20 14,21 1,22 1,24 12,25 3,28 2,29 1,32 18,35 3.3,36 0.063,37 2,38 29,39 29.949,40 33.282,41 21.273,42 20.392,44 5.4}
{0 CHEMBL2000724,1 8.369,2 51.3,3 35.9,4 1.004,5 1.11,6 0.725,7 0.703,8 326.38,9 10.3,10 22,11 39,13 23,14 28,16 42,17 20,19 1,20 18,21 1,24 14,25 5,28 4,29 1,32 25,33 1,35 2.6,36 0.048,37 2,38 41,39 39.153,40 43.279,41 28.284,42 27.434,44 5.4}
{0 CHEMBL2000879,1 6.838,2 44.8,3 48.3,4 0.983,5 1.12,6 0.675,7 0.628,8 198.29,9 6.9,10 11,11 29,13 11,14 17,16 31,17 13,20 9,21 4,24 14,25 2,28 2,32 15,36 0.032,37 1,38 22.5,39 28.505,40 32.488,41 19.58,42 18.204,44 4.5}
{0 CHEMBL2000934,1 8.79,2 43.9,3 36.6,4 1.036,5 1.149,6 0.674,7 0.674,8 360.37,9 9.8,10 17,11 41,13 18,14 28,16 43,17 18,20 15,21 3,22 1,23 3,24 15,25 8,28 4,29 1,32 26,34 3,35 2.4,36 0.07,37 3,38 37.5,39 42.458,40 47.128,41 27.62,42 27.638,43 7.3,44 5.4}
{0 CHEMBL2001019,1 8.464,2 43.2,3 36.4,4 1.015,5 1.133,6 0.694,7 0.682,8 372.43,9 18.2,10 26,11 44,13 26,14 32,16 48,17 19,20 16,21 3,24 16,25 9,28 8,29 1,32 28,35 2.3,36 0.104,37 5,38 45,39 44.676,40 49.857,41 30.546,42 29.993,44 5.4}
{0 CHEMBL2001149,1 8.834,2 51,3 35.3,4 1.006,5 1.103,6 0.743,7 0.714,8 450.55,9 7.8,10 32,11 51,13 32,14 38,16 56,17 26,20 26,24 18,25 7,26 1,28 4,29 2,31 1,32 33,35 3.9,36 0.071,37 4,38 54,39 51.323,40 56.238,41 37.909,42 36.39,44 5.4}
{0 CHEMBL2001451,1 6.841,2 40.3,3 49.4,4 0.992,5 1.131,6 0.651,7 0.61,8 526.75,9 7.8,10 22,11 77,13 24,14 42,16 80,17 31,20 21,21 10,22 2,24 38,25 8,28 6,29 2,32 39,35 2.6,36 0.125,37 10,38 55,39 76.403,40 87.052,41 50.126,42 46.987,44 5.5}
{0 CHEMBL2001539,1 8.813,2 45,3 40,4 0.997,5 1.108,6 0.747,7 0.691,8 176.26,9 10,10 10,11 20,13 10,14 14,16 22,17 9,20 7,21 2,24 8,25 3,26 1,28 2,31 1,32 12,38 19,39 19.931,40 22.162,41 14.943,42 13.81,44 5}
{0 CHEMBL2001584,1 7.355,2 42,3 45.7,4 1.003,5 1.126,6 0.66,7 0.631,8 595.76,9 6.2,10 18,11 81,13 23,14 48,16 85,17 34,20 24,21 10,22 5,24 37,25 10,28 5,29 5,32 44,35 6.2,36 0.094,37 8,38 62,39 81.283,40 91.182,41 53.483,42 51.11,44 5.4}
{0 CHEMBL2001613,1 13.315,2 43.8,3 31.3,4 1.033,5 1.117,6 0.771,7 0.74,8 213.04,9 12.5,10 10,11 16,13 10,14 12,15 1,16 17,17 7,20 7,24 5,25 4,26 1,28 2,29 1,32 11,34 1,35 6.3,38 17,39 16.527,40 17.878,41 12.341,42 11.836,43 6.3,44 4.8}
{0 CHEMBL2001641,1 7.848,2 38.7,3 41.9,4 1.012,5 1.141,6 0.662,7 0.643,8 243.3,9 16.1,10 15,11 31,13 15,14 20,16 33,17 12,20 9,21 3,24 13,25 6,28 5,29 1,32 18,35 3.2,36 0.061,37 2,38 27.5,39 31.371,40 35.362,41 20.529,42 19.929,44 4.7}
{0 CHEMBL2001923,1 8.241,2 47.6,3 39,4 1.016,5 1.126,6 0.691,7 0.674,8 675.76,9 6.1,10 34,11 82,13 35,14 57,16 89,17 39,20 32,21 7,22 1,23 3,24 32,25 11,28 5,29 3,32 50,34 3,35 3.7,36 0.09,37 8,38 75,39 83.283,40 92.367,41 56.625,42 55.303,43 3.7,44 5.4}
{0 CHEMBL2001987,1 10.523,2 45.7,3 25.7,4 1.078,5 1.171,6 0.685,7 0.724,8 368.29,9 11.4,10 17,11 35,13 18,14 28,16 37,17 16,20 15,21 1,22 1,23 5,24 9,25 10,28 4,29 1,32 26,34 5,35 2.9,36 0.054,37 2,38 37.5,39 37.716,40 40.977,41 23.972,42 25.351,43 14.3,44 5.4}
{0 CHEMBL2002099,1 7.473,2 41.5,3 43.9,4 0.998,5 1.134,6 0.673,7 0.641,8 306.41,9 14.6,10 15,11 41,13 16,14 26,16 44,17 17,19 1,20 9,21 7,24 18,25 6,28 6,32 23,33 1,36 0.091,37 4,38 35.5,39 40.912,40 46.481,41 27.603,42 26.289,44 6.2}
{0 CHEMBL2002105,1 13.316,2 37.5,3 31.3,4 1.032,5 1.141,6 0.759,7 0.727,8 213.05,9 25,10 10,11 16,13 10,14 12,15 1,16 17,17 6,20 6,24 5,25 5,26 1,28 4,32 11,34 1,38 17,39 16.52,40 18.25,41 12.137,42 11.638,43 6.3,44 4.4}
{0 CHEMBL2002182,1 8.45,2 48,3 36,4 1.011,5 1.118,6 0.71,7 0.694,8 211.24,9 12,10 6,11 25,13 10,14 18,16 27,17 12,20 12,22 4,24 9,25 4,28 3,29 1,32 16,35 4,36 0.037,37 1,38 25,39 25.284,40 27.95,41 17.756,42 17.359,44 4}
{0 CHEMBL2002480,1 8.45,2 44,3 36,4 1.011,5 1.133,6 0.702,7 0.686,8 211.25,9 20,10 16,11 25,13 16,14 18,16 27,17 11,20 11,24 9,25 5,28 5,32 16,36 0.037,37 1,38 26,39 25.276,40 28.322,41 17.551,42 17.161,44 4.4}
{0 CHEMBL2002586,1 8.552,2 40.4,3 42.6,4 1.006,5 1.125,6 0.704,7 0.661,8 401.96,9 10.6,10 16,11 47,13 16,14 31,16 51,17 19,18 1,20 12,21 7,24 20,25 8,26 2,28 5,29 1,31 1,32 27,34 1,35 2.1,36 0.098,37 5,38 39,39 47.305,40 52.887,41 33.08,42 31.051,43 2.1,44 5.4}
{0 CHEMBL2002599,1 7.843,2 41.7,3 41.7,4 1.009,5 1.132,6 0.672,7 0.651,8 376.46,9 12.5,10 17,11 48,13 18,14 32,16 52,17 20,20 14,21 6,22 1,24 20,25 8,28 6,29 2,32 28,35 4.2,36 0.058,37 3,38 41.5,39 48.451,40 54.315,41 32.273,42 31.246,44 5.4}
{0 CHEMBL2002690,1 8.816,2 48.8,3 36.6,4 1.008,5 1.105,6 0.735,7 0.703,8 361.45,9 7.3,10 22,11 41,13 23,14 29,16 44,17 20,20 20,22 1,24 15,25 6,26 1,28 3,29 2,31 1,32 26,35 4.9,36 0.068,37 3,38 41,39 41.338,40 45.325,41 30.142,42 28.842,44 5.4}
{0 CHEMBL2002723,1 8.385,2 40.6,3 37.5,4 1.018,5 1.139,6 0.68,7 0.669,8 268.31,9 18.8,10 16,11 32,13 17,14 22,16 34,17 13,20 12,21 1,22 1,24 12,25 7,28 6,29 1,32 20,35 3.1,36 0.059,37 2,38 31,39 32.589,40 36.445,41 21.773,42 21.424,44 6.1}
{0 CHEMBL2002736,1 6.921,2 35.3,3 50,4 1.004,5 1.142,6 0.625,7 0.594,8 235.32,9 8.8,10 10,11 34,13 10,14 18,16 35,17 12,20 7,21 5,24 17,25 5,28 3,29 2,32 17,35 5.9,36 0.143,37 5,38 23,39 34.145,40 38.82,41 21.256,42 20.181,44 5.4}
{0 CHEMBL2002992,1 6.661,2 37.2,3 51.2,4 0.993,5 1.138,6 0.636,7 0.594,8 286.42,9 9.3,10 10,11 43,13 11,14 23,16 45,17 16,20 8,21 8,22 1,24 22,25 5,28 4,29 1,32 21,35 2.3,36 0.067,37 3,38 29,39 42.687,40 48.939,41 27.33,42 25.542,44 6.2}
{0 CHEMBL2003514,1 7.777,2 44.2,3 41.9,4 1.006,5 1.124,6 0.681,7 0.656,8 334.41,9 9.3,10 18,11 43,13 19,14 27,16 45,17 19,20 16,21 3,22 1,24 18,25 6,28 4,29 2,32 25,35 4.7,36 0.111,37 5,38 37,39 43.247,40 48.318,41 29.262,42 28.203,44 5.4}
{0 CHEMBL2003689,1 7.708,2 44.4,3 42.9,4 1.009,5 1.119,6 0.673,7 0.65,8 485.58,9 4.8,10 22,11 63,13 25,14 39,16 66,17 28,20 22,21 6,22 3,24 27,25 8,28 3,29 5,32 36,35 7.9,36 0.136,37 9,38 53,39 63.545,40 70.524,41 42.426,42 40.96,44 5.4}
{0 CHEMBL2003785,1 8.688,2 42.9,3 35.7,4 1.024,5 1.146,6 0.688,7 0.681,8 243.27,9 17.9,10 16,11 28,13 16,14 20,16 30,17 12,20 11,21 1,23 1,24 10,25 6,28 5,32 18,34 1,36 0.1,37 3,38 28,39 28.673,40 32.077,41 19.25,42 19.071,43 3.6,44 4.5}
{0 CHEMBL2004025,1 8.183,2 36.5,3 44.2,4 1.029,5 1.128,6 0.647,7 0.629,8 425.5,9 1.9,10 12,11 52,13 15,14 30,16 53,17 19,20 13,21 6,22 3,24 23,25 10,26 1,28 1,29 8,31 1,32 29,35 15.4,36 0.208,37 11,38 39,39 53.516,40 58.661,41 33.665,42 32.722,44 5.8}
{0 CHEMBL2004033,1 13.315,2 43.8,3 31.3,4 1.033,5 1.117,6 0.771,7 0.74,8 213.04,9 12.5,10 10,11 16,13 10,14 12,15 1,16 17,17 7,20 7,24 5,25 4,26 1,28 2,29 1,32 11,34 1,35 6.3,38 17,39 16.527,40 17.878,41 12.341,42 11.836,43 6.3,44 5.4}
{0 CHEMBL2004118,1 7.953,2 40,3 44.4,4 1.005,5 1.133,6 0.676,7 0.641,8 357.88,9 11.1,10 16,11 45,13 16,14 28,16 48,17 18,18 1,20 12,21 6,24 20,25 7,26 1,28 5,29 1,32 25,34 1,35 2.2,36 0.083,37 4,38 36,39 45.229,40 50.967,41 30.432,42 28.864,43 2.2,44 5.4}
{0 CHEMBL2004159,1 8.009,2 45,3 40,4 1.009,5 1.123,6 0.688,7 0.667,8 320.38,9 10,10 18,11 40,13 19,14 26,16 42,17 18,20 16,21 2,22 1,24 16,25 6,28 4,29 2,32 24,35 5,36 0.119,37 5,38 36,39 40.363,40 44.903,41 27.5,42 26.676,44 5.4}
{0 CHEMBL2004290,1 8.01,2 42.4,3 42.4,4 1.006,5 1.123,6 0.688,7 0.655,8 528.69,9 9.1,10 27,11 66,13 28,14 42,16 70,17 28,20 23,21 5,22 1,24 28,25 10,26 1,28 6,29 3,31 1,32 38,35 4.5,36 0.1,37 7,38 56.5,39 66.389,40 74.105,41 45.421,42 43.255,44 5.4}
{0 CHEMBL2004438,1 9.009,2 46.8,3 34,4 1.033,5 1.141,6 0.694,7 0.695,8 423.43,9 10.6,10 23,11 47,13 24,14 34,16 50,17 22,20 21,21 1,22 1,23 3,24 16,25 9,28 5,29 1,32 31,34 3,35 2.1,36 0.06,37 3,38 46.5,39 48.56,40 53.626,41 32.625,42 32.659,43 6.4,44 5.4}
{0 CHEMBL2004515,1 8.861,2 48.1,3 33.3,4 1.023,5 1.117,6 0.711,7 0.706,8 239.25,9 11.1,10 16,11 27,13 16,14 21,16 30,17 13,20 12,21 1,24 9,25 5,28 3,29 2,32 18,35 7.4,36 0.033,37 1,38 29,39 27.611,40 30.159,41 19.21,42 19.074,44 5.5}
{0 CHEMBL2004637,1 7.024,2 40.8,3 47.9,4 0.995,5 1.13,6 0.656,7 0.619,8 498.69,9 8.5,10 22,11 71,13 24,14 40,16 74,17 29,20 21,21 8,22 2,24 34,25 8,28 6,29 2,32 37,35 2.8,36 0.108,37 8,38 53,39 70.636,40 80.221,41 46.603,42 43.933,44 5.8}
{0 CHEMBL2005449,1 8.508,2 40.5,3 40.5,4 1.01,5 1.135,6 0.695,7 0.665,8 314.81,9 16.2,10 17,11 37,13 17,14 24,16 39,17 15,18 1,20 13,21 2,24 15,25 7,26 1,28 6,32 22,34 1,36 0.128,37 5,38 32.5,39 37.353,40 42.01,41 25.699,42 24.59,43 2.7,44 5.4}
{0 CHEMBL2005478,1 10.207,2 45.7,3 37.1,4 1.011,5 1.118,6 0.732,7 0.699,8 357.23,9 11.4,10 20,11 35,13 20,14 25,15 1,16 38,17 16,20 14,21 2,24 13,25 6,26 1,28 4,29 1,32 22,34 1,35 2.9,36 0.053,37 2,38 35,39 35.382,40 39.12,41 25.637,42 24.46,43 2.9,44 5.4}
{0 CHEMBL2005699,1 7.859,2 45,3 41.7,4 1.011,5 1.118,6 0.678,7 0.657,8 471.55,9 5,10 22,11 60,13 25,14 38,16 63,17 27,20 22,21 5,22 3,24 25,25 8,28 3,29 5,32 35,35 8.3,36 0.127,37 8,38 52,39 60.662,40 67.109,41 40.665,42 39.433,44 5.4}
{0 CHEMBL2005792,1 7.824,2 40.7,3 42.6,4 1.014,5 1.139,6 0.662,7 0.642,8 422.51,9 11.1,10 22,11 54,13 22,14 34,16 57,17 22,20 16,21 6,23 1,24 23,25 9,28 6,29 2,32 31,34 1,35 3.7,36 0.123,37 7,38 45,39 54.731,40 61.485,41 35.733,42 34.682,43 1.9,44 5.4}
{0 CHEMBL2006299,1 7.581,2 47.6,3 42.9,4 0.998,5 1.113,6 0.691,7 0.659,8 318.4,9 4.8,10 18,11 42,13 19,14 26,16 44,17 20,20 18,21 2,22 1,24 18,25 4,28 2,29 2,32 24,35 4.8,36 0.114,37 5,38 36,39 41.927,40 46.737,41 29.012,42 27.687,44 5.4}
{0 CHEMBL2006439,1 7.996,2 41.5,3 43.9,4 1,5 1.13,6 0.688,7 0.649,8 327.85,9 12.2,10 16,11 41,13 16,14 26,16 44,17 17,18 1,20 11,21 6,24 18,25 6,26 1,28 5,32 23,34 1,36 0.068,37 3,38 34,39 41.018,40 46.342,41 28.216,42 26.622,43 2.4,44 5.4}
{0 CHEMBL2006450,1 8.221,2 42.5,3 42.5,4 1.006,5 1.126,6 0.692,7 0.658,8 328.83,9 10,10 16,11 40,13 17,14 25,16 42,17 17,18 1,20 13,21 4,22 1,24 17,25 6,26 1,28 4,29 1,32 23,34 1,35 2.5,36 0.119,37 5,38 34,39 40.243,40 45.053,41 27.665,42 26.316,43 2.5,44 5.4}
{0 CHEMBL2006564,1 7.478,2 38.3,3 44.7,4 1.005,5 1.141,6 0.656,7 0.629,8 351.46,9 14.9,10 16,11 47,13 17,14 29,16 50,17 18,20 12,21 6,22 1,24 21,25 8,28 7,29 1,32 26,35 2.1,36 0.12,37 6,38 38,39 47.225,40 53.604,41 30.824,42 29.552,44 5.7}
{0 CHEMBL2006674,1 6.957,2 36.8,3 49.1,4 1,5 1.14,6 0.637,7 0.603,8 396.55,9 10.5,10 16,11 57,13 17,14 32,16 60,17 21,20 11,21 10,22 1,24 28,25 8,28 6,29 2,32 29,35 3.5,36 0.117,37 7,38 41,39 56.985,40 64.976,41 36.319,42 34.353,44 5.4}
{0 CHEMBL2006765,1 8.35,2 38.3,3 40.4,4 1.033,5 1.16,6 0.647,7 0.643,8 392.43,9 12.8,10 16,11 47,13 17,14 30,16 49,17 18,20 13,21 5,22 1,23 3,24 19,25 10,28 6,29 1,32 28,34 3,35 2.1,36 0.143,37 7,38 39,39 48.545,40 54.54,41 30.392,42 30.208,43 6.4,44 5.7}
{0 CHEMBL2007073,1 7.248,2 41.8,3 46.3,4 1,5 1.127,6 0.661,7 0.628,8 485.64,9 7.5,10 22,11 67,13 24,14 39,16 70,17 28,20 21,21 7,22 2,24 31,25 8,28 5,29 3,32 36,35 4.5,36 0.114,37 8,38 52,39 66.978,40 75.517,41 44.29,42 42.1,44 5.4}
{0 CHEMBL2007124,1 9.359,2 45,3 32.5,4 1.048,5 1.148,6 0.683,7 0.696,8 374.35,9 10,10 12,11 40,13 16,14 29,16 42,17 18,20 17,21 1,22 4,23 3,24 13,25 9,28 4,29 2,32 27,34 3,35 5,36 0.071,37 3,38 39,39 41.902,40 45.922,41 27.313,42 27.826,43 7.5,44 5.4}
{0 CHEMBL2007266,1 7.791,2 43.8,3 42.2,4 1.008,5 1.13,6 0.676,7 0.652,8 498.61,9 9.4,10 27,11 64,13 28,14 41,16 68,17 28,20 24,21 4,22 1,23 1,24 27,25 9,28 6,29 2,32 37,34 1,35 3.1,36 0.118,37 8,38 55.5,39 64.498,40 72.316,41 43.256,42 41.736,43 1.6,44 5.4}
{0 CHEMBL2007375,1 9.259,2 47.5,3 32.5,4 1.039,5 1.143,6 0.696,7 0.703,8 370.36,9 10,10 17,11 40,13 19,14 29,16 42,17 19,19 2,20 15,21 2,22 1,23 3,24 13,25 8,28 4,29 1,32 27,33 1,34 3,35 2.5,36 0.048,37 2,38 40.5,39 41.574,40 45.713,41 27.858,42 28.111,43 7.5,44 5.4}
{0 CHEMBL2007421,1 8.519,2 37,3 41.3,4 1.023,5 1.15,6 0.666,7 0.647,8 391.88,9 15.2,10 17,11 46,13 17,14 29,16 48,17 17,18 1,20 12,21 5,23 1,24 19,25 10,26 1,28 7,29 1,32 27,34 2,35 2.2,36 0.146,37 7,38 37.5,39 47.062,40 52.888,41 30.62,42 29.763,43 4.3,44 5.4}
{0 CHEMBL2007479,1 7.65,2 38.9,3 47.2,4 0.997,5 1.126,6 0.679,7 0.629,8 275.41,9 8.3,10 11,11 36,13 12,14 20,16 37,17 14,20 10,21 4,22 1,24 17,25 5,26 1,28 3,29 1,31 1,32 19,35 2.8,36 0.162,37 6,38 26.5,39 35.894,40 40.531,41 24.449,42 22.654,44 5.4}
{0 CHEMBL2007559,1 8.902,2 39.1,3 39.1,4 1.033,5 1.151,6 0.675,7 0.66,8 409.48,9 10.9,10 16,11 46,13 17,14 30,16 48,17 18,20 13,21 5,22 1,23 3,24 18,25 10,26 1,28 5,29 1,31 1,32 28,34 3,35 2.2,36 0.146,37 7,38 39,39 47.52,40 52.962,41 31.034,42 30.373,43 6.5,44 5.4}
{0 CHEMBL2007574,1 9.828,2 44,3 32,4 1.024,5 1.131,6 0.736,7 0.72,8 245.69,9 20,10 16,11 25,13 16,14 19,16 27,17 11,18 1,20 11,24 8,25 6,26 1,28 5,32 17,34 1,36 0.037,37 1,38 27,39 25.6,40 28.266,41 18.409,42 17.988,43 4,44 6.7}
{0 CHEMBL2007603,1 10.009,2 45.7,3 28.6,4 1.063,5 1.161,6 0.687,7 0.713,8 350.3,9 11.4,10 17,11 35,13 18,14 27,16 37,17 16,20 15,21 1,22 1,23 4,24 10,25 9,28 4,29 1,32 25,34 4,35 2.9,36 0.054,37 2,38 36.5,39 37.203,40 40.637,41 24.034,42 24.968,43 11.4,44 5.4}
{0 CHEMBL202721,1 7.444,2 42,3 44.9,4 1.004,5 1.126,6 0.663,7 0.635,8 513.65,9 7.2,10 23,11 69,13 24,14 42,16 73,17 29,20 21,21 8,22 1,24 31,25 9,28 5,29 4,32 38,35 5.8,36 0.137,37 10,38 54.5,39 69.305,40 77.727,41 45.745,42 43.815,44 5.4}
{0 CHEMBL21156,1 7.933,2 46.2,3 41,4 1.008,5 1.127,6 0.686,7 0.663,8 309.37,9 7.7,10 15,11 39,13 17,14 26,16 42,17 18,20 14,21 4,22 2,23 1,24 16,25 5,28 3,29 1,32 23,34 1,35 2.6,36 0.024,37 1,38 35.5,39 39.331,40 43.95,41 26.739,42 25.85,43 2.6,44 6.4}
{0 CHEMBL215152,1 7.577,2 38.8,3 44.8,4 1.012,5 1.141,6 0.649,7 0.627,8 507.63,9 10.4,10 22,11 67,13 23,14 40,16 70,17 26,20 18,21 8,22 1,23 1,24 30,25 11,28 7,29 3,32 37,34 1,35 4.5,36 0.186,37 13,38 52,39 67.81,40 76.438,41 43.478,42 41.999,43 1.5,44 5.4}
{0 CHEMBL223360,1 8.162,2 45.7,3 39.1,4 1.012,5 1.129,6 0.69,7 0.672,8 375.44,9 10.9,10 22,11 46,13 23,14 31,16 49,17 21,20 20,21 1,22 1,23 1,24 18,25 7,28 5,29 1,32 28,34 1,35 2.2,36 0.061,37 3,38 43,39 46.534,40 51.947,41 31.75,42 30.893,43 2.2,44 5.4}
{0 CHEMBL225519,1 7.899,2 44.4,3 40.7,4 1.006,5 1.125,6 0.686,7 0.662,8 213.26,9 11.1,10 11,11 27,13 12,14 18,16 29,17 12,20 10,21 2,22 1,24 11,25 4,28 3,29 1,32 16,35 3.7,36 0.034,37 1,38 24.5,39 27.167,40 30.365,41 18.517,42 17.886,44 5.5}
{0 CHEMBL2333365,1 8.436,2 42.6,3 40.7,4 1.019,5 1.125,6 0.686,7 0.662,8 455.55,9 5.6,10 18,11 54,13 21,14 35,16 57,17 23,20 18,21 5,22 3,23 1,24 22,25 9,26 1,28 3,29 4,31 1,32 32,34 1,35 7.4,36 0.053,37 3,38 47,39 55.04,40 60.744,41 37.034,42 35.762,43 1.9,44 5}
{0 CHEMBL234085,1 7.266,2 37.2,3 46.5,4 1.003,5 1.142,6 0.647,7 0.617,8 312.42,9 14,10 10,11 43,13 12,14 25,16 45,17 16,19 1,20 7,21 8,22 1,24 20,25 7,28 6,29 1,32 23,33 1,35 2.3,36 0.067,37 3,38 33,39 43.123,40 49.106,41 27.819,42 26.531,44 5.4}
{0 CHEMBL235157,1 7.777,2 44.2,3 41.9,4 1.006,5 1.124,6 0.681,7 0.656,8 334.41,9 9.3,10 21,11 43,13 21,14 28,16 46,17 19,20 16,21 3,24 18,25 6,28 4,29 2,32 25,35 4.7,36 0.043,37 2,38 38.5,39 43.247,40 48.318,41 29.262,42 28.203,44 5.4}
{0 CHEMBL242865,1 9.009,2 43.6,3 33.3,4 1.035,5 1.128,6 0.69,7 0.694,8 351.35,9 12.8,10 18,11 39,13 21,14 28,16 41,17 17,20 17,22 3,24 13,25 9,28 5,29 4,32 26,35 10.3,36 0.146,37 6,38 40,39 40.353,40 43.99,41 26.892,42 27.073,44 5.4}
{0 CHEMBL24828,1 8.804,2 40.7,3 44.4,4 1.01,5 1.133,6 0.678,7 0.643,8 475.4,9 7.4,10 17,11 54,13 17,14 33,15 1,16 57,17 22,20 14,21 8,23 1,24 24,25 8,26 1,28 4,29 2,32 30,34 2,35 3.7,36 0.105,37 6,38 41.5,39 54.523,40 61.161,41 36.597,42 34.718,43 3.7,44 5.4}
{0 CHEMBL253969,1 9.508,2 35.7,3 42.9,4 1.028,5 1.145,6 0.672,7 0.643,8 532.46,9 8.9,10 11,11 56,13 13,14 34,15 1,16 58,17 20,20 11,21 9,22 2,23 2,24 24,25 12,26 2,28 5,29 3,31 1,32 32,34 3,35 5.4,36 0.172,37 10,38 41.5,39 57.541,40 64.128,41 37.642,42 36.025,43 5.4,44 5.4}
{0 CHEMBL259084,1 9.732,2 51,3 30.6,4 1.033,5 1.121,6 0.735,7 0.731,8 476.89,9 8.2,10 24,11 49,13 26,14 38,16 53,17 25,18 1,20 24,21 1,22 2,23 2,24 15,25 9,26 1,28 4,29 2,32 34,34 3,35 4.1,36 0.075,37 4,38 52,39 50.596,40 54.942,41 35.995,42 35.797,43 6.1,44 6}
{0 CHEMBL261849,1 7.479,2 40.8,3 44.9,4 1.007,5 1.13,6 0.658,7 0.632,8 366.46,9 8.2,10 18,11 49,13 18,14 29,16 51,17 20,20 16,21 4,24 22,25 7,28 4,29 3,32 27,35 6.1,36 0.137,37 7,38 38,39 49.342,40 55.358,41 32.239,42 30.971,44 5.4}
{0 CHEMBL262623,1 7.72,2 41.9,3 41.9,4 1.001,5 1.134,6 0.68,7 0.652,8 239.31,9 16.1,10 12,11 31,13 13,14 20,16 33,17 13,20 11,21 2,22 1,24 13,25 5,28 5,32 18,36 0.03,37 1,38 27,39 31.043,40 35.152,41 21.074,42 20.214,44 4.6}
{0 CHEMBL278041,1 8.497,2 51.3,3 35.9,4 1.011,5 1.116,6 0.717,7 0.701,8 331.37,9 7.7,10 23,11 39,13 23,14 28,16 42,17 20,20 20,23 1,24 14,25 5,28 3,29 1,32 25,34 1,35 2.6,36 0.071,37 3,38 39.5,39 39.447,40 43.535,41 27.978,42 27.323,43 2.6,44 5.4}
{0 CHEMBL296468,1 7.767,2 34.7,3 49,4 1.001,5 1.131,6 0.67,7 0.615,8 380.59,9 8.2,10 10,11 49,13 11,14 27,16 51,17 17,20 7,21 10,22 1,24 24,25 8,26 2,28 4,29 2,31 2,32 25,35 4.1,36 0.118,37 6,38 33,39 49.051,40 55.404,41 32.841,42 30.157,44 5.4}
{0 CHEMBL360847,1 7.438,2 44.4,3 44.4,4 1,5 1.121,6 0.675,7 0.644,8 468.6,9 6.3,10 20,11 63,13 23,14 40,16 68,17 28,20 20,21 8,22 3,24 28,25 7,28 4,29 3,32 35,35 4.8,36 0.029,37 2,38 53,39 62.992,40 70.604,41 42.523,42 40.552,44 5.5}
{0 CHEMBL377408,1 8.731,2 37.2,3 39.5,4 1.028,5 1.133,6 0.676,7 0.658,8 375.45,9 11.6,10 12,11 43,13 16,14 27,16 44,17 16,19 1,20 12,21 3,22 3,24 17,25 10,26 1,28 5,29 4,31 1,32 26,33 1,35 9.3,36 0.136,37 6,38 38,39 44.196,40 48.74,41 29.063,42 28.314,44 5.4}
{0 CHEMBL379975,1 9.805,2 54.1,3 29.7,4 1.025,5 1.099,6 0.758,7 0.747,8 362.78,9 5.4,10 21,11 37,13 23,14 30,16 41,17 20,18 1,20 20,22 2,24 11,25 6,26 1,28 2,29 3,32 26,34 1,35 8.1,36 0.024,37 1,38 42.5,39 37.927,40 40.645,41 28.04,42 27.649,43 2.7,44 5.4}
{0 CHEMBL38380,1 7.876,2 37.8,3 45.9,4 1.006,5 1.128,6 0.673,7 0.632,8 291.41,9 8.1,10 11,11 37,13 13,14 22,16 39,17 14,20 9,21 5,22 2,24 17,25 6,26 1,28 3,29 2,31 1,32 20,35 5.4,36 0.051,37 2,38 29.5,39 37.222,40 41.74,41 24.904,42 23.369,44 5.4}
{0 CHEMBL398951,1 7.42,2 42.9,3 44.6,4 1,5 1.126,6 0.671,7 0.639,8 415.54,9 8.9,10 17,11 56,13 18,14 35,16 60,17 24,19 1,20 14,21 9,24 25,25 7,28 5,29 2,32 31,33 1,35 3.6,36 0.117,37 7,38 45.5,39 56,40 63.062,41 37.551,42 35.805,44 5.4}
{0 CHEMBL406845,1 8.157,2 40.5,3 43.2,4 1.004,5 1.133,6 0.688,7 0.651,8 301.81,9 13.5,10 16,11 37,13 16,14 23,16 39,17 15,18 1,20 11,21 4,24 16,25 6,26 1,28 5,32 21,34 1,36 0.051,37 2,38 31,39 37.134,40 41.927,41 25.455,42 24.095,43 2.7,44 5.4}
{0 CHEMBL415049,1 8.161,2 36.1,3 43.1,4 1.023,5 1.142,6 0.657,7 0.633,8 587.61,9 9.7,10 22,11 72,13 24,14 44,16 75,17 26,20 18,21 8,22 2,23 1,24 31,25 15,26 1,28 7,29 6,30 1,32 41,34 1,35 8.3,36 0.2,37 15,38 57,39 73.651,40 82.206,41 47.284,42 45.594,43 1.4,44 5.4}
{0 CHEMBL422897,1 8.372,2 43.8,3 41.7,4 1.019,5 1.118,6 0.682,7 0.66,8 401.87,9 2.1,10 12,11 48,13 14,14 31,16 51,17 21,18 1,20 15,21 6,22 2,24 20,25 7,26 1,28 1,29 5,32 28,34 1,35 10.4,36 0.039,37 2,38 39,39 48.898,40 53.641,41 32.75,42 31.691,43 2.1,44 5.6}
{0 CHEMBL424872,1 8.51,2 38.6,3 40.9,4 1.022,5 1.129,6 0.678,7 0.655,8 374.46,9 9.1,10 12,11 44,13 16,14 27,16 45,17 17,19 1,20 12,21 4,22 3,24 18,25 9,26 1,28 4,29 4,31 1,32 26,33 1,35 9.1,36 0.133,37 6,38 38,39 44.978,40 49.657,41 29.818,42 28.82,44 5.4}
{0 CHEMBL440084,1 8.543,2 48.9,3 35.6,4 1.015,5 1.114,6 0.71,7 0.698,8 384.42,9 8.9,10 23,11 45,13 24,14 33,16 49,17 22,20 21,21 1,22 1,24 16,25 7,28 4,29 3,32 29,35 6.7,36 0.082,37 4,38 45.5,39 45.691,40 50.113,41 31.955,42 31.391,44 5.4}
{0 CHEMBL458997,1 8.086,2 39.7,3 43.1,4 1.013,5 1.133,6 0.67,7 0.644,8 468.99,9 10.3,10 18,11 58,13 19,14 36,16 61,17 23,18 1,20 17,21 6,22 1,24 25,25 10,26 1,28 6,29 3,32 33,34 1,35 5.2,36 0.115,37 7,38 46,39 58.752,40 65.714,41 38.87,42 37.368,43 1.7,44 5.4}
{0 CHEMBL461876,1 7.979,2 40,3 41.5,4 1.018,5 1.14,6 0.661,7 0.646,8 518.61,9 12.3,10 22,11 65,13 24,14 42,16 69,17 26,20 20,21 6,22 2,23 1,24 27,25 12,28 8,29 3,32 38,34 1,35 4.6,36 0.116,37 8,38 55,39 66.145,40 74.106,41 42.961,42 41.967,43 1.5,44 6.3}
{0 CHEMBL475251,1 8.255,2 38.6,3 40.4,4 1.03,5 1.142,6 0.651,7 0.646,8 470.51,9 10.5,10 18,11 57,13 19,14 37,16 60,17 22,20 16,21 6,22 1,23 1,24 23,25 12,28 6,29 5,32 34,34 1,35 8.8,36 0.117,37 7,38 47,39 58.712,40 65.113,41 37.097,42 36.827,43 1.8,44 5.4}
{0 CHEMBL477772,1 8.103,2 38.9,3 42.6,4 1.009,5 1.132,6 0.679,7 0.648,8 437.58,9 13,10 22,11 54,13 24,14 34,16 57,17 21,20 17,21 4,22 2,24 23,25 10,26 1,28 7,29 2,31 1,32 31,35 3.7,36 0.088,37 5,38 47,39 54.512,40 61.149,41 36.688,42 34.981,44 5.4}
{0 CHEMBL482538,1 7.77,2 52,3 40,4 0.99,5 1.106,6 0.722,7 0.686,8 194.25,9 8,10 16,11 25,13 16,14 17,16 27,17 13,20 13,24 10,25 2,28 2,32 15,36 0.037,37 1,38 25,39 24.738,40 27.657,41 18.057,42 17.15,44 5.2}
{0 CHEMBL482767,1 10.023,2 41.9,3 34.9,4 1.019,5 1.118,6 0.755,7 0.713,8 430.98,9 14,10 21,11 43,13 22,14 31,16 46,17 18,18 1,20 16,21 2,22 1,24 15,25 10,26 3,28 6,29 1,31 2,32 28,34 1,35 2.3,36 0.13,37 6,38 42.5,39 43.833,40 48.059,41 32.449,42 30.679,43 2.3,44 5.4}
{0 CHEMBL483158,1 9.105,2 47.4,3 35.1,4 1.026,5 1.12,6 0.71,7 0.7,8 518.96,9 7,10 24,11 57,13 26,14 41,16 61,17 27,18 1,20 24,21 3,22 2,23 1,24 20,25 10,26 1,28 4,29 4,32 37,34 2,35 7,36 0.098,37 6,38 55,39 58.505,40 63.851,41 40.489,42 39.897,43 3.5,44 5.4}
{0 CHEMBL49120,1 8.266,2 41.9,3 43.5,4 1.007,5 1.125,6 0.69,7 0.653,8 512.48,9 8.1,10 18,11 62,13 20,14 38,16 65,17 26,18 2,20 19,21 7,22 2,24 27,25 9,26 2,28 5,29 2,32 35,34 2,35 3.2,36 0.138,37 9,38 49,39 62.414,40 69.781,41 42.79,42 40.513,43 3.2,44 5.4}
{0 CHEMBL491473,1 7.509,2 41.7,3 45,4 1.008,5 1.132,6 0.658,7 0.632,8 450.56,9 6.7,10 21,11 60,13 21,14 37,16 64,17 25,20 16,21 9,23 1,24 27,25 8,28 4,29 3,32 33,34 1,35 5,36 0.125,37 8,38 47.5,39 60.505,40 67.944,41 39.461,42 37.935,43 1.7,44 5.4}
{0 CHEMBL50894,1 8.888,2 48.5,3 33.3,4 1.025,5 1.115,6 0.71,7 0.707,8 293.3,9 9.1,10 16,11 33,13 19,14 25,16 36,17 16,20 15,21 1,22 3,24 11,25 6,28 3,29 3,32 22,35 9.1,36 0.028,37 1,38 36,39 33.822,40 36.784,41 23.426,42 23.316,44 5.4}
{0 CHEMBL509032,1 7.491,2 36.6,3 48.8,4 1.001,5 1.135,6 0.657,7 0.613,8 614.29,9 8.5,10 18,11 82,13 20,14 46,16 86,17 30,18 1,20 16,21 14,22 2,24 40,25 12,26 2,28 7,29 3,31 1,32 42,34 1,35 3.7,36 0.105,37 9,38 57,39 82.116,40 93.039,41 53.853,42 50.264,43 1.2,44 6.5}
{0 CHEMBL522892,1 7.85,2 42,3 42,4 1.01,5 1.137,6 0.67,7 0.649,8 392.48,9 12,10 16,11 50,13 18,14 33,16 54,17 21,20 16,21 5,22 2,23 1,24 21,25 8,28 6,29 1,32 29,34 1,35 2,36 0.037,37 2,38 43,39 50.52,40 56.861,41 33.517,42 32.441,43 2,44 5.4}
{0 CHEMBL546797,1 8.666,2 46.9,3 34.4,4 1.015,5 1.123,6 0.711,7 0.7,8 277.31,9 15.6,10 20,11 32,13 21,14 24,16 35,17 15,20 15,22 1,24 11,25 6,28 5,29 1,32 21,35 3.1,36 0.057,37 2,38 35,39 32.487,40 35.947,41 22.767,42 22.402,44 5.4}
{0 CHEMBL550418,1 8.295,2 47.6,3 38.1,4 1.017,5 1.113,6 0.694,7 0.681,8 348.38,9 4.8,10 18,11 42,13 19,14 29,16 45,17 20,20 19,21 1,22 1,24 16,25 6,28 2,29 4,32 26,35 9.5,36 0.044,37 2,38 39,39 42.698,40 46.741,41 29.159,42 28.59,44 5.4}
{0 CHEMBL553,1 7.567,2 42.3,3 44.2,4 1.009,5 1.125,6 0.662,7 0.638,8 393.48,9 5.8,10 17,11 52,13 18,14 31,16 54,17 22,19 2,20 14,21 6,24 23,25 7,28 3,29 4,32 29,33 1,35 7.7,36 0.185,37 10,38 41.5,39 52.451,40 58.485,41 34.449,42 33.191,44 5.4}
{0 CHEMBL554,1 8.805,2 43.9,3 39.4,4 1.019,5 1.121,6 0.703,7 0.677,8 581.11,9 6.1,10 28,11 66,13 30,14 44,16 70,17 29,18 1,20 24,21 5,22 2,23 1,24 26,25 11,26 2,28 4,29 4,31 1,32 40,34 2,35 6.1,36 0.157,37 11,38 60,39 67.232,40 74.017,41 46.421,42 44.664,43 3,44 5.4}
{0 CHEMBL565612,1 7.973,2 45.5,3 40,4 1.006,5 1.122,6 0.692,7 0.669,8 438.53,9 10.9,10 21,11 55,13 24,14 38,16 60,17 25,20 20,21 5,22 3,24 22,25 8,28 6,29 2,32 33,35 3.6,36 0.05,37 3,38 51.5,39 55.334,40 61.73,41 38.034,42 36.772,44 6.2}
{0 CHEMBL572878,1 7.617,2 37.7,3 45.9,4 1.001,5 1.136,6 0.668,7 0.629,8 464.66,9 13.1,10 17,11 61,13 18,14 37,16 65,17 23,20 14,21 9,22 1,24 28,25 10,26 1,28 8,29 1,31 1,32 33,35 1.6,36 0.108,37 7,38 46.5,39 61.054,40 69.268,41 40.762,42 38.341,44 5.4}
{0 CHEMBL574738,1 7.789,2 38.2,3 44.1,4 1.02,5 1.152,6 0.642,7 0.626,8 529.63,9 10.3,10 18,11 68,13 19,14 41,16 71,17 26,20 17,21 9,22 1,23 3,24 30,25 12,28 7,29 2,32 38,34 3,35 2.9,36 0.113,37 8,38 51,39 69.392,40 78.324,41 43.66,42 42.578,43 4.4,44 5.4}
{0 CHEMBL576113,1 6.302,2 39,3 53.7,4 0.985,5 1.131,6 0.636,7 0.586,8 258.4,9 4.9,10 11,11 41,13 11,14 20,16 42,17 16,20 10,21 6,24 22,25 3,28 2,29 1,32 19,35 2.4,36 0.143,37 6,38 25.5,39 40.367,40 46.358,41 26.08,42 24.026,44 5.4}
{0 CHEMBL592030,1 8.294,2 45.3,3 39.6,4 1,5 1.119,6 0.717,7 0.68,8 439.59,9 13.2,10 30,11 53,13 30,14 37,16 58,17 24,20 21,21 3,24 21,25 8,26 1,28 7,31 1,32 32,36 0.086,37 5,38 52,39 52.974,40 59.315,41 38.017,42 36.024,44 5.4}
{0 CHEMBL60254,1 8.342,2 42.4,3 39.4,4 1.032,5 1.122,6 0.662,7 0.659,8 550.56,9 3,10 18,11 66,13 22,14 43,16 69,17 28,20 22,21 6,22 4,24 26,25 12,28 2,29 10,32 40,35 15.2,36 0.116,37 8,38 56,39 68.08,40 74.073,41 43.693,42 43.512,44 6.796}
{0 CHEMBL939,1 8.126,2 40,3 43.6,4 1.017,5 1.136,6 0.665,7 0.641,8 446.95,9 7.3,10 17,11 55,13 17,14 34,16 58,17 22,18 1,20 14,21 8,23 1,24 24,25 9,26 1,28 4,29 3,32 31,34 2,35 5.5,36 0.138,37 8,38 42.5,39 55.945,40 62.472,41 36.557,42 35.236,43 3.6,44 5.4}
{0 CHEMBL941,1 7.26,2 42.6,3 45.6,4 0.995,5 1.128,6 0.671,7 0.635,8 493.67,9 10.3,10 24,11 68,13 25,14 41,16 72,17 29,20 22,21 7,22 1,24 31,25 8,28 7,29 1,32 37,35 1.5,36 0.097,37 7,38 54,39 67.643,40 76.68,41 45.631,42 43.186,44 5.4}
