{
  "data_set_description": {
    "collection_date": "November 2013",
    "creator": "Dr Jeremy Besnard, Dr Ivan Olier, Dr Noureddin Sadawi, Dr Larisa Soldatova, Dr Crina Grosan, Prof Ross King, Dr Richard Bickerton, Prof Andrew Hopkins and Dr Willem van Hoorn",
    "default_target_attribute": "pXC50",
    "description": "This dataset contains QSAR data (from ChEMBL version 17) showing activity values (unit is pseudo-pCI50) of several compounds on drug target ChEMBL_ID: CHEMBL4092 (TID: 20110), and it has 59 rows and 43 features (not including molecule IDs and class feature: molecule_id and pXC50). The features represent Basic Molecular Descriptors which were generated from SMILES strings.  Missing value imputation was applied to this dataset (By choosing the Median).",
    "description_version": "1",
    "file_id": "3452411",
    "format": "ARFF",
    "id": "31547",
    "licence": "Public",
    "md5_checksum": "1e03cd31bf627041f7e5224e0e107ccf",
    "minio_url": "https://data.openml.org/datasets/0003/31547/dataset_31547.pq",
    "name": "QSAR-DATASET-FOR-DRUG-TARGET-CHEMBL4092",
    "original_data_url": "https://www.ebi.ac.uk/chembl/target/inspect/CHEMBL4092",
    "parquet_url": "https://data.openml.org/datasets/0003/31547/dataset_31547.pq",
    "processing_date": "2018-10-04 02:26:44",
    "row_id_attribute": "molecule_id",
    "status": "deactivated",
    "tag": [
      "MetaQSAR",
      "study_13"
    ],
    "upload_date": "2016-07-15T07:51:41",
    "url": "https://api.openml.org/data/v1/download/3452411/QSAR-DATASET-FOR-DRUG-TARGET-CHEMBL4092.arff",
    "version": "10",
    "visibility": "public"
  }
}