{
  "data_features": {
    "feature": [
      {
        "data_type": "nominal",
        "index": "0",
        "is_ignore": "false",
        "is_row_identifier": "true",
        "is_target": "false",
        "name": "molecule_id",
        "nominal_value": [
          "CHEMBL139611",
          "CHEMBL139647",
          "CHEMBL139699",
          "CHEMBL139818",
          "CHEMBL139937",
          "CHEMBL139954",
          "CHEMBL140115",
          "CHEMBL140210",
          "CHEMBL140558",
          "CHEMBL141015",
          "CHEMBL141040",
          "CHEMBL141041",
          "CHEMBL141047",
          "CHEMBL141074",
          "CHEMBL141086",
          "CHEMBL141104",
          "CHEMBL141126",
          "CHEMBL141144",
          "CHEMBL141195",
          "CHEMBL141237",
          "CHEMBL141248",
          "CHEMBL141472",
          "CHEMBL141732",
          "CHEMBL141774",
          "CHEMBL142074",
          "CHEMBL142214",
          "CHEMBL142218",
          "CHEMBL142705",
          "CHEMBL142996",
          "CHEMBL142997",
          "CHEMBL143052",
          "CHEMBL143116",
          "CHEMBL143196",
          "CHEMBL143237",
          "CHEMBL143291",
          "CHEMBL143319",
          "CHEMBL143437",
          "CHEMBL143438",
          "CHEMBL143458",
          "CHEMBL143460",
          "CHEMBL143496",
          "CHEMBL143518",
          "CHEMBL143756",
          "CHEMBL143816",
          "CHEMBL154623",
          "CHEMBL157105",
          "CHEMBL193371",
          "CHEMBL2111978",
          "CHEMBL334922",
          "CHEMBL337130",
          "CHEMBL337546",
          "CHEMBL341721",
          "CHEMBL341877",
          "CHEMBL342124",
          "CHEMBL342525",
          "CHEMBL342581",
          "CHEMBL343081",
          "CHEMBL344405",
          "CHEMBL344556",
          "CHEMBL344613",
          "CHEMBL344913",
          "CHEMBL344996",
          "CHEMBL348270",
          "CHEMBL356115",
          "CHEMBL357459",
          "CHEMBL357498",
          "CHEMBL358411",
          "CHEMBL358621",
          "CHEMBL432994",
          "CHEMBL442489",
          "CHEMBL538406",
          "CHEMBL543919",
          "CHEMBL960",
          "CHEMBL973"
        ],
        "number_of_missing_values": "0"
      },
      {
        "data_type": "numeric",
        "index": "1",
        "is_ignore": "false",
        "is_row_identifier": "false",
        "is_target": "false",
        "name": "AMW",
        "number_of_missing_values": "0"
      },
      {
        "data_type": "numeric",
        "index": "2",
        "is_ignore": "false",
        "is_row_identifier": "false",
        "is_target": "false",
        "name": "C.",
        "number_of_missing_values": "0"
      },
      {
        "data_type": "numeric",
        "index": "3",
        "is_ignore": "false",
        "is_row_identifier": "false",
        "is_target": "true",
        "name": "pXC50",
        "number_of_missing_values": "0"
      }
    ]
  }
}