"molecule_id","AMW","C.","H.","Me","Mi","Mp","Mv","MW","N.","nAB","nAT","nB","nBM","nBO","nBR","nBT","nC","nCL","nCsp","nCsp2","nCsp3","nDB","nF","nH","nHet","nHM","nI","nN","nO","nP","nS","nSK","nTB","nX","O.","RBF","RBN","SCBO","Se","Si","Sp","Sv","X.","pXC50"
{1 8.182,2 48.3,3 37.9,4 1.006,5 1.116,6 0.707,7 0.686,8 237.28,9 10.3,10 17,11 29,13 17,14 20,16 31,17 14,20 14,24 11,25 4,28 3,29 1,32 18,35 3.4,36 0.032,37 1,38 28.5,39 29.167,40 32.365,41 20.517,42 19.886,44 5}
{0 CHEMBL1082833,1 8.908,2 40,3 37.5,4 1.053,5 1.154,6 0.643,7 0.657,8 356.33,9 5,10 6,11 40,13 11,14 26,16 41,17 16,20 11,21 5,22 5,23 3,24 15,25 9,28 2,29 4,32 25,34 3,35 10,36 0.073,37 3,38 34,39 42.12,40 46.175,41 25.733,42 26.266,43 7.5,44 5.208}
{0 CHEMBL108705,1 7.615,2 40.4,3 49.1,4 0.997,5 1.119,6 0.676,7 0.624,8 434.04,9 1.8,10 12,11 57,13 14,14 30,16 58,17 23,18 1,20 13,21 10,22 2,24 28,25 6,26 2,28 1,29 3,31 1,32 29,34 1,35 5.3,36 0.19,37 11,38 38,39 56.854,40 63.803,41 38.534,42 35.556,43 1.8,44 6.089}
{0 CHEMBL111086,1 7.14,2 40.7,3 50,4 0.993,5 1.119,6 0.665,7 0.615,8 385.57,9 1.9,10 12,11 54,13 14,14 28,16 55,17 22,20 13,21 9,22 2,24 27,25 5,26 1,28 1,29 3,31 1,32 27,35 5.6,36 0.182,37 10,38 36,39 53.647,40 60.444,41 35.915,42 33.201,44 6.738}
{0 CHEMBL111545,1 7.011,2 40.4,3 50.9,4 0.992,5 1.12,6 0.661,7 0.609,8 399.6,9 1.8,10 12,11 57,13 14,14 29,16 58,17 23,20 13,21 10,22 2,24 29,25 5,26 1,28 1,29 3,31 1,32 28,35 5.3,36 0.19,37 11,38 37,39 56.531,40 63.859,41 37.676,42 34.728,44 6.631}
{0 CHEMBL112034,1 7.756,2 34.9,3 44.6,4 1.027,5 1.142,6 0.627,7 0.617,8 643.73,9 8.4,10 11,11 83,13 18,14 48,16 85,17 29,20 16,21 13,22 7,24 37,25 17,28 7,29 10,32 46,35 12,36 0.212,37 18,38 60.5,39 85.24,40 94.81,41 52.006,42 51.2,44 4}
{0 CHEMBL112669,1 7.551,2 34.7,3 45.8,4 1.021,5 1.144,6 0.627,7 0.611,8 543.65,9 9.7,10 11,11 72,13 16,14 41,16 74,17 25,20 14,21 11,22 5,24 33,25 14,28 7,29 7,32 39,35 9.7,36 0.203,37 15,38 51.5,39 73.491,40 82.352,41 45.12,42 44.002,44 4.009}
{0 CHEMBL113986,1 7.27,2 34.8,3 47.8,4 1.015,5 1.143,6 0.624,7 0.602,8 334.42,9 8.7,10 5,11 46,13 9,14 25,16 47,17 16,20 8,21 8,22 4,24 22,25 8,28 4,29 4,32 24,35 8.7,36 0.17,37 8,38 31.5,39 46.669,40 52.568,41 28.693,42 27.686,44 4.133}
{0 CHEMBL114745,1 8.556,2 33.3,3 42.4,4 1.027,5 1.14,6 0.662,7 0.638,8 282.36,9 12.1,10 5,11 33,13 8,14 20,16 34,17 11,20 6,21 5,22 3,24 14,25 8,26 1,28 4,29 3,31 1,32 19,35 9.1,36 0.118,37 4,38 25.5,39 33.884,40 37.617,41 21.841,42 21.051,44 5.029}
{0 CHEMBL114760,1 7.781,2 36.8,3 43.9,4 1.023,5 1.139,6 0.638,7 0.626,8 443.51,9 8.8,10 11,11 57,13 15,14 34,16 59,17 21,20 13,21 8,22 4,24 25,25 11,28 5,29 6,32 32,35 10.5,36 0.169,37 10,38 43.5,39 58.309,40 64.9,41 36.37,42 35.664,44 4.233}
{0 CHEMBL114975,1 7.819,2 40,3 43,4 1.019,5 1.131,6 0.653,7 0.638,8 781.9,9 7,10 23,11 100,13 29,14 62,16 105,17 40,20 27,21 13,22 6,24 43,25 17,28 7,29 10,32 57,35 10,36 0.181,37 19,38 79.5,39 101.89,40 113.056,41 65.29,42 63.78,44 4.664}
{0 CHEMBL115261,1 8.069,2 33.3,3 42.4,4 1.034,5 1.149,6 0.626,7 0.624,8 266.29,9 12.1,10 5,11 33,13 8,14 20,16 34,17 11,20 6,21 5,22 3,24 14,25 8,28 4,29 4,32 19,35 12.1,36 0.118,37 4,38 25.5,39 34.134,40 37.907,41 20.648,42 20.579,44 4.03}
{0 CHEMBL118923,1 9.156,2 41.5,3 31.7,4 1.033,5 1.14,6 0.695,7 0.699,8 375.39,9 22,10 25,11 41,13 26,14 32,16 45,17 17,20 16,21 1,22 1,24 13,25 11,28 9,29 2,32 28,35 4.9,36 0.067,37 3,38 45.5,39 42.338,40 46.734,41 28.483,42 28.676,44 6}
{0 CHEMBL119709,1 10.632,2 37.5,3 39.6,4 1.024,5 1.134,6 0.705,7 0.667,8 510.33,9 12.5,10 16,11 48,13 17,14 32,16 51,17 18,20 12,21 6,22 1,24 19,25 11,26 1,27 1,28 6,29 4,32 29,34 1,35 8.3,36 0.098,37 5,38 41,39 49.174,40 54.454,41 33.841,42 31.992,43 2.1,44 7.523}
{0 CHEMBL1256714,1 7.729,2 36,3 44,4 1.02,5 1.143,6 0.639,7 0.624,8 386.46,9 12,10 16,11 50,13 16,14 31,16 53,17 18,20 11,21 7,24 22,25 10,28 6,29 4,32 28,35 8,36 0.113,37 6,38 39,39 50.989,40 57.149,41 31.943,42 31.202,44 6.936}
{0 CHEMBL1256785,1 7.813,2 37.3,3 43.1,4 1.019,5 1.14,6 0.646,7 0.631,8 398.47,9 11.8,10 16,11 51,13 17,14 32,16 54,17 19,20 12,21 7,22 1,24 22,25 10,28 6,29 4,32 29,35 7.8,36 0.093,37 5,38 41,39 51.989,40 58.149,41 32.943,42 32.202,44 8}
{0 CHEMBL128929,1 8.078,2 50,3 38.6,4 1.003,5 1.11,6 0.71,7 0.686,8 355.42,9 6.8,10 23,11 44,13 24,14 30,16 47,17 22,20 21,21 1,22 1,24 17,25 5,28 3,29 2,32 27,35 4.5,36 0.085,37 4,38 42.5,39 44.145,40 48.82,41 31.256,42 30.181,44 5.377}
{0 CHEMBL129903,1 8.084,2 30,3 42.5,4 1.036,5 1.16,6 0.617,7 0.616,8 323.36,9 17.5,10 10,11 40,13 11,14 25,16 42,17 12,20 6,21 6,22 1,24 17,25 11,28 7,29 4,32 23,35 10,36 0.095,37 4,38 31,39 41.44,40 46.402,41 24.665,42 24.643,44 4.833}
{0 CHEMBL130707,1 8.562,2 37.5,3 45,4 1.019,5 1.116,6 0.686,7 0.642,8 342.47,10 5,11 40,13 8,14 23,16 41,17 15,20 7,21 8,22 3,24 18,25 7,26 2,29 5,31 2,32 22,35 12.5,36 0.195,37 8,38 28.5,39 40.742,40 44.624,41 27.421,42 25.689,44 4.991}
{0 CHEMBL133566,1 10.507,2 36,3 40,4 1.026,5 1.139,6 0.697,7 0.66,8 525.35,9 14,10 16,11 50,13 17,14 33,16 53,17 18,20 12,21 6,22 1,24 20,25 12,26 1,27 1,28 7,29 4,32 30,34 1,35 8,36 0.094,37 5,38 42,39 51.276,40 56.953,41 34.847,42 33.013,43 2,44 8.896}
{0 CHEMBL133591,1 7.27,2 32.6,3 47.8,4 1.014,5 1.151,6 0.619,7 0.598,8 334.43,9 13,10 10,11 46,13 10,14 27,16 49,17 15,20 5,21 10,24 22,25 9,28 6,29 3,32 24,35 6.5,36 0.082,37 4,38 32,39 46.662,40 52.94,41 28.489,42 27.487,44 8}
{0 CHEMBL133809,1 8.07,2 30.3,3 42.4,4 1.034,5 1.16,6 0.619,7 0.618,8 266.3,9 18.2,10 10,11 33,13 10,14 21,16 35,17 10,20 5,21 5,24 14,25 9,28 6,29 3,32 19,35 9.1,36 0.057,37 2,38 26,39 34.127,40 38.279,41 20.443,42 20.38,44 8}
{0 CHEMBL136689,1 8.114,2 41.7,3 39.6,4 1.014,5 1.133,6 0.677,7 0.661,8 389.46,9 14.6,10 25,11 48,13 25,14 33,16 52,17 20,20 16,21 4,24 19,25 9,28 7,29 2,32 29,35 4.2,36 0.115,37 6,38 45.5,39 48.669,40 54.398,41 32.517,42 31.74,44 5}
{0 CHEMBL138746,1 7.178,2 32.2,3 49.2,4 1.018,5 1.148,6 0.608,7 0.588,8 423.53,9 8.5,10 5,11 59,13 8,14 32,16 61,17 19,20 6,21 13,22 3,24 29,25 11,28 5,29 6,32 30,35 10.2,36 0.131,37 8,38 37.5,39 60.076,40 67.73,41 35.892,42 34.717,44 6.64}
{0 CHEMBL139000,1 7.558,2 37.3,3 45.1,4 1.015,5 1.139,6 0.641,7 0.622,8 385.47,9 9.8,10 16,11 51,13 16,14 31,16 54,17 19,20 11,21 8,24 23,25 9,28 5,29 4,32 28,35 7.8,36 0.111,37 6,38 39,39 51.771,40 58.066,41 32.699,42 31.707,44 7.276}
{0 CHEMBL1484,1 7.493,2 40.6,3 45.3,4 1.012,5 1.127,6 0.651,7 0.628,8 479.58,9 4.7,10 12,11 64,13 18,14 37,16 66,17 26,20 18,21 8,22 6,24 29,25 9,28 3,29 6,32 35,35 9.4,36 0.152,37 10,38 49,39 64.756,40 72.149,41 41.642,42 40.201,44 4.959}
{0 CHEMBL1568,1 8.915,2 31.3,3 37.5,4 1.058,5 1.167,6 0.62,7 0.639,8 285.27,9 15.6,10 10,11 32,13 10,14 22,16 34,17 10,20 5,21 5,23 1,24 12,25 10,28 5,29 4,32 20,34 1,35 12.5,36 0.059,37 2,38 27,39 33.865,40 37.33,41 19.83,42 20.457,43 3.1,44 4.983}
{0 CHEMBL162630,1 7.194,2 40,3 50,4 0.999,5 1.127,6 0.656,7 0.611,8 431.62,9 1.7,10 12,11 60,13 14,14 31,16 61,17 24,20 13,21 11,22 2,23 1,24 30,25 6,26 1,28 1,29 3,31 1,32 30,34 1,35 5,36 0.197,37 12,38 39,39 59.927,40 67.614,41 39.375,42 36.638,43 1.7,44 6.807}
{0 CHEMBL164210,1 7.326,2 40.4,3 49.1,4 1.001,5 1.126,6 0.66,7 0.616,8 417.59,9 1.8,10 12,11 57,13 14,14 30,16 58,17 23,20 13,21 10,22 2,23 1,24 28,25 6,26 1,28 1,29 3,31 1,32 29,34 1,35 5.3,36 0.19,37 11,38 38,39 57.043,40 64.199,41 37.614,42 35.111,43 1.8,44 6.046}
{0 CHEMBL164321,1 7.638,2 41.2,3 47.1,4 1.005,5 1.125,6 0.668,7 0.629,8 389.53,9 2,10 12,11 51,13 14,14 28,16 52,17 21,20 13,21 8,22 2,23 1,24 24,25 6,26 1,28 1,29 3,31 1,32 27,34 1,35 5.9,36 0.173,37 9,38 36,39 51.276,40 57.369,41 34.091,42 32.058,43 2,44 6.222}
{0 CHEMBL16687,1 10.204,2 46.4,3 28.6,4 1.033,5 1.124,6 0.745,7 0.739,8 285.71,9 17.9,10 20,11 28,13 20,14 23,16 31,17 13,18 1,20 13,24 8,25 7,26 1,28 5,29 1,32 20,34 1,35 3.6,36 0.032,37 1,38 33,39 28.927,40 31.475,41 20.864,42 20.703,43 3.6,44 4}
{0 CHEMBL16997,1 7.649,2 40,3 44,4 1.013,5 1.131,6 0.654,7 0.634,8 382.46,9 8,10 11,11 50,13 15,14 30,16 52,17 20,20 14,21 6,22 4,24 22,25 8,28 4,29 4,32 28,35 8,36 0.135,37 7,38 39.5,39 50.669,40 56.568,41 32.693,42 31.686,44 4.824}
{0 CHEMBL17123,1 7.402,2 37.5,3 46.4,4 1.014,5 1.136,6 0.637,7 0.615,8 414.51,9 7.1,10 11,11 56,13 14,14 32,16 58,17 21,20 12,21 9,22 3,24 26,25 9,28 4,29 5,32 30,35 8.9,36 0.172,37 10,38 40.5,39 56.763,40 63.607,41 35.671,42 34.454,44 4.561}
{0 CHEMBL175444,1 10.879,2 39.2,3 39.2,4 1.021,5 1.129,6 0.726,7 0.679,8 554.81,9 11.8,10 16,11 51,13 17,14 35,16 55,17 20,18 1,20 12,21 8,22 1,24 20,25 11,26 2,27 1,28 6,29 3,32 31,34 2,35 5.9,36 0.091,37 5,38 44,39 52.054,40 57.604,41 37.006,42 34.632,43 3.9,44 8.409}
{0 CHEMBL175543,1 9.085,2 39.2,3 39.2,4 1.026,5 1.134,6 0.69,7 0.669,8 463.36,9 11.8,10 16,11 51,13 17,14 35,16 55,17 20,18 2,20 12,21 8,22 1,24 20,25 11,26 2,28 6,29 3,32 31,34 2,35 5.9,36 0.091,37 5,38 44,39 52.309,40 57.828,41 35.205,42 34.142,43 3.9,44 9}
{0 CHEMBL176551,1 7.377,2 34.7,3 46.9,4 1.016,5 1.144,6 0.627,7 0.606,8 361.45,9 10.2,10 10,11 49,13 10,14 30,16 53,17 17,20 5,21 12,24 23,25 9,28 5,29 4,32 26,35 8.2,36 0.075,37 4,38 35,39 49.771,40 56.066,41 30.699,42 29.707,44 6.987}
{0 CHEMBL17857,1 10.167,2 38,3 42,4 1.015,5 1.133,6 0.703,7 0.656,8 508.36,9 12,10 16,11 50,13 17,14 32,16 53,17 19,20 12,21 7,22 1,24 21,25 10,26 1,27 1,28 6,29 3,32 29,34 1,35 6,36 0.094,37 5,38 41,39 50.731,40 56.66,41 35.148,42 32.804,43 2,44 4.71}
{0 CHEMBL1791403,1 8.037,2 31.4,3 42.9,4 1.035,5 1.154,6 0.619,7 0.617,8 281.31,9 14.3,10 10,11 35,13 10,14 22,16 37,17 11,20 5,21 6,24 15,25 9,28 5,29 4,32 20,35 11.4,36 0.054,37 2,38 27,39 36.236,40 40.405,41 21.654,42 21.6,44 5.222}
{0 CHEMBL1791443,1 8.671,2 33.8,3 39.7,4 1.038,5 1.144,6 0.65,7 0.645,8 589.66,9 13.2,10 21,11 68,13 24,14 45,16 72,17 23,20 15,21 8,22 3,24 27,25 18,26 1,28 9,29 8,31 1,32 41,35 11.8,36 0.125,37 9,38 58.5,39 70.563,40 77.817,41 44.188,42 43.839,44 6.81}
{0 CHEMBL183,1 6.618,2 34.8,3 52.2,4 0.998,5 1.143,6 0.621,7 0.582,8 304.44,9 8.7,10 5,11 46,13 7,14 24,16 48,17 16,20 5,21 11,22 2,24 24,25 6,28 4,29 2,32 22,35 4.3,36 0.104,37 5,38 28.5,39 45.898,40 52.564,41 28.546,42 26.783,44 5.277}
{0 CHEMBL190,1 8.58,2 33.3,3 38.1,4 1.039,5 1.154,6 0.641,7 0.646,8 180.19,9 19,10 5,11 21,13 7,14 14,16 22,17 7,20 5,21 2,22 2,24 8,25 6,28 4,29 2,32 13,35 9.5,38 18.5,39 21.829,40 24.242,41 13.455,42 13.569,44 4.036}
{0 CHEMBL193385,1 8.708,2 37.8,3 40,4 1.029,5 1.137,6 0.667,7 0.655,8 391.85,9 11.1,10 16,11 45,13 16,14 30,16 48,17 17,18 1,20 11,21 6,24 18,25 10,26 1,28 5,29 4,32 27,34 1,35 8.9,36 0.104,37 5,38 38,39 46.327,40 51.18,41 30.034,42 29.481,43 2.2,44 7.456}
{0 CHEMBL193421,1 7.826,2 38.8,3 42.9,4 1.018,5 1.136,6 0.652,7 0.636,8 383.45,9 10.2,10 16,11 49,13 16,14 32,16 53,17 19,20 11,21 8,24 21,25 9,28 5,29 4,32 28,35 8.2,36 0.094,37 5,38 40,39 49.887,40 55.651,41 31.938,42 31.181,44 6.399}
{0 CHEMBL193692,1 7.716,2 41.4,3 43.1,4 1.011,5 1.129,6 0.663,7 0.642,8 447.54,9 8.6,10 22,11 58,13 22,14 37,16 62,17 24,20 17,21 7,24 25,25 9,28 5,29 4,32 33,35 6.9,36 0.113,37 7,38 48,39 58.654,40 65.481,41 38.46,42 37.234,44 6.269}
{0 CHEMBL194830,1 8.009,2 29.7,3 43.2,4 1.036,5 1.16,6 0.612,7 0.611,8 296.33,9 16.2,10 10,11 37,13 10,14 23,16 39,17 11,20 5,21 6,24 16,25 10,28 6,29 4,32 21,35 10.8,36 0.077,37 3,38 28,39 38.338,40 42.903,41 22.659,42 22.622,44 5}
{0 CHEMBL1950647,1 7.32,2 33.8,3 47.3,4 1.014,5 1.148,6 0.625,7 0.603,8 541.69,9 12.2,10 16,11 74,13 18,14 42,16 77,17 25,20 13,21 12,22 2,24 35,25 14,28 9,29 5,32 39,35 6.8,36 0.156,37 12,38 52,39 75.04,40 84.929,41 46.222,42 44.615,44 7.301}
{0 CHEMBL200732,1 11.684,2 37.5,3 37.5,4 1.026,5 1.127,6 0.748,7 0.694,8 560.84,9 12.5,10 16,11 48,13 17,14 33,16 51,17 18,18 1,20 12,21 6,22 1,24 18,25 12,26 3,27 1,28 6,29 3,31 1,32 30,34 2,35 6.3,36 0.098,37 5,38 42,39 49.247,40 54.109,41 35.892,42 33.292,43 4.2,44 9.086}
{0 CHEMBL202249,1 9.648,2 37.5,3 34.4,4 1.044,5 1.141,6 0.685,7 0.685,8 617.46,9 15.6,10 22,11 64,13 25,14 46,16 68,17 24,18 2,20 18,21 6,22 3,24 22,25 18,26 2,28 10,29 6,32 42,34 2,35 9.4,36 0.088,37 6,38 60,39 66.814,40 73.034,41 43.83,42 43.845,43 3.1,44 5.244}
{0 CHEMBL202690,1 8.479,2 33.3,3 39.2,4 1.041,5 1.152,6 0.634,7 0.64,8 432.45,9 15.7,10 15,11 51,13 17,14 34,16 54,17 17,20 10,21 7,22 2,24 20,25 14,28 8,29 6,32 31,35 11.8,36 0.093,37 5,38 43.5,39 53.08,40 58.734,41 32.341,42 32.621,44 6.274}
{0 CHEMBL202701,1 8.069,2 33.3,3 42.4,4 1.034,5 1.149,6 0.626,7 0.624,8 266.29,9 12.1,10 10,11 33,13 10,14 21,16 35,17 11,20 6,21 5,24 14,25 8,28 4,29 4,32 19,35 12.1,36 0.057,37 2,38 26,39 34.134,40 37.907,41 20.648,42 20.579,44 4.21}
{0 CHEMBL202722,1 8.142,2 41.7,3 40,4 1.02,5 1.13,6 0.669,7 0.657,8 488.55,9 10,10 22,11 60,13 24,14 40,16 64,17 25,20 19,21 6,22 2,24 24,25 11,28 6,29 5,32 36,35 8.3,36 0.094,37 6,38 53,39 61.2,40 67.774,41 40.159,42 39.444,44 6.009}
{0 CHEMBL203667,1 7.788,2 40.3,3 42.9,4 1.015,5 1.132,6 0.658,7 0.64,8 599.71,9 9.1,10 22,11 77,13 25,14 48,16 81,17 31,19 2,20 19,21 10,22 2,24 33,25 13,28 7,29 6,32 44,33 1,35 7.8,36 0.111,37 9,38 63,39 78.163,40 87.142,41 50.665,42 49.287,44 7.048}
{0 CHEMBL203812,1 8.237,2 36.8,3 40.4,4 1.031,5 1.142,6 0.647,7 0.643,8 469.51,9 12.3,10 16,11 57,13 19,14 37,16 60,17 21,20 14,21 7,22 3,24 23,25 13,28 7,29 6,32 34,35 10.5,36 0.1,37 6,38 48,39 58.745,40 65.066,41 36.858,42 36.653,44 7.68}
{0 CHEMBL203859,1 8.904,2 34.8,3 37.9,4 1.041,5 1.142,6 0.658,7 0.656,8 587.64,9 13.6,10 21,11 66,13 25,14 45,16 70,17 23,20 16,21 7,22 4,24 25,25 18,26 1,28 9,29 8,31 1,32 41,35 12.1,36 0.114,37 8,38 59.5,39 68.68,40 75.402,41 43.426,42 43.312,44 6.81}
{0 CHEMBL203933,1 7.854,2 36.2,3 43.1,4 1.022,5 1.143,6 0.641,7 0.629,8 455.53,9 12.1,10 16,11 58,13 18,14 36,16 61,17 21,20 13,21 8,22 2,24 25,25 12,28 7,29 5,32 33,35 8.6,36 0.098,37 6,38 46,39 59.302,40 66.272,41 37.165,42 36.465,44 7.788}
{0 CHEMBL203958,1 9.094,2 37.1,3 34.3,4 1.05,5 1.143,6 0.656,7 0.672,8 636.6,9 14.3,10 22,11 70,13 29,14 50,16 74,17 26,20 20,21 6,22 7,24 24,25 20,28 10,29 10,32 46,35 14.3,36 0.108,37 8,38 68,39 73.476,40 79.983,41 45.932,42 47.05,44 6.775}
{0 CHEMBL203960,1 8.162,2 40.3,3 40.3,4 1.024,5 1.132,6 0.661,7 0.652,8 587.65,9 9.7,10 22,11 72,13 25,14 47,16 76,17 29,19 2,20 19,21 8,22 2,24 29,25 14,28 7,29 7,32 43,33 1,35 9.7,36 0.092,37 7,38 62,39 73.723,40 81.521,41 47.597,42 46.948,44 6.489}
{0 CHEMBL204190,1 8.2,2 41.2,3 39.7,4 1.022,5 1.131,6 0.667,7 0.657,8 557.62,9 10.3,10 22,11 68,13 25,14 45,16 72,17 28,19 2,20 19,21 7,22 2,24 27,25 13,28 7,29 6,32 41,33 1,35 8.8,36 0.083,37 6,38 60,39 69.512,40 76.897,41 45.381,42 44.707,44 6.812}
{0 CHEMBL204246,1 11.304,2 36.5,3 36.5,4 1.037,5 1.137,6 0.715,7 0.684,8 587.8,9 13.5,10 16,11 52,13 18,14 36,16 55,17 19,18 1,20 13,21 6,22 2,24 19,25 14,26 2,27 1,28 7,29 5,32 33,34 2,35 9.6,36 0.091,37 5,38 46,39 53.927,40 59.106,41 37.159,42 35.556,43 3.8,44 6.502}
{0 CHEMBL204651,1 7.812,2 34.8,3 43.9,4 1.026,5 1.144,6 0.63,7 0.62,8 515.59,9 10.6,10 16,11 66,13 18,14 40,16 69,17 23,20 13,21 10,22 2,24 29,25 14,28 7,29 7,32 37,35 10.6,36 0.13,37 9,38 50,39 67.723,40 75.521,41 41.597,42 40.948,44 6.386}
{0 CHEMBL204820,1 8.785,2 35.7,3 39.3,4 1.037,5 1.143,6 0.656,7 0.651,8 491.94,9 12.5,10 16,11 56,13 18,14 37,16 59,17 20,18 1,20 13,21 7,22 2,24 22,25 14,26 1,28 7,29 6,32 34,34 1,35 10.7,36 0.102,37 6,38 47,39 58.069,40 64.01,41 36.716,42 36.48,43 1.8,44 7.767}
{0 CHEMBL205058,1 8.194,2 37,3 40.7,4 1.03,5 1.14,6 0.645,7 0.641,8 442.48,9 11.1,10 16,11 54,13 18,14 35,16 57,17 20,20 13,21 7,22 2,24 22,25 12,28 6,29 6,32 32,35 11.1,36 0.105,37 6,38 45,39 55.643,40 61.568,41 34.852,42 34.632,44 6.077}
{0 CHEMBL206116,1 8.707,2 41.2,3 38.2,4 1.027,5 1.13,6 0.68,7 0.67,8 592.06,9 10.3,10 22,11 68,13 25,14 46,16 72,17 28,18 1,19 2,20 19,21 7,22 2,24 26,25 14,26 1,28 7,29 6,32 42,33 1,34 1,35 8.8,36 0.083,37 6,38 61,39 69.836,40 76.841,41 46.239,42 45.534,43 1.5,44 6.157}
{0 CHEMBL206265,1 8.213,2 37.9,3 42.4,4 1.021,5 1.137,6 0.66,7 0.642,8 542.05,9 10.6,10 16,11 66,13 19,14 41,16 69,17 25,18 1,19 2,20 13,21 10,22 2,24 28,25 13,26 1,28 7,29 5,32 38,33 1,34 1,35 7.6,36 0.101,37 7,38 53,39 67.392,40 75.046,41 43.546,42 42.346,43 1.5,44 6.236}
{0 CHEMBL206807,1 7.832,2 35.5,3 43.5,4 1.024,5 1.143,6 0.635,7 0.624,8 485.56,9 11.3,10 16,11 62,13 18,14 38,16 65,17 22,20 13,21 9,22 2,24 27,25 13,28 7,29 6,32 35,35 9.7,36 0.123,37 8,38 48,39 63.512,40 70.897,41 39.381,42 38.707,44 6.971}
{0 CHEMBL2079570,1 9.931,2 31.3,3 37.5,4 1.045,5 1.145,6 0.686,7 0.668,8 317.79,9 15.6,10 10,11 32,13 10,14 22,16 34,17 10,18 1,20 5,21 5,24 12,25 10,26 2,28 5,29 3,31 1,32 20,34 1,35 9.4,36 0.059,37 2,38 27,39 33.425,40 36.645,41 21.943,42 21.373,43 3.1,44 4.307}
{0 CHEMBL2079643,1 9.931,2 31.3,3 37.5,4 1.045,5 1.145,6 0.686,7 0.668,8 317.79,9 15.6,10 10,11 32,13 10,14 22,16 34,17 10,18 1,20 5,21 5,24 12,25 10,26 2,28 5,29 3,31 1,32 20,34 1,35 9.4,36 0.059,37 2,38 27,39 33.425,40 36.645,41 21.943,42 21.373,43 3.1,44 5.963}
{0 CHEMBL2094002,1 10.167,2 38,3 42,4 1.015,5 1.133,6 0.703,7 0.656,8 508.36,9 12,10 16,11 50,13 17,14 32,16 53,17 19,20 12,21 7,22 1,24 21,25 10,26 1,27 1,28 6,29 3,32 29,34 1,35 6,36 0.094,37 5,38 41,39 50.731,40 56.66,41 35.148,42 32.804,43 2,44 4.71}
{0 CHEMBL2112076,1 9.429,2 31.3,3 37.5,4 1.052,5 1.154,6 0.648,7 0.653,8 301.72,9 15.6,10 10,11 32,13 10,14 22,16 34,17 10,18 1,20 5,21 5,24 12,25 10,26 1,28 5,29 4,32 20,34 1,35 12.5,36 0.059,37 2,38 27,39 33.676,40 36.934,41 20.75,42 20.901,43 3.1,44 4.854}
{0 CHEMBL2112155,1 8.763,2 39.2,3 39.2,4 1.029,5 1.142,6 0.672,7 0.661,8 446.91,9 11.8,10 16,11 51,13 17,14 35,16 55,17 20,18 1,20 12,21 8,22 1,23 1,24 20,25 11,26 1,28 6,29 3,32 31,34 2,35 5.9,36 0.091,37 5,38 44,39 52.498,40 58.223,41 34.284,42 33.698,43 3.9,44 8.796}
{0 CHEMBL2112157,1 8.288,2 37.3,3 42.4,4 1.024,5 1.138,6 0.657,7 0.641,8 488.98,9 10.2,10 16,11 59,13 17,14 38,16 63,17 22,18 1,20 12,21 10,22 1,24 25,25 12,26 1,28 6,29 5,32 34,34 1,35 8.5,36 0.111,37 7,38 47,39 60.407,40 67.133,41 38.779,42 37.798,43 1.7,44 9.06}
{0 CHEMBL2112162,1 8.473,2 40.4,3 40.4,4 1.021,5 1.132,6 0.677,7 0.659,8 482.97,9 10.5,10 16,11 57,13 18,14 38,16 61,17 23,18 1,19 2,20 12,21 9,22 1,24 23,25 11,26 1,28 6,29 4,32 34,33 1,34 1,35 7,36 0.082,37 5,38 49,39 58.196,40 64.508,41 38.563,42 37.556,43 1.8,44 8.796}
{0 CHEMBL2112177,1 7.304,2 35.3,3 47.1,4 1.011,5 1.144,6 0.632,7 0.608,8 372.48,9 11.8,10 10,11 51,13 11,14 31,16 55,17 18,20 6,21 12,22 1,24 24,25 9,28 6,29 3,32 27,35 5.9,36 0.073,37 4,38 37,39 51.545,40 58.355,41 32.25,42 31.014,44 7.991}
{0 CHEMBL2112178,1 7.872,2 36.4,3 45.5,4 1.014,5 1.14,6 0.652,7 0.625,8 432.96,9 10.9,10 10,11 55,13 11,14 35,16 60,17 20,18 1,20 6,21 14,22 1,24 25,25 10,26 1,28 6,29 3,32 30,34 1,35 5.5,36 0.067,37 4,38 41,39 55.752,40 62.714,41 35.87,42 34.368,43 1.8,44 8.018}
{0 CHEMBL2112411,1 7.113,2 41.7,3 47.9,4 1.003,5 1.123,6 0.65,7 0.618,8 341.44,9 2.1,10 6,11 48,13 11,14 26,16 49,17 20,20 14,21 6,22 5,24 23,25 5,28 1,29 4,32 25,35 8.3,36 0.122,37 6,38 34,39 48.131,40 53.903,41 31.199,42 29.675,44 4.917}
{0 CHEMBL2112485,1 7.232,2 46,3 46,4 0.997,5 1.113,6 0.674,7 0.639,8 455.59,9 1.6,10 12,11 63,13 17,14 37,16 66,17 29,19 2,20 18,21 9,22 4,24 29,25 5,28 1,29 4,32 34,33 1,35 6.3,36 0.106,37 7,38 49,39 62.781,40 70.149,41 42.483,42 40.256,44 5.757}
{0 CHEMBL2112672,1 8.473,2 35.9,3 46.2,4 1.019,5 1.119,6 0.677,7 0.633,8 330.46,10 5,11 39,13 9,14 22,16 40,17 14,20 6,21 8,22 4,24 18,25 7,26 2,29 5,31 2,32 21,35 12.8,36 0.1,37 4,38 28.5,39 39.742,40 43.624,41 26.421,42 24.689,44 4.286}
{0 CHEMBL2112931,1 7.957,2 40.4,3 45.6,4 1.019,5 1.138,6 0.658,7 0.629,8 453.57,9 1.8,10 12,11 57,13 14,14 32,16 58,17 23,20 13,21 10,22 2,23 3,24 26,25 8,26 1,28 1,29 3,31 1,32 31,34 3,35 5.3,36 0.19,37 11,38 40,39 58.069,40 64.878,41 37.489,42 35.878,43 5.3,44 6.305}
{0 CHEMBL2113388,1 7.398,2 37,3 46.3,4 1.012,5 1.139,6 0.638,7 0.615,8 399.5,9 9.3,10 16,11 54,13 16,14 32,16 57,17 20,20 11,21 9,24 25,25 9,28 5,29 4,32 29,35 7.4,36 0.105,37 6,38 40,39 54.654,40 61.481,41 34.461,42 33.234,44 5.967}
{0 CHEMBL2113392,1 9.113,2 33.3,3 39.4,4 1.044,5 1.147,6 0.652,7 0.649,8 300.73,9 12.1,10 10,11 33,13 10,14 22,16 35,17 11,18 1,20 6,21 5,24 13,25 9,26 1,28 4,29 4,32 20,34 1,35 12.1,36 0.057,37 2,38 27,39 34.458,40 37.851,41 21.506,42 21.406,43 3,44 5.606}
{0 CHEMBL2113395,1 7.813,2 37.3,3 43.1,4 1.019,5 1.14,6 0.646,7 0.631,8 398.47,9 11.8,10 16,11 51,13 17,14 32,16 54,17 19,20 12,21 7,22 1,24 22,25 10,28 6,29 4,32 29,35 7.8,36 0.093,37 5,38 41,39 51.989,40 58.149,41 32.943,42 32.202,44 6.219}
{0 CHEMBL2113396,1 7.881,2 33.3,3 43.6,4 1.029,5 1.149,6 0.626,7 0.619,8 307.35,9 12.8,10 10,11 39,13 11,14 24,16 41,17 13,20 7,21 6,22 1,24 17,25 9,28 5,29 4,32 22,35 10.3,36 0.073,37 3,38 30,39 40.12,40 44.82,41 24.415,42 24.127,44 6.153}
{0 CHEMBL2113397,1 11.029,2 37.8,3 37.8,4 1.029,5 1.134,6 0.713,7 0.677,8 496.3,9 13.3,10 16,11 45,13 17,14 31,16 48,17 17,20 12,21 5,22 1,24 17,25 11,26 1,27 1,28 6,29 4,32 28,34 1,35 8.9,36 0.083,37 4,38 40,39 46.291,40 51.039,41 32.08,42 30.465,43 2.2,44 4.136}
{0 CHEMBL2113400,1 11.888,2 38.3,3 34,4 1.041,5 1.132,6 0.732,7 0.702,8 558.75,9 12.8,10 16,11 47,13 18,14 34,16 50,17 18,18 1,20 13,21 5,22 2,24 16,25 13,26 2,27 1,28 6,29 5,32 31,34 2,35 10.6,36 0.08,37 4,38 44,39 48.942,40 53.193,41 34.392,42 33.008,43 4.3,44 9.481}
{0 CHEMBL2113415,1 12.542,2 40,3 32.5,4 1.041,5 1.127,6 0.754,7 0.719,8 501.69,9 12.5,10 16,11 40,13 17,14 30,16 43,17 16,18 1,20 12,21 4,22 1,24 13,25 11,26 2,27 1,28 5,29 4,32 27,34 2,35 10,36 0.07,37 3,38 39,39 41.629,40 45.07,41 30.171,42 28.745,43 5,44 6.559}
{0 CHEMBL2113418,1 7.863,2 31.7,3 43.9,4 1.03,5 1.154,6 0.62,7 0.613,8 322.37,9 14.6,10 10,11 41,13 11,14 25,16 43,17 13,20 6,21 7,22 1,24 18,25 10,28 6,29 4,32 23,35 9.8,36 0.07,37 3,38 31,39 42.222,40 47.319,41 25.421,42 25.148,44 6.26}
{0 CHEMBL2113474,1 8.363,2 37.5,3 39.6,4 1.035,5 1.139,6 0.648,7 0.648,8 401.42,9 10.4,10 16,11 48,13 16,14 33,16 52,17 18,20 11,21 7,24 19,25 11,28 5,29 6,32 29,35 12.5,36 0.077,37 4,38 41,39 49.658,40 54.654,41 31.085,42 31.083,44 5.83}
{0 CHEMBL2113475,1 8.32,2 35.6,3 40,4 1.034,5 1.145,6 0.642,7 0.641,8 374.4,9 13.3,10 15,11 45,13 16,14 30,16 48,17 16,20 10,21 6,22 1,24 18,25 11,28 6,29 5,32 27,35 11.1,36 0.104,37 5,38 38.5,39 46.549,40 51.528,41 28.875,42 28.863,44 6.143}
{0 CHEMBL2113489,1 7.551,2 33.3,3 45.8,4 1.021,5 1.149,6 0.624,7 0.608,8 362.44,9 12.5,10 10,11 48,13 11,14 29,16 51,17 16,20 6,21 10,22 1,24 22,25 10,28 6,29 4,32 26,35 8.3,36 0.059,37 3,38 35,39 48.989,40 55.149,41 29.943,42 29.202,44 4.821}
{0 CHEMBL2113492,1 7.456,2 31.9,3 46.8,4 1.021,5 1.152,6 0.616,7 0.6,8 350.43,9 12.8,10 10,11 47,13 11,14 27,16 49,17 15,20 6,21 9,22 1,24 22,25 10,28 6,29 4,32 25,35 8.5,36 0.122,37 6,38 33,39 47.989,40 54.149,41 28.943,42 28.202,44 5.255}
{0 CHEMBL2113540,1 8.843,2 36.4,3 37.9,4 1.036,5 1.139,6 0.666,7 0.661,8 583.65,9 13.6,10 22,11 66,13 26,14 45,16 70,17 24,20 18,21 6,22 4,24 25,25 17,26 1,28 9,29 7,31 1,32 41,35 10.6,36 0.114,37 8,38 60,39 68.353,40 75.192,41 43.972,42 43.598,44 7.267}
{0 CHEMBL2113550,1 8.994,2 35.4,3 36.9,4 1.04,5 1.143,6 0.665,7 0.663,8 584.64,9 15.4,10 22,11 65,13 26,14 45,16 69,17 23,20 17,21 6,22 4,24 24,25 18,26 1,28 10,29 7,31 1,32 41,35 10.8,36 0.116,37 8,38 60,39 67.571,40 74.275,41 43.216,42 43.092,44 6.393}
{0 CHEMBL2113557,1 10.701,2 36.5,3 40.4,4 1.022,5 1.131,6 0.716,7 0.667,8 556.43,9 11.5,10 16,11 52,13 17,14 34,16 55,17 19,20 12,21 7,22 1,24 21,25 12,26 2,27 1,28 6,29 4,31 1,32 31,34 1,35 7.7,36 0.109,37 6,38 43,39 53.134,40 58.79,41 37.25,42 34.706,43 1.9,44 8.638}
{0 CHEMBL2113561,1 10.603,2 36.2,3 40.4,4 1.025,5 1.137,6 0.699,7 0.659,8 498.32,9 12.8,10 16,11 47,13 16,14 31,16 50,17 17,20 11,21 6,24 19,25 11,26 1,27 1,28 6,29 4,32 28,34 1,35 8.5,36 0.1,37 5,38 39,39 48.174,40 53.454,41 32.841,42 30.992,43 2.1,44 6.742}
{0 CHEMBL2113562,1 10.177,2 35.8,3 41.5,4 1.022,5 1.139,6 0.691,7 0.652,8 539.38,9 13.2,10 16,11 53,13 17,14 34,16 56,17 19,20 12,21 7,22 1,24 22,25 12,26 1,27 1,28 7,29 4,32 31,34 1,35 7.5,36 0.107,37 6,38 43,39 54.16,40 60.368,41 36.608,42 34.54,43 1.9,44 8.506}
{0 CHEMBL2113565,1 8.488,2 37.3,3 41.2,4 1.026,5 1.139,6 0.663,7 0.648,8 432.91,9 11.8,10 16,11 51,13 17,14 33,16 54,17 19,18 1,20 12,21 7,22 1,24 21,25 11,26 1,28 6,29 4,32 30,34 1,35 7.8,36 0.111,37 6,38 42,39 52.313,40 58.093,41 33.801,42 33.03,43 2,44 8.959}
{0 CHEMBL2113566,1 7.7,2 30.9,3 45.5,4 1.03,5 1.154,6 0.611,7 0.603,8 423.49,9 12.7,10 10,11 55,13 12,14 32,16 57,17 17,20 7,21 10,22 2,24 25,25 13,28 7,29 6,32 30,35 10.9,36 0.123,37 7,38 39,39 56.629,40 63.481,41 33.62,42 33.18,44 4.745}
{0 CHEMBL2113567,1 7.639,2 37,3 44.4,4 1.016,5 1.14,6 0.643,7 0.625,8 412.5,9 11.1,10 16,11 54,13 17,14 33,16 57,17 20,20 12,21 8,22 1,24 24,25 10,28 6,29 4,32 30,35 7.4,36 0.105,37 6,38 42,39 54.872,40 61.564,41 34.705,42 33.729,44 8.921}
{0 CHEMBL2113568,1 8.685,2 32.4,3 38.2,4 1.049,5 1.153,6 0.628,7 0.641,8 295.29,9 14.7,10 10,11 34,13 11,14 23,16 36,17 11,20 6,21 5,22 1,24 13,25 10,28 5,29 5,32 21,35 14.7,36 0.056,37 2,38 29,39 35.68,40 39.199,41 21.347,42 21.788,44 5.206}
{0 CHEMBL2113569,1 8.166,2 37.3,3 41.2,4 1.029,5 1.147,6 0.645,7 0.639,8 416.46,9 11.8,10 16,11 51,13 17,14 33,16 54,17 19,20 12,21 7,22 1,23 1,24 21,25 11,28 6,29 4,32 30,34 1,35 7.8,36 0.111,37 6,38 42,39 52.502,40 58.489,41 32.881,42 32.585,43 2,44 7.971}
{0 CHEMBL2113570,1 8.367,2 35.8,3 39.6,4 1.035,5 1.144,6 0.643,7 0.644,8 443.47,9 13.2,10 16,11 53,13 19,14 35,16 56,17 19,20 12,21 7,22 3,24 21,25 13,28 7,29 6,32 32,35 11.3,36 0.125,37 7,38 46,39 54.862,40 60.651,41 34.097,42 34.126,44 8.553}
{0 CHEMBL2113571,1 8.367,2 35.8,3 39.6,4 1.035,5 1.144,6 0.643,7 0.644,8 443.47,9 13.2,10 16,11 53,13 19,14 35,16 56,17 19,20 12,21 7,22 3,24 21,25 13,28 7,29 6,32 32,35 11.3,36 0.125,37 7,38 46,39 54.862,40 60.651,41 34.097,42 34.126,44 8.046}
{0 CHEMBL2113572,1 8.883,2 36.5,3 38.5,4 1.036,5 1.142,6 0.663,7 0.658,8 461.91,9 13.5,10 16,11 52,13 18,14 35,16 55,17 19,18 1,20 13,21 6,22 2,24 20,25 13,26 1,28 7,29 5,32 32,34 1,35 9.6,36 0.091,37 5,38 45,39 53.858,40 59.386,41 34.5,42 34.239,43 1.9,44 8.357}
{0 CHEMBL2113610,1 7.791,2 36.4,3 43.6,4 1.022,5 1.141,6 0.639,7 0.626,8 428.5,9 10.9,10 16,11 55,13 17,14 34,16 58,17 20,20 12,21 8,22 1,24 24,25 11,28 6,29 5,32 31,35 9.1,36 0.121,37 7,38 43,39 56.2,40 62.774,41 35.159,42 34.444,44 7.959}
{0 CHEMBL2113611,1 7.791,2 36.4,3 43.6,4 1.022,5 1.141,6 0.639,7 0.626,8 428.5,9 10.9,10 16,11 55,13 17,14 34,16 58,17 20,20 12,21 8,22 1,24 24,25 11,28 6,29 5,32 31,35 9.1,36 0.121,37 7,38 43,39 56.2,40 62.774,41 35.159,42 34.444,44 8.367}
{0 CHEMBL2113612,1 7.791,2 36.4,3 43.6,4 1.022,5 1.141,6 0.639,7 0.626,8 428.5,9 10.9,10 16,11 55,13 17,14 34,16 58,17 20,20 12,21 8,22 1,24 24,25 11,28 6,29 5,32 31,35 9.1,36 0.121,37 7,38 43,39 56.2,40 62.774,41 35.159,42 34.444,44 8.149}
{0 CHEMBL2113613,1 10.282,2 37.3,3 41.2,4 1.021,5 1.135,6 0.698,7 0.657,8 524.36,9 11.8,10 16,11 51,13 17,14 33,16 54,17 19,20 12,21 7,22 1,24 21,25 11,26 1,27 1,28 6,29 4,32 30,34 1,35 7.8,36 0.111,37 6,38 42,39 52.058,40 57.87,41 35.603,42 33.519,43 2,44 9.056}
{0 CHEMBL2113614,1 7.813,2 37.3,3 43.1,4 1.019,5 1.14,6 0.646,7 0.631,8 398.47,9 11.8,10 16,11 51,13 17,14 32,16 54,17 19,20 12,21 7,22 1,24 22,25 10,28 6,29 4,32 29,35 7.8,36 0.111,37 6,38 41,39 51.989,40 58.149,41 32.943,42 32.202,44 8.167}
{0 CHEMBL2113615,1 10.642,2 36.5,3 38.5,4 1.031,5 1.138,6 0.698,7 0.668,8 553.36,9 13.5,10 16,11 52,13 18,14 35,16 55,17 19,20 13,21 6,22 2,24 20,25 13,26 1,27 1,28 7,29 5,32 32,34 1,35 9.6,36 0.091,37 5,38 45,39 53.603,40 59.162,41 36.301,42 34.728,43 1.9,44 7.495}
{0 CHEMBL2113616,1 8.17,2 35.7,3 41.1,4 1.031,5 1.144,6 0.64,7 0.637,8 457.5,9 12.5,10 16,11 56,13 18,14 36,16 59,17 20,20 13,21 7,22 2,24 23,25 13,28 7,29 6,32 33,35 10.7,36 0.102,37 6,38 46,39 57.745,40 64.066,41 35.858,42 35.653,44 7.523}
{0 CHEMBL2113617,1 8.727,2 37.5,3 39.6,4 1.03,5 1.139,6 0.667,7 0.656,8 418.88,9 12.5,10 16,11 48,13 17,14 32,16 51,17 18,18 1,20 12,21 6,22 1,24 19,25 11,26 1,28 6,29 4,32 29,34 1,35 8.3,36 0.098,37 5,38 41,39 49.429,40 54.678,41 32.04,42 31.503,43 2.1,44 7.66}
{0 CHEMBL2113618,1 8.231,2 37.8,3 40,4 1.027,5 1.14,6 0.654,7 0.648,8 370.41,9 13.3,10 16,11 45,13 17,14 30,16 48,17 17,20 12,21 5,22 1,24 18,25 10,28 6,29 4,32 27,35 8.9,36 0.104,37 5,38 39,39 46.222,40 51.319,41 29.421,42 29.148,44 6.609}
{0 CHEMBL2113620,1 9.653,2 37.5,3 39.6,4 1.028,5 1.137,6 0.678,7 0.66,8 463.33,9 12.5,10 16,11 48,13 17,14 32,15 1,16 51,17 18,20 12,21 6,22 1,24 19,25 11,26 1,28 6,29 4,32 29,34 1,35 8.3,36 0.098,37 5,38 41,39 49.334,40 54.575,41 32.534,42 31.7,43 2.1,44 8.721}
{0 CHEMBL2113621,1 7.024,2 31.8,3 50,4 1.013,5 1.15,6 0.609,7 0.584,8 463.61,9 10.6,10 10,11 66,13 12,14 35,16 68,17 21,20 7,21 14,22 2,24 33,25 12,28 7,29 5,32 33,35 7.6,36 0.162,37 11,38 42,39 66.836,40 75.933,41 40.211,42 38.572,44 6.487}
{0 CHEMBL2113622,1 8.567,2 36.5,3 38.5,4 1.039,5 1.15,6 0.646,7 0.65,8 445.46,9 13.5,10 16,11 52,13 18,14 35,16 55,17 19,20 13,21 6,22 2,23 1,24 20,25 13,28 7,29 5,32 32,34 1,35 9.6,36 0.091,37 5,38 45,39 54.047,40 59.781,41 33.58,42 33.795,43 1.9,44 7.469}
{0 CHEMBL2113623,1 7.546,2 31.5,3 46.3,4 1.024,5 1.153,6 0.614,7 0.601,8 407.49,9 13,10 10,11 54,13 12,14 31,16 56,17 17,20 7,21 10,22 2,24 25,25 12,28 7,29 5,32 29,35 9.3,36 0.089,37 5,38 38,39 55.302,40 62.272,41 33.165,42 32.465,44 5.714}
{0 CHEMBL2113624,1 8.221,2 36.5,3 40.4,4 1.03,5 1.143,6 0.647,7 0.643,8 427.47,9 13.5,10 16,11 52,13 18,14 34,16 55,17 19,20 13,21 6,22 2,24 21,25 12,28 7,29 5,32 31,35 9.6,36 0.091,37 5,38 44,39 53.534,40 59.442,41 33.642,42 33.411,44 7.409}
{0 CHEMBL2113625,1 8.567,2 36.5,3 38.5,4 1.039,5 1.15,6 0.646,7 0.65,8 445.46,9 13.5,10 16,11 52,13 18,14 35,16 55,17 19,20 13,21 6,22 2,23 1,24 20,25 13,28 7,29 5,32 32,34 1,35 9.6,36 0.091,37 5,38 45,39 54.047,40 59.781,41 33.58,42 33.795,43 1.9,44 7.409}
{0 CHEMBL2113626,1 8.027,2 36.4,3 41.8,4 1.026,5 1.143,6 0.644,7 0.635,8 441.5,9 12.7,10 16,11 55,13 18,14 35,16 58,17 20,20 13,21 7,22 2,24 23,25 12,28 7,29 5,32 32,35 9.1,36 0.086,37 5,38 45,39 56.418,40 62.857,41 35.404,42 34.938,44 7.491}
{0 CHEMBL2113627,1 9.14,2 36.7,3 36.7,4 1.04,5 1.142,6 0.668,7 0.668,8 447.88,9 14.3,10 16,11 49,13 18,14 34,16 52,17 18,18 1,20 13,21 5,22 2,24 18,25 13,26 1,28 7,29 5,32 31,34 1,35 10.2,36 0.077,37 4,38 44,39 50.974,40 55.97,41 32.739,42 32.712,43 2,44 6.939}
{0 CHEMBL2113628,1 9.738,2 36.5,3 38.5,4 1.034,5 1.14,6 0.673,7 0.662,8 506.36,9 13.5,10 16,11 52,13 18,14 35,15 1,16 55,17 19,20 13,21 6,22 2,24 20,25 13,26 1,28 7,29 5,32 32,34 1,35 9.6,36 0.091,37 5,38 45,39 53.763,40 59.283,41 34.995,42 34.437,43 1.9,44 6.561}
{0 CHEMBL2113629,1 10.642,2 36.5,3 38.5,4 1.031,5 1.138,6 0.698,7 0.668,8 553.36,9 13.5,10 16,11 52,13 18,14 35,16 55,17 19,20 13,21 6,22 2,24 20,25 13,26 1,27 1,28 7,29 5,32 32,34 1,35 9.6,36 0.091,37 5,38 45,39 53.603,40 59.162,41 36.301,42 34.728,43 1.9,44 7.523}
{0 CHEMBL2113630,1 8.17,2 35.7,3 41.1,4 1.031,5 1.144,6 0.64,7 0.637,8 457.5,9 12.5,10 16,11 56,13 18,14 36,16 59,17 20,20 13,21 7,22 2,24 23,25 13,28 7,29 6,32 33,35 10.7,36 0.102,37 6,38 46,39 57.745,40 64.066,41 35.858,42 35.653,44 8.18}
{0 CHEMBL2113631,1 8.883,2 36.5,3 38.5,4 1.036,5 1.142,6 0.663,7 0.658,8 461.91,9 13.5,10 16,11 52,13 18,14 35,16 55,17 19,18 1,20 13,21 6,22 2,24 20,25 13,26 1,28 7,29 5,32 32,34 1,35 9.6,36 0.091,37 5,38 45,39 53.858,40 59.386,41 34.5,42 34.239,43 1.9,44 6.943}
{0 CHEMBL2113632,1 9.009,2 36.4,3 36.4,4 1.054,5 1.161,6 0.64,7 0.656,8 495.47,9 12.7,10 16,11 55,13 18,14 38,16 58,17 20,20 13,21 7,22 2,23 3,24 20,25 15,28 7,29 5,32 35,34 3,35 9.1,36 0.086,37 5,38 48,39 57.956,40 63.876,41 35.216,42 36.088,43 5.5,44 7.268}
{0 CHEMBL2113633,1 8.17,2 35.7,3 41.1,4 1.031,5 1.144,6 0.64,7 0.637,8 457.5,9 12.5,10 16,11 56,13 18,14 36,16 59,17 20,20 13,21 7,22 2,24 23,25 13,28 7,29 6,32 33,35 10.7,36 0.102,37 6,38 46,39 57.745,40 64.066,41 35.858,42 35.653,44 7.377}
{0 CHEMBL2113634,1 10.642,2 36.5,3 38.5,4 1.031,5 1.138,6 0.698,7 0.668,8 553.36,9 13.5,10 16,11 52,13 18,14 35,16 55,17 19,20 13,21 6,22 2,24 20,25 13,26 1,27 1,28 7,29 5,32 32,34 1,35 9.6,36 0.091,37 5,38 45,39 53.603,40 59.162,41 36.301,42 34.728,43 1.9,44 6.996}
{0 CHEMBL2113635,1 8.567,2 36.5,3 38.5,4 1.039,5 1.15,6 0.646,7 0.65,8 445.46,9 13.5,10 16,11 52,13 18,14 35,16 55,17 19,20 13,21 6,22 2,23 1,24 20,25 13,28 7,29 5,32 32,34 1,35 9.6,36 0.091,37 5,38 45,39 54.047,40 59.781,41 33.58,42 33.795,43 1.9,44 7.721}
{0 CHEMBL2113636,1 8.367,2 35.8,3 39.6,4 1.035,5 1.144,6 0.643,7 0.644,8 443.47,9 13.2,10 16,11 53,13 18,14 35,16 56,17 19,20 13,21 6,22 2,24 21,25 13,28 7,29 6,32 32,35 11.3,36 0.089,37 5,38 45,39 54.862,40 60.651,41 34.097,42 34.126,44 7.252}
{0 CHEMBL2113637,1 8.883,2 36.5,3 38.5,4 1.036,5 1.142,6 0.663,7 0.658,8 461.91,9 13.5,10 16,11 52,13 18,14 35,16 55,17 19,18 1,20 13,21 6,22 2,24 20,25 13,26 1,28 7,29 5,32 32,34 1,35 9.6,36 0.091,37 5,38 45,39 53.858,40 59.386,41 34.5,42 34.239,43 1.9,44 8.131}
{0 CHEMBL2113638,1 8.367,2 35.8,3 39.6,4 1.035,5 1.144,6 0.643,7 0.644,8 443.47,9 13.2,10 16,11 53,13 19,14 35,16 56,17 19,20 12,21 7,22 3,24 21,25 13,28 7,29 6,32 32,35 11.3,36 0.125,37 7,38 46,39 54.862,40 60.651,41 34.097,42 34.126,44 8.06}
{0 CHEMBL2113639,1 7.639,2 37,3 44.4,4 1.016,5 1.14,6 0.643,7 0.625,8 412.5,9 11.1,10 16,11 54,13 17,14 33,16 57,17 20,20 12,21 8,22 1,24 24,25 10,28 6,29 4,32 30,35 7.4,36 0.105,37 6,38 42,39 54.872,40 61.564,41 34.705,42 33.729,44 7.745}
{0 CHEMBL2113685,1 10.962,2 37.2,3 41.9,4 1.011,5 1.127,6 0.734,7 0.668,8 471.36,9 11.6,10 16,11 43,13 16,14 27,16 45,17 16,20 11,21 5,24 18,25 9,26 2,27 1,28 5,29 2,31 1,32 25,34 1,35 4.7,36 0.156,37 7,38 35,39 43.494,40 48.457,41 31.574,42 28.728,43 2.3,44 5.066}
{0 CHEMBL2113687,1 11.751,2 40,3 40,4 1.002,5 1.12,6 0.775,7 0.693,8 411.3,9 14.3,10 16,11 35,13 16,14 23,16 37,17 14,20 11,21 3,24 14,25 7,26 2,27 1,28 5,31 1,32 21,34 1,36 0.108,37 4,38 31,39 35.073,40 39.208,41 27.142,42 24.245,43 2.9,44 6.524}
{0 CHEMBL2113688,1 10.904,2 38.5,3 41,4 1.014,5 1.131,6 0.722,7 0.667,8 425.26,9 12.8,10 16,11 39,13 16,14 25,16 41,17 15,20 11,21 4,24 16,25 8,26 1,27 1,28 5,29 2,32 23,34 1,35 5.1,36 0.146,37 6,38 33,39 39.534,40 44.122,41 28.165,42 26.014,43 2.6,44 4.604}
{0 CHEMBL2113689,1 11.292,2 40,3 40,4 1.009,5 1.129,6 0.741,7 0.679,8 395.23,9 14.3,10 16,11 35,13 16,14 23,16 37,17 14,20 11,21 3,24 14,25 7,26 1,27 1,28 5,29 1,32 21,34 1,35 2.9,36 0.135,37 5,38 31,39 35.323,40 39.498,41 25.949,42 23.773,43 2.9,44 4.204}
{0 CHEMBL2113690,1 11.781,2 41.9,3 38.7,4 1.004,5 1.125,6 0.766,7 0.695,8 365.2,9 16.1,10 16,11 31,13 16,14 21,16 33,17 13,20 11,21 2,24 12,25 6,26 1,27 1,28 5,32 19,34 1,36 0.091,37 3,38 29,39 31.113,40 34.873,41 23.733,42 21.531,43 3.2,44 4.316}
{0 CHEMBL2113691,1 11.292,2 40,3 40,4 1.009,5 1.129,6 0.741,7 0.679,8 395.23,9 14.3,10 16,11 35,13 16,14 23,16 37,17 14,20 11,21 3,24 14,25 7,26 1,27 1,28 5,29 1,32 21,34 1,35 2.9,36 0.108,37 4,38 31,39 35.323,40 39.498,41 25.949,42 23.773,43 2.9,44 4.738}
{0 CHEMBL2113692,1 10.469,2 38.5,3 43.6,4 1,5 1.133,6 0.725,7 0.657,8 408.28,9 15.4,10 16,11 39,13 16,14 24,16 41,17 15,20 11,21 4,24 17,25 7,26 1,27 1,28 6,32 22,34 1,36 0.098,37 4,38 32,39 38.982,40 44.202,41 28.262,42 25.606,43 2.6,44 4.824}
{0 CHEMBL2113693,1 10.951,2 38.9,3 41.7,4 1.003,5 1.133,6 0.736,7 0.669,8 394.25,9 16.7,10 16,11 36,13 16,14 23,16 38,17 14,20 11,21 3,24 15,25 7,26 1,27 1,28 6,32 21,34 1,36 0.105,37 4,38 31,39 36.098,40 40.786,41 26.5,42 24.079,43 2.8,44 6.011}
{0 CHEMBL2113694,1 11.538,2 39.1,3 37,4 1.029,5 1.137,6 0.733,7 0.691,8 530.76,9 13,10 16,11 46,13 17,14 32,16 49,17 18,18 1,20 12,21 6,22 1,23 1,24 17,25 11,26 2,27 1,28 6,29 2,32 29,34 3,35 4.3,36 0.102,37 5,38 41,39 47.356,40 52.319,41 33.728,42 31.773,43 6.5,44 4.75}
{0 CHEMBL2113695,1 8.841,2 33.7,3 50,4 0.997,5 1.127,6 0.711,7 0.629,8 760.3,9 5.8,10 16,11 86,13 16,14 47,16 90,17 29,18 1,20 11,21 18,24 43,25 14,26 4,27 1,28 5,29 5,32 43,34 2,35 5.8,36 0.089,37 8,38 55,39 85.767,40 96.955,41 61.16,42 54.131,43 2.3,44 4.883}
{0 CHEMBL2113696,1 8.41,2 39.1,3 41.3,4 1.017,5 1.136,6 0.677,7 0.654,8 386.88,9 13,10 16,11 46,13 17,14 30,16 49,17 18,18 1,20 12,21 6,22 1,24 19,25 9,26 1,28 6,29 2,32 27,34 1,35 4.3,36 0.102,37 5,38 39,39 46.774,40 52.259,41 31.131,42 30.073,43 2.2,44 4.51}
{0 CHEMBL2113697,1 11.45,2 35.8,3 37.7,4 1.034,5 1.131,6 0.728,7 0.684,8 606.87,9 11.3,10 16,11 53,13 19,14 36,16 56,17 19,18 1,20 12,21 7,22 3,24 20,25 14,26 3,27 1,28 6,29 5,31 1,32 33,34 2,35 9.4,36 0.125,37 7,38 47,39 54.785,40 59.943,41 38.563,42 36.248,43 3.8,44 5.138}
{0 CHEMBL2113698,1 11.537,2 37.5,3 35.4,4 1.029,5 1.138,6 0.735,7 0.696,8 553.79,9 18.8,10 16,11 48,13 19,14 34,16 51,17 18,18 1,20 12,21 6,22 3,24 17,25 13,26 2,27 1,28 9,29 2,32 31,34 2,35 4.2,36 0.118,37 6,38 45,39 49.382,40 54.644,41 35.284,42 33.401,43 4.2,44 5.221}
{0 CHEMBL2113699,1 10.977,2 38.5,3 38.5,4 1.027,5 1.131,6 0.72,7 0.68,8 570.81,9 11.5,10 16,11 52,13 18,14 35,16 55,17 20,18 1,20 13,21 7,22 2,24 20,25 12,26 2,27 1,28 6,29 4,32 32,34 2,35 7.7,36 0.127,37 7,38 45,39 53.382,40 58.814,41 37.46,42 35.346,43 3.8,44 7.204}
{0 CHEMBL2113700,1 11.522,2 39.4,3 39.4,4 1.006,5 1.132,6 0.75,7 0.683,8 380.22,9 18.2,10 16,11 33,13 16,14 22,16 35,17 13,20 11,21 2,24 13,25 7,26 1,27 1,28 6,32 20,34 1,36 0.086,37 3,38 30,39 33.214,40 37.371,41 24.739,42 22.552,43 3,44 4.397}
{0 CHEMBL2113701,1 12.226,2 39.6,3 33.3,4 1.035,5 1.123,6 0.762,7 0.718,8 586.83,9 12.5,10 16,11 48,13 18,14 36,16 52,17 19,18 1,20 13,21 6,22 2,24 16,25 13,26 3,27 1,28 6,29 4,31 1,32 32,34 2,35 8.3,36 0.096,37 5,38 46,39 49.691,40 53.903,41 36.585,42 34.48,43 4.2,44 7.914}
{0 CHEMBL2113702,1 12.892,2 41.9,3 35.5,4 1.014,5 1.123,6 0.793,7 0.721,8 399.64,9 16.1,10 16,11 31,13 16,14 22,16 33,17 13,18 1,20 11,21 2,24 11,25 7,26 2,27 1,28 5,32 20,34 2,36 0.091,37 3,38 30,39 31.436,40 34.817,41 24.591,42 22.359,43 6.5,44 4.292}
{0 CHEMBL2113703,1 11.25,2 38.3,3 38.3,4 1.025,5 1.132,6 0.729,7 0.683,8 528.77,9 12.8,10 16,11 47,13 17,14 32,16 50,17 18,18 1,20 12,21 6,22 1,24 18,25 11,26 2,27 1,28 6,29 3,32 29,34 2,35 6.4,36 0.1,37 5,38 41,39 48.171,40 53.189,41 34.245,42 32.105,43 4.3,44 7.483}
{0 CHEMBL2181972,1 8.509,2 33.3,3 38.9,4 1.04,5 1.152,6 0.636,7 0.642,8 306.32,9 16.7,10 10,11 36,13 11,14 24,16 38,17 12,19 1,20 5,21 6,24 14,25 10,28 6,29 4,32 22,33 1,35 11.1,36 0.079,37 3,38 31,39 37.454,40 41.488,41 22.898,42 23.095,44 5}
{0 CHEMBL2181974,1 8.04,2 47.7,3 40,4 1.012,5 1.111,6 0.69,7 0.672,8 522.59,9 3.1,10 18,11 65,13 25,14 42,16 68,17 31,19 2,20 24,21 5,22 6,24 26,25 8,28 2,29 6,32 39,33 1,35 9.2,36 0.118,37 8,38 59,39 65.771,40 72.235,41 44.875,42 43.653,44 5.415}
{0 CHEMBL2181975,1 8.904,2 39.3,3 39.3,4 1.02,5 1.125,6 0.701,7 0.671,8 249.32,9 10.7,10 11,11 28,13 12,14 18,16 29,17 11,20 9,21 2,22 1,24 11,25 6,26 1,28 3,29 2,31 1,32 17,35 7.1,36 0.103,37 3,38 24.5,39 28.571,40 31.495,41 19.619,42 18.788,44 5}
{0 CHEMBL2181976,1 8.402,2 47.8,3 39.1,4 1,5 1.109,6 0.727,7 0.689,8 386.51,9 8.7,10 23,11 46,13 24,14 31,16 49,17 22,20 20,21 2,22 1,24 18,25 6,26 1,28 4,29 1,31 1,32 28,35 2.2,36 0.082,37 4,38 43.5,39 45.996,40 51.029,41 33.455,42 31.675,44 8.796}
{0 CHEMBL218326,1 8.509,2 36,3 38,4 1.033,5 1.148,6 0.654,7 0.654,8 425.46,9 18,10 21,11 50,13 21,14 35,16 54,17 18,20 12,21 6,24 19,25 13,28 9,29 4,32 31,35 8,36 0.093,37 5,38 45.5,39 51.643,40 57.398,41 32.676,42 32.686,44 5}
{0 CHEMBL218505,1 7.911,2 36.1,3 42.6,4 1.023,5 1.144,6 0.642,7 0.631,8 482.56,9 13.1,10 21,11 61,13 21,14 39,16 65,17 22,20 13,21 9,24 26,25 13,28 8,29 5,32 35,35 8.2,36 0.123,37 8,38 49.5,39 62.403,40 69.77,41 39.171,42 38.486,44 5}
{0 CHEMBL219256,1 7.553,2 33.3,3 45.6,4 1.019,5 1.15,6 0.627,7 0.61,8 430.53,9 14,10 15,11 57,13 15,14 35,16 61,17 19,20 7,21 12,24 26,25 12,28 8,29 4,32 31,35 7,36 0.098,37 6,38 42.5,39 58.076,40 65.561,41 35.716,42 34.772,44 6.506}
{0 CHEMBL236757,1 8.303,2 29.4,3 41.2,4 1.043,5 1.161,6 0.615,7 0.62,8 282.3,9 17.6,10 10,11 34,13 10,14 22,16 36,17 10,20 5,21 5,24 14,25 10,28 6,29 4,32 20,35 11.8,36 0.083,37 3,38 27,39 35.454,40 39.488,41 20.898,42 21.095,44 4.772}
{0 CHEMBL251997,1 7.997,2 33.3,3 45.8,4 1.023,5 1.146,6 0.637,7 0.615,8 383.88,9 10.4,10 10,11 48,13 10,14 29,16 51,17 16,18 1,20 5,21 11,24 22,25 10,26 1,28 5,29 4,32 26,34 1,35 8.3,36 0.078,37 4,38 34,39 49.094,40 55.01,41 30.557,42 29.535,43 2.1,44 5.301}
{0 CHEMBL257833,1 8.293,2 40,3 41.5,4 1.02,5 1.132,6 0.67,7 0.651,8 539.04,9 9.2,10 16,11 65,13 19,14 42,16 69,17 26,18 1,19 2,20 13,21 11,22 2,24 27,25 12,26 1,28 6,29 5,32 38,33 1,34 1,35 7.7,36 0.116,37 8,38 54,39 66.291,40 73.548,41 43.54,42 42.325,43 1.5,44 7.177}
{0 CHEMBL261482,1 8.214,2 33.3,3 41,4 1.034,5 1.151,6 0.632,7 0.631,8 320.35,9 15.4,10 10,11 39,13 11,14 26,16 42,17 13,20 6,21 7,22 1,24 16,25 10,28 6,29 4,32 23,35 10.3,36 0.071,37 3,38 32,39 40.338,40 44.903,41 24.659,42 24.622,44 5.796}
{0 CHEMBL265096,1 8.04,2 47.7,3 40,4 1.012,5 1.111,6 0.69,7 0.672,8 522.59,9 3.1,10 18,11 65,13 25,14 42,16 68,17 31,19 2,20 24,21 5,22 6,24 26,25 8,28 2,29 6,32 39,33 1,35 9.2,36 0.118,37 8,38 59,39 65.771,40 72.235,41 44.875,42 43.653,44 5.415}
{0 CHEMBL265587,1 8.887,2 33.3,3 38.6,4 1.042,5 1.145,6 0.653,7 0.65,8 506.56,9 14,10 16,11 57,13 20,14 38,16 60,17 19,20 13,21 6,22 4,24 22,25 16,26 1,28 8,29 7,31 1,32 35,35 12.3,36 0.1,37 6,38 50,39 59.367,40 65.279,41 37.205,42 37.049,44 8.012}
{0 CHEMBL27041,1 7.729,2 38,3 44,4 1.02,5 1.136,6 0.643,7 0.628,8 386.45,9 8,10 11,11 50,13 14,14 30,16 52,17 19,20 12,21 7,22 3,24 22,25 9,28 4,29 5,32 28,35 10,36 0.154,37 8,38 38.5,39 50.996,40 56.777,41 32.148,42 31.401,44 4.121}
{0 CHEMBL273094,1 7.264,2 35.6,3 47.5,4 1.011,5 1.142,6 0.631,7 0.606,8 428.55,9 10.2,10 11,11 59,13 14,14 33,16 61,17 21,20 12,21 9,22 3,24 28,25 10,28 6,29 4,32 31,35 6.8,36 0.164,37 10,38 41.5,39 59.64,40 67.395,41 37.228,42 35.782,44 4.538}
{0 CHEMBL27376,1 10.879,2 39.2,3 39.2,4 1.021,5 1.129,6 0.726,7 0.679,8 554.81,9 11.8,10 16,11 51,13 17,14 35,16 55,17 20,18 1,20 12,21 8,22 1,24 20,25 11,26 2,27 1,28 6,29 3,32 31,34 2,35 5.9,36 0.091,37 5,38 44,39 52.054,40 57.604,41 37.006,42 34.632,43 3.9,44 8.959}
{0 CHEMBL277800,1 9.797,2 32.3,3 35.5,4 1.06,5 1.163,6 0.653,7 0.664,8 303.71,9 16.1,10 10,11 31,13 10,14 22,16 33,17 10,18 1,20 5,21 5,23 1,24 11,25 10,26 1,28 5,29 3,32 20,34 2,35 9.7,36 0.061,37 2,38 27,39 32.862,40 36.064,41 20.233,42 20.569,43 6.5,44 4.084}
{0 CHEMBL278932,1 7.56,2 36.7,3 44.9,4 1.014,5 1.142,6 0.643,7 0.622,8 370.46,9 12.2,10 16,11 49,13 16,14 30,16 52,17 18,20 11,21 7,24 22,25 9,28 6,29 3,32 27,35 6.1,36 0.096,37 5,38 38,39 49.662,40 55.94,41 31.489,42 30.487,44 4.228}
{0 CHEMBL279158,1 6.976,2 37.3,3 49.2,4 1.002,5 1.137,6 0.636,7 0.603,8 411.56,9 8.5,10 16,11 59,13 16,14 33,16 62,17 22,20 12,21 10,24 29,25 8,28 5,29 3,32 30,35 5.1,36 0.113,37 7,38 41,39 59.094,40 67.102,41 37.529,42 35.573,44 4.152}
{0 CHEMBL279898,1 8.093,2 33.3,3 41.7,4 1.03,5 1.152,6 0.634,7 0.629,8 194.22,9 16.7,10 5,11 24,13 7,14 15,16 25,17 8,20 5,21 3,22 2,24 10,25 6,28 4,29 2,32 14,35 8.3,36 0.08,37 2,38 19.5,39 24.713,40 27.658,41 15.216,42 15.096,44 4.187}
{0 CHEMBL283057,1 8.605,2 34.1,3 41.5,4 1.03,5 1.148,6 0.654,7 0.641,8 352.82,9 14.6,10 10,11 41,13 11,14 27,16 44,17 14,18 1,20 6,21 8,22 1,24 17,25 10,26 1,28 6,29 3,32 24,34 1,35 7.3,36 0.068,37 3,38 33,39 42.218,40 47.053,41 26.824,42 26.261,43 2.4,44 6.796}
{0 CHEMBL284969,1 8.219,2 33.3,3 44.4,4 1.027,5 1.147,6 0.64,7 0.622,8 369.85,9 11.1,10 10,11 45,13 10,14 28,16 48,17 15,18 1,20 5,21 10,24 20,25 10,26 1,28 5,29 4,32 25,34 1,35 8.9,36 0.083,37 4,38 33,39 46.211,40 51.595,41 28.796,42 28.008,43 2.2,44 6.625}
{0 CHEMBL285819,1 9.429,2 31.3,3 37.5,4 1.052,5 1.154,6 0.648,7 0.653,8 301.72,9 15.6,10 10,11 32,13 10,14 22,16 34,17 10,18 1,20 5,21 5,24 12,25 10,26 1,28 5,29 4,32 20,34 1,35 12.5,36 0.059,37 2,38 27,39 33.676,40 36.934,41 20.75,42 20.901,43 3.1,44 5.61}
{0 CHEMBL294463,1 8.05,2 38,3 44,4 1.015,5 1.13,6 0.667,7 0.637,8 402.52,9 8,10 11,11 50,13 14,14 30,16 52,17 19,20 12,21 7,22 3,24 22,25 9,26 1,28 4,29 4,31 1,32 28,35 8,36 0.154,37 8,38 38.5,39 50.745,40 56.488,41 33.341,42 31.873,44 5.169}
{0 CHEMBL302376,1 8.07,2 30.3,3 42.4,4 1.034,5 1.16,6 0.619,7 0.618,8 266.3,9 18.2,10 10,11 33,13 10,14 21,16 35,17 10,20 5,21 5,24 14,25 9,28 6,29 3,32 19,35 9.1,36 0.057,37 2,38 26,39 34.127,40 38.279,41 20.443,42 20.38,44 8}
{0 CHEMBL307199,1 11.505,2 37.8,3 37.8,4 1.031,5 1.131,6 0.727,7 0.684,8 517.74,9 11.1,10 16,11 45,13 16,14 31,16 48,17 17,18 1,20 11,21 6,24 17,25 11,26 2,27 1,28 5,29 4,32 28,34 2,35 8.9,36 0.104,37 5,38 39,39 46.396,40 50.9,41 32.693,42 30.798,43 4.4,44 8.796}
{0 CHEMBL312989,1 9.069,2 47.2,3 38.9,4 1.018,5 1.109,6 0.718,7 0.69,8 652.98,9 1.4,10 18,11 72,13 24,14 47,16 75,17 34,18 3,19 2,20 25,21 7,22 5,24 28,25 10,26 3,28 1,29 6,32 44,33 1,34 3,35 8.3,36 0.133,37 10,38 63,39 73.291,40 79.815,41 51.727,42 49.695,43 4.2,44 4.886}
{0 CHEMBL313459,1 8.267,2 48.5,3 39.4,4 1.02,5 1.124,6 0.686,7 0.673,8 545.59,9 1.5,10 18,11 66,13 23,14 43,16 69,17 32,19 2,20 24,21 6,22 4,23 3,24 26,25 8,28 1,29 4,32 40,33 1,34 3,35 6.1,36 0.101,37 7,38 58,39 67.32,40 74.168,41 45.296,42 44.406,43 4.5,44 5.523}
{0 CHEMBL313864,1 8.476,2 50,3 36.7,4 1.015,5 1.121,6 0.707,7 0.692,8 254.28,9 6.7,10 17,11 30,13 17,14 21,16 32,17 15,20 14,21 1,23 1,24 11,25 4,28 2,29 1,32 19,34 1,35 3.3,36 0.031,37 1,38 29.5,39 30.462,40 33.622,41 21.21,42 20.775,43 3.3,44 5.215}
{0 CHEMBL315984,1 7.199,2 44.8,3 46.6,4 0.998,5 1.116,6 0.668,7 0.633,8 417.54,9 1.7,10 12,11 58,13 17,14 33,16 60,17 26,20 20,21 6,22 5,24 27,25 5,28 1,29 4,32 31,35 6.9,36 0.133,37 8,38 44,39 57.898,40 64.734,41 38.722,42 36.729,44 5.381}
{0 CHEMBL316630,1 8.79,2 46.9,3 34.4,4 1.026,5 1.118,6 0.701,7 0.697,8 281.29,9 9.4,10 17,11 32,13 19,14 23,16 34,17 15,20 14,21 1,22 2,24 11,25 6,28 3,29 3,32 21,35 9.4,36 0.059,37 2,38 33.5,39 32.822,40 35.784,41 22.426,42 22.316,44 5}
{0 CHEMBL319580,1 7.585,2 48.5,3 42.4,4 0.995,5 1.112,6 0.698,7 0.664,8 250.32,9 6.1,10 17,11 33,13 17,14 21,16 35,17 16,20 14,21 2,24 14,25 3,28 2,29 1,32 19,35 3,36 0.057,37 2,38 29.5,39 32.833,40 36.697,41 23.034,42 21.918,44 5}
{0 CHEMBL320786,1 7.459,2 40,3 45,4 1.006,5 1.133,6 0.657,7 0.63,8 298.38,9 10,10 11,11 40,13 13,14 24,16 42,17 16,20 11,21 5,22 2,24 18,25 6,28 4,29 2,32 22,35 5,36 0.119,37 5,38 31.5,39 40.247,40 45.318,41 26.262,42 25.203,44 4.13}
{0 CHEMBL321845,1 7.285,2 41.2,3 49,4 0.995,5 1.118,6 0.67,7 0.621,8 371.54,9 2,10 12,11 51,13 14,14 27,16 52,17 21,20 13,21 8,22 2,24 25,25 5,26 1,28 1,29 3,31 1,32 26,35 5.9,36 0.173,37 9,38 35,39 50.763,40 57.029,41 34.154,42 31.675,44 6.387}
{0 CHEMBL322332,1 7.436,2 47.5,3 44.3,4 0.998,5 1.11,6 0.684,7 0.651,8 453.57,9 1.6,10 18,11 61,13 21,14 37,16 64,17 29,19 2,20 19,21 8,22 2,24 27,25 5,28 1,29 4,32 34,33 1,35 6.6,36 0.125,37 8,38 50,39 60.898,40 67.734,41 41.722,42 39.729,44 5.721}
{0 CHEMBL327554,1 7.328,2 47.8,3 44.9,4 0.995,5 1.11,6 0.685,7 0.649,8 505.65,9 1.4,10 18,11 69,13 23,14 41,16 72,17 33,19 2,20 24,21 7,22 4,24 31,25 5,28 1,29 4,32 38,33 1,35 5.8,36 0.125,37 9,38 56,39 68.665,40 76.564,41 47.245,42 44.783,44 5.86}
{0 CHEMBL328214,1 8.138,2 48.4,3 38.7,4 1.009,5 1.113,6 0.701,7 0.681,8 252.29,9 6.5,10 12,11 31,13 14,14 21,16 33,17 15,20 14,21 1,22 2,24 12,25 4,28 2,29 2,32 19,35 6.5,36 0.03,37 1,38 29,39 31.276,40 34.491,41 21.727,42 21.106,44 5}
{0 CHEMBL328334,1 8.429,2 48.4,3 35.5,4 1.005,5 1.121,6 0.72,7 0.7,8 261.31,9 16.1,10 17,11 31,13 19,14 22,16 33,17 15,20 14,21 1,22 2,24 11,25 5,28 5,32 20,36 0.061,37 2,38 32.5,39 31.16,40 34.737,41 22.313,42 21.687,44 5}
{0 CHEMBL329293,1 8.412,2 50,3 40,4 0.99,5 1.1,6 0.749,7 0.695,8 252.36,9 6.7,10 17,11 30,13 17,14 20,16 32,17 15,20 14,21 1,24 12,25 3,26 1,28 2,31 1,32 18,36 0.031,37 1,38 28.5,39 29.698,40 32.993,41 22.466,42 20.864,44 5}
{0 CHEMBL329294,1 8.138,2 48.4,3 38.7,4 1.009,5 1.113,6 0.701,7 0.681,8 252.29,9 6.5,10 17,11 31,13 17,14 21,16 33,17 15,20 14,21 1,24 12,25 4,28 2,29 2,32 19,35 6.5,36 0.061,37 2,38 29.5,39 31.276,40 34.491,41 21.727,42 21.106,44 5}
{0 CHEMBL329342,1 8.04,2 47.7,3 40,4 1.012,5 1.111,6 0.69,7 0.672,8 522.59,9 3.1,10 18,11 65,13 25,14 42,16 68,17 31,19 2,20 24,21 5,22 6,24 26,25 8,28 2,29 6,32 39,33 1,35 9.2,36 0.118,37 8,38 59,39 65.771,40 72.235,41 44.875,42 43.653,44 5.295}
{0 CHEMBL331372,1 7.686,2 35.4,3 44.6,4 1.021,5 1.143,6 0.633,7 0.619,8 499.59,9 10.8,10 16,11 65,13 18,14 39,16 68,17 23,20 13,21 10,22 2,24 29,25 13,28 7,29 6,32 36,35 9.2,36 0.147,37 10,38 49,39 66.396,40 74.312,41 41.142,42 40.233,44 6.234}
{0 CHEMBL331382,1 7.738,2 37.5,3 43.8,4 1.018,5 1.139,6 0.645,7 0.629,8 371.44,9 10.4,10 16,11 48,13 16,14 30,16 51,17 18,20 11,21 7,24 21,25 9,28 5,29 4,32 27,35 8.3,36 0.098,37 5,38 38,39 48.887,40 54.651,41 30.938,42 30.181,44 6.444}
{0 CHEMBL335334,1 8.723,2 38.7,3 45.2,4 1.01,5 1.109,6 0.709,7 0.652,8 270.4,10 5,11 31,13 7,14 18,16 32,17 12,20 6,21 6,22 2,24 14,25 5,26 2,29 3,31 2,32 17,35 9.7,36 0.125,37 4,38 22.5,39 31.32,40 34.375,41 21.989,42 20.206,44 4.818}
{0 CHEMBL336968,1 9.098,2 45.7,3 40,4 1.009,5 1.096,6 0.743,7 0.692,8 318.44,10 11,11 35,13 13,14 23,16 37,17 16,20 12,21 4,22 2,24 14,25 5,26 2,29 3,31 2,32 21,35 8.6,36 0.108,37 4,38 30.5,39 35.32,40 38.375,41 25.989,42 24.206,44 4.377}
{0 CHEMBL337243,1 8.255,2 36.4,3 48.5,4 1.006,5 1.115,6 0.689,7 0.628,8 272.42,10 5,11 33,13 6,14 18,16 34,17 12,20 5,21 7,22 1,24 16,25 5,26 2,29 3,31 2,32 17,35 9.1,36 0.118,37 4,38 21.5,39 33.204,40 36.79,41 22.75,42 20.733,44 4.812}
{0 CHEMBL338352,1 8.07,2 30.3,3 42.4,4 1.034,5 1.16,6 0.619,7 0.618,8 266.3,9 18.2,10 10,11 33,13 10,14 21,16 35,17 10,20 5,21 5,24 14,25 9,28 6,29 3,32 19,35 9.1,36 0.057,37 2,38 26,39 34.127,40 38.279,41 20.443,42 20.38,44 7.076}
{0 CHEMBL342873,1 10.995,2 39.6,3 39.6,4 1.02,5 1.127,6 0.729,7 0.679,8 527.78,9 10.4,10 16,11 48,13 16,14 33,16 52,17 19,18 1,20 11,21 8,24 19,25 10,26 2,27 1,28 5,29 3,32 29,34 2,35 6.3,36 0.096,37 5,38 41,39 48.953,40 54.106,41 35,42 32.61,43 4.2,44 8.712}
{0 CHEMBL344187,1 10.66,2 38.8,3 38.8,4 1.024,5 1.132,6 0.711,7 0.673,8 522.34,9 12.2,10 16,11 49,13 17,14 34,16 53,17 19,20 12,21 7,22 1,24 19,25 11,26 1,27 1,28 6,29 4,32 30,34 1,35 8.2,36 0.075,37 4,38 43,39 50.174,40 55.454,41 34.841,42 32.992,43 2,44 7.301}
{0 CHEMBL348766,1 7.728,2 43.5,3 45.7,4 1,5 1.113,6 0.688,7 0.644,8 355.49,9 2.2,10 12,11 46,13 14,14 27,16 48,17 20,20 13,21 7,22 2,24 21,25 5,26 1,28 1,29 3,31 1,32 25,35 6.5,36 0.125,37 6,38 35,39 45.996,40 51.199,41 31.631,42 29.621,44 5.588}
{0 CHEMBL355370,1 10.275,2 41.1,3 39.3,4 1.021,5 1.125,6 0.711,7 0.674,8 575.4,9 8.9,10 17,11 56,13 20,14 37,16 59,17 23,20 18,21 5,22 3,24 22,25 11,26 1,27 1,28 5,29 5,32 34,34 1,35 8.9,36 0.136,37 8,38 48.5,39 57.167,40 62.996,41 39.813,42 37.739,43 1.8,44 5.932}
{0 CHEMBL364671,1 8.145,2 36.4,3 40.9,4 1.028,5 1.144,6 0.646,7 0.64,8 358.4,9 13.6,10 16,11 44,13 16,14 29,16 47,17 16,20 10,21 6,24 18,25 10,28 6,29 4,32 26,35 9.1,36 0.106,37 5,38 37,39 45.222,40 50.319,41 28.421,42 28.148,44 6.538}
{0 CHEMBL368872,1 8.11,2 42.2,3 42.2,4 1.01,5 1.127,6 0.682,7 0.655,8 519.05,9 9.4,10 22,11 64,13 23,14 42,16 69,17 27,18 1,20 18,21 9,22 1,24 27,25 10,26 1,28 6,29 3,32 37,34 1,35 4.7,36 0.101,37 7,38 54,39 64.636,40 72.129,41 43.631,42 41.895,43 1.6,44 8}
{0 CHEMBL373065,1 10.957,2 37.3,3 39.2,4 1.027,5 1.134,6 0.715,7 0.673,8 558.8,9 11.8,10 16,11 51,13 17,14 34,16 54,17 19,18 1,20 12,21 7,22 1,24 20,25 12,26 2,27 1,28 6,29 4,32 31,34 2,35 7.8,36 0.093,37 5,38 43,39 52.382,40 57.814,41 36.46,42 34.346,43 3.9,44 6.544}
{0 CHEMBL374645,1 7.798,2 30.8,3 44.2,4 1.027,5 1.158,6 0.619,7 0.61,8 405.48,9 17.3,10 15,11 52,13 15,14 32,16 55,17 16,20 7,21 9,24 23,25 13,28 9,29 4,32 29,35 7.7,36 0.109,37 6,38 39.5,39 53.411,40 60.229,41 32.199,42 31.739,44 5}
{0 CHEMBL377291,1 8.297,2 34.6,3 40.4,4 1.036,5 1.147,6 0.636,7 0.637,8 431.46,9 13.5,10 15,11 52,13 17,14 34,16 55,17 18,20 11,21 7,22 2,24 21,25 13,28 7,29 6,32 31,35 11.5,36 0.109,37 6,38 43.5,39 53.862,40 59.651,41 33.097,42 33.126,44 6.147}
{0 CHEMBL379472,1 10.418,2 35.7,3 39.3,4 1.032,5 1.139,6 0.688,7 0.66,8 583.39,9 12.5,10 16,11 56,13 18,14 37,16 59,17 20,20 13,21 7,22 2,24 22,25 14,26 1,27 1,28 7,29 6,32 34,34 1,35 10.7,36 0.102,37 6,38 47,39 57.814,40 63.787,41 38.517,42 36.97,43 1.8,44 6.6}
{0 CHEMBL380914,1 9.545,2 36.5,3 36.5,4 1.042,5 1.141,6 0.68,7 0.674,8 496.35,9 13.5,10 16,11 52,13 18,14 36,16 55,17 19,18 2,20 13,21 6,22 2,24 19,25 14,26 2,28 7,29 5,32 33,34 2,35 9.6,36 0.091,37 5,38 46,39 54.182,40 59.33,41 35.358,42 35.066,43 3.8,44 7.11}
{0 CHEMBL380943,1 8.843,2 36.4,3 37.9,4 1.036,5 1.139,6 0.666,7 0.661,8 583.65,9 13.6,10 22,11 66,13 26,14 45,16 70,17 24,20 18,21 6,22 4,24 25,25 17,26 1,28 9,29 7,31 1,32 41,35 10.6,36 0.114,37 8,38 60,39 68.353,40 75.192,41 43.972,42 43.598,44 7.267}
{0 CHEMBL381917,1 8.782,2 42.2,3 37.5,4 1.025,5 1.128,6 0.688,7 0.676,8 562.03,9 10.9,10 22,11 64,13 25,14 44,16 68,17 27,18 1,19 2,20 19,21 6,22 2,24 24,25 13,26 1,28 7,29 5,32 40,33 1,34 1,35 7.8,36 0.074,37 5,38 59,39 65.625,40 72.216,41 44.023,42 43.292,43 1.6,44 6.214}
{0 CHEMBL382787,1 8.994,2 35.4,3 36.9,4 1.04,5 1.143,6 0.665,7 0.663,8 584.64,9 15.4,10 22,11 65,13 26,14 45,16 69,17 23,20 17,21 6,22 4,24 24,25 18,26 1,28 10,29 7,31 1,32 41,35 10.8,36 0.116,37 8,38 60,39 67.571,40 74.275,41 43.216,42 43.092,44 6.393}
{0 CHEMBL383144,1 8.037,2 31.4,3 42.9,4 1.035,5 1.154,6 0.619,7 0.617,8 281.31,9 14.3,10 10,11 35,13 10,14 22,16 37,17 11,20 5,21 6,24 15,25 9,28 5,29 4,32 20,35 11.4,36 0.081,37 3,38 27,39 36.236,40 40.405,41 21.654,42 21.6,44 5.194}
{0 CHEMBL383268,1 7.854,2 36.2,3 43.1,4 1.022,5 1.143,6 0.641,7 0.629,8 455.53,9 12.1,10 16,11 58,13 18,14 36,16 61,17 21,20 13,21 8,22 2,24 25,25 12,28 7,29 5,32 33,35 8.6,36 0.115,37 7,38 46,39 59.302,40 66.272,41 37.165,42 36.465,44 6.827}
{0 CHEMBL383548,1 9.346,2 37.7,3 37.7,4 1.037,5 1.137,6 0.681,7 0.671,8 495.36,9 11.3,10 16,11 53,13 18,14 36,16 56,17 20,18 2,20 13,21 7,22 2,24 20,25 13,26 2,28 6,29 5,32 33,34 2,35 9.4,36 0.107,37 6,38 46,39 54.964,40 60.246,41 36.114,42 35.572,43 3.8,44 6.777}
{0 CHEMBL388757,1 7.942,2 37.8,3 42.2,4 1.022,5 1.139,6 0.648,7 0.637,8 357.41,9 11.1,10 16,11 45,13 16,14 29,16 48,17 17,20 11,21 6,24 19,25 9,28 5,29 4,32 26,35 8.9,36 0.104,37 5,38 37,39 46.003,40 51.236,41 29.176,42 28.654,44 6.921}
{0 CHEMBL400189,1 7.28,2 33.3,3 47.9,4 1.016,5 1.147,6 0.619,7 0.598,8 349.44,9 10.4,10 10,11 48,13 10,14 28,16 51,17 16,20 5,21 11,24 23,25 9,28 5,29 4,32 25,35 8.3,36 0.078,37 4,38 33,39 48.771,40 55.066,41 29.699,42 28.707,44 6.68}
{0 CHEMBL405982,1 8.471,2 46.3,3 37.3,4 1.025,5 1.115,6 0.687,7 0.68,8 567.59,9 4.5,10 18,11 67,13 27,14 45,16 70,17 31,19 2,20 24,21 5,22 8,24 25,25 11,28 3,29 8,32 42,33 1,35 11.9,36 0.129,37 9,38 64,39 68.643,40 74.737,41 46.028,42 45.577,44 5.295}
{0 CHEMBL410873,1 7.471,2 34.6,3 46.2,4 1.017,5 1.145,6 0.629,7 0.61,8 388.48,9 11.5,10 10,11 52,13 12,14 30,16 54,17 18,19 2,20 6,21 10,22 1,24 24,25 10,28 6,29 4,32 28,33 1,35 7.7,36 0.093,37 5,38 38,39 52.872,40 59.564,41 32.705,42 31.729,44 7.592}
{0 CHEMBL411066,1 8.271,2 35.7,3 40.5,4 1.034,5 1.144,6 0.64,7 0.639,8 347.37,9 11.9,10 15,11 42,13 15,14 28,16 45,17 15,20 9,21 6,24 17,25 10,28 5,29 5,32 25,35 11.9,36 0.111,37 5,38 35.5,39 43.447,40 48.03,41 26.869,42 26.842,44 6.13}
{0 CHEMBL413046,1 7.681,2 37.1,3 44.3,4 1.018,5 1.139,6 0.641,7 0.625,8 537.64,9 10,10 16,11 70,13 19,14 42,16 73,17 26,19 2,20 13,21 11,22 2,24 31,25 13,28 7,29 6,32 39,33 1,35 8.6,36 0.11,37 8,38 54,39 71.28,40 79.727,41 44.904,42 43.76,44 6.676}
{0 CHEMBL415697,1 7.343,2 47.2,3 44.4,4 0.992,5 1.114,6 0.689,7 0.651,8 264.35,9 5.6,10 12,11 36,13 14,14 22,16 38,17 17,20 14,21 3,22 2,24 16,25 3,28 2,29 1,32 20,35 2.8,36 0.053,37 2,38 30,39 35.716,40 40.112,41 24.796,42 23.445,44 5}
{0 CHEMBL418101,1 6.501,2 36.8,3 52.6,4 0.992,5 1.137,6 0.629,7 0.585,8 370.55,9 7,10 5,11 57,13 7,14 31,16 61,17 21,20 5,21 16,22 2,24 30,25 6,28 4,29 2,32 27,35 3.5,36 0.082,37 5,38 35.5,39 56.549,40 64.81,41 35.83,42 33.364,44 5}
{0 CHEMBL418333,1 8.351,2 36.2,3 42.6,4 1.025,5 1.134,6 0.66,7 0.64,8 392.48,9 8.5,10 11,11 47,13 15,14 29,16 49,17 17,20 11,21 6,22 4,24 20,25 10,26 1,28 4,29 5,31 1,32 27,35 10.6,36 0.122,37 6,38 38.5,39 48.189,40 53.282,41 31.034,42 30.061,44 4.045}
{0 CHEMBL419403,1 7.552,2 35.7,3 45.7,4 1.02,5 1.141,6 0.63,7 0.614,8 528.63,9 8.6,10 11,11 70,13 16,14 40,16 72,17 25,20 14,21 11,22 5,24 32,25 13,28 6,29 7,32 38,35 10,36 0.194,37 14,38 50.5,39 71.389,40 79.853,41 44.114,42 42.98,44 4.391}
{0 CHEMBL420705,1 7.558,2 37.3,3 45.1,4 1.015,5 1.139,6 0.641,7 0.622,8 385.47,9 9.8,10 16,11 51,13 16,14 31,16 54,17 19,20 11,21 8,24 23,25 9,28 5,29 4,32 28,35 7.8,36 0.111,37 6,38 39,39 51.771,40 58.066,41 32.699,42 31.707,44 6.619}
{0 CHEMBL422184,1 7.326,2 40.4,3 49.1,4 1.001,5 1.126,6 0.66,7 0.616,8 417.59,9 1.8,10 12,11 57,13 14,14 30,16 58,17 23,20 13,21 10,22 2,23 1,24 28,25 6,26 1,28 1,29 3,31 1,32 29,34 1,35 5.3,36 0.19,37 11,38 38,39 57.043,40 64.199,41 37.614,42 35.111,43 1.8,44 6.291}
{0 CHEMBL423239,1 7.748,2 39.1,3 43.5,4 1.017,5 1.134,6 0.651,7 0.634,8 356.42,9 8.7,10 11,11 46,13 14,14 28,16 48,17 18,20 12,21 6,22 3,24 20,25 8,28 4,29 4,32 26,35 8.7,36 0.125,37 6,38 36.5,39 46.785,40 52.152,41 29.932,42 29.159,44 4.346}
{0 CHEMBL425741,1 9.957,2 39.2,3 39.2,4 1.024,5 1.132,6 0.7,7 0.673,8 507.81,9 11.8,10 16,11 51,13 17,14 35,15 1,16 55,17 20,18 1,20 12,21 8,22 1,24 20,25 11,26 2,28 6,29 3,32 31,34 2,35 5.9,36 0.091,37 5,38 44,39 52.214,40 57.725,41 35.699,42 34.34,43 3.9,44 9.119}
{0 CHEMBL426669,1 8.249,2 38,3 40,4 1.029,5 1.139,6 0.653,7 0.648,8 412.45,9 12,10 16,11 50,13 18,14 33,16 53,17 19,20 13,21 6,22 2,24 20,25 11,28 6,29 5,32 30,35 10,36 0.094,37 5,38 43,39 51.433,40 56.943,41 32.637,42 32.39,44 6.084}
{0 CHEMBL426847,1 8.027,2 36.4,3 41.8,4 1.026,5 1.143,6 0.644,7 0.635,8 441.5,9 12.7,10 16,11 55,13 18,14 35,16 58,17 20,20 13,21 7,22 2,24 23,25 12,28 7,29 5,32 32,35 9.1,36 0.103,37 6,38 45,39 56.418,40 62.857,41 35.404,42 34.938,44 7.417}
{0 CHEMBL431733,1 11.349,2 37.5,3 37.5,4 1.031,5 1.133,6 0.723,7 0.684,8 544.77,9 12.5,10 16,11 48,13 17,14 33,16 51,17 18,18 1,20 12,21 6,22 1,24 18,25 12,26 2,27 1,28 6,29 4,32 30,34 2,35 8.3,36 0.098,37 5,38 42,39 49.498,40 54.398,41 34.699,42 32.82,43 4.2,44 9.264}
{0 CHEMBL434328,1 8.761,2 41.5,3 40,4 1.02,5 1.127,6 0.691,7 0.668,8 569.49,9 9.2,10 22,11 65,13 23,14 44,16 70,17 27,18 2,20 18,21 9,22 1,24 26,25 12,26 2,28 6,29 4,32 39,34 2,35 6.2,36 0.114,37 8,38 56,39 66.287,40 73.283,41 44.943,42 43.437,43 3.1,44 7.959}
{0 CHEMBL436485,1 11.272,2 37.3,3 39.2,4 1.022,5 1.128,6 0.738,7 0.683,8 574.87,9 11.8,10 16,11 51,13 17,14 34,16 54,17 19,18 1,20 12,21 7,22 1,24 20,25 12,26 3,27 1,28 6,29 3,31 1,32 31,34 2,35 5.9,36 0.093,37 5,38 43,39 52.131,40 57.524,41 37.654,42 34.819,43 3.9,44 6.493}
{0 CHEMBL437315,1 9.266,2 31.9,3 36.2,4 1.046,5 1.151,6 0.66,7 0.661,8 435.48,9 19.1,10 15,11 47,13 17,14 33,16 50,17 15,20 9,21 6,22 2,24 17,25 15,26 1,28 9,29 5,31 1,32 30,35 10.6,36 0.1,37 5,38 42.5,39 49.164,40 54.113,41 31.017,42 31.061,44 5.256}
{0 CHEMBL437344,1 8.12,2 37,3 40.7,4 1.024,5 1.143,6 0.652,7 0.643,8 438.5,9 14.8,10 21,11 54,13 21,14 36,16 58,17 20,20 13,21 7,24 22,25 12,28 8,29 4,32 32,35 7.4,36 0.103,37 6,38 46.5,39 55.309,40 61.73,41 35.193,42 34.718,44 5.747}
{0 CHEMBL437503,1 7.854,2 36.2,3 43.1,4 1.022,5 1.143,6 0.641,7 0.629,8 455.53,9 12.1,10 16,11 58,13 18,14 36,16 61,17 21,20 13,21 8,22 2,24 25,25 12,28 7,29 5,32 33,35 8.6,36 0.098,37 6,38 46,39 59.302,40 66.272,41 37.165,42 36.465,44 6.496}
{0 CHEMBL437506,1 8.938,2 38,3 38,4 1.035,5 1.138,6 0.67,7 0.664,8 446.89,9 12,10 16,11 50,13 18,14 34,16 53,17 19,18 1,20 13,21 6,22 2,24 19,25 12,26 1,28 6,29 5,32 31,34 1,35 10,36 0.094,37 5,38 44,39 51.756,40 56.887,41 33.494,42 33.218,43 2,44 6.123}
{0 CHEMBL439976,1 10.996,2 37.5,3 39.6,4 1.02,5 1.135,6 0.725,7 0.675,8 527.79,9 14.6,10 16,11 48,13 17,14 32,16 51,17 18,18 1,20 12,21 6,22 1,24 19,25 11,26 2,27 1,28 7,29 2,32 29,34 2,35 4.2,36 0.098,37 5,38 41,39 48.945,40 54.478,41 34.796,42 32.411,43 4.2,44 5.469}
{0 CHEMBL440720,1 6.797,2 39.3,3 52.5,4 0.989,5 1.123,6 0.653,7 0.599,8 414.64,9 1.6,10 12,11 61,13 14,14 30,16 62,17 24,20 13,21 11,22 2,24 32,25 5,26 1,28 1,29 3,31 1,32 29,35 4.9,36 0.177,37 11,38 38,39 60.356,40 68.482,41 39.819,42 36.518,44 5.371}
{0 CHEMBL443485,1 8.106,2 32.3,3 41.9,4 1.033,5 1.154,6 0.627,7 0.624,8 251.28,9 16.1,10 10,11 31,13 10,14 20,16 33,17 10,20 5,21 5,24 13,25 8,28 5,29 3,32 18,35 9.7,36 0.03,37 1,38 25,39 32.025,40 35.781,41 19.438,42 19.359,44 5.548}
{0 CHEMBL444550,1 10.361,2 37.5,3 41.7,4 1.02,5 1.133,6 0.7,7 0.656,8 497.33,9 10.4,10 16,11 48,13 16,14 31,16 51,17 18,20 11,21 7,24 20,25 10,26 1,27 1,28 5,29 4,32 28,34 1,35 8.3,36 0.098,37 5,38 39,39 48.956,40 54.371,41 33.597,42 31.497,43 2.1,44 5.488}
{0 CHEMBL45891,1 7.28,2 33.3,3 47.9,4 1.016,5 1.147,6 0.619,7 0.598,8 349.44,9 10.4,10 10,11 48,13 10,14 28,16 51,17 16,20 5,21 11,24 23,25 9,28 5,29 4,32 25,35 8.3,36 0.078,37 4,38 33,39 48.771,40 55.066,41 29.699,42 28.707,44 7.602}
{0 CHEMBL464859,1 8.114,2 31.6,3 42.1,4 1.035,5 1.155,6 0.623,7 0.622,8 308.34,9 15.8,10 10,11 38,13 11,14 24,16 40,17 12,20 6,21 6,22 1,24 16,25 10,28 6,29 4,32 22,35 10.5,36 0.075,37 3,38 30,39 39.338,40 43.903,41 23.659,42 23.622,44 6.947}
{0 CHEMBL471144,1 9.361,2 27,3 37.8,4 1.059,5 1.157,6 0.634,7 0.641,8 346.37,9 16.2,10 10,11 37,13 12,14 25,16 39,17 10,20 5,21 5,22 2,24 14,25 13,26 1,28 6,29 6,31 1,32 23,35 16.2,36 0.103,37 4,38 32,39 39.185,40 42.827,41 23.455,42 23.712,44 4.959}
{0 CHEMBL47437,1 10.641,2 39,3 41.5,4 1.008,5 1.132,6 0.725,7 0.666,8 436.29,9 14.6,10 16,11 41,13 17,14 26,16 43,17 16,20 12,21 4,22 1,24 17,25 8,26 1,27 1,28 6,29 1,32 24,34 1,35 2.4,36 0.116,37 5,38 35,39 41.309,40 46.411,41 29.716,42 27.321,43 2.4,44 4.699}
{0 CHEMBL477,1 8.353,2 31.3,3 40.6,4 1.042,5 1.156,6 0.622,7 0.627,8 267.28,9 15.6,10 10,11 32,13 10,14 21,16 34,17 10,20 5,21 5,24 13,25 9,28 5,29 4,32 19,35 12.5,36 0.059,37 2,38 26,39 33.353,40 36.99,41 19.892,42 20.073,44 7}
{0 CHEMBL48461,1 9.568,2 38,3 46,4 0.999,5 1.133,6 0.7,7 0.638,8 478.38,9 12,10 16,11 50,13 17,14 29,16 52,17 19,20 12,21 7,22 1,24 23,25 8,26 1,27 1,28 6,29 1,32 27,34 1,35 2,36 0.154,37 8,38 38,39 49.96,40 56.657,41 35,42 31.901,43 2,44 4.721}
{0 CHEMBL494086,1 9.217,2 39,3 39,4 1.021,5 1.128,6 0.708,7 0.676,8 377.89,9 12.2,10 16,11 41,13 16,14 28,16 44,17 16,18 1,20 11,21 5,24 16,25 9,26 2,28 5,29 2,31 1,32 25,34 1,35 4.9,36 0.091,37 4,38 36,39 41.865,40 46.266,41 29.012,42 27.712,43 2.4,44 7.77}
{0 CHEMBL49758,1 12.36,2 42.1,3 34.2,4 1.026,5 1.122,6 0.77,7 0.719,8 469.69,9 13.2,10 16,11 38,13 17,14 28,16 41,17 16,18 1,20 12,21 4,22 1,24 13,25 9,26 2,27 1,28 5,29 2,32 25,34 2,35 5.3,36 0.073,37 3,38 37,39 38.974,40 42.651,41 29.262,42 27.315,43 5.3,44 5.46}
{0 CHEMBL49843,1 8.009,2 37.5,3 41.7,4 1.023,5 1.14,6 0.65,7 0.639,8 384.44,9 12.5,10 16,11 48,13 17,14 31,16 51,17 18,20 12,21 6,22 1,24 20,25 10,28 6,29 4,32 28,35 8.3,36 0.098,37 5,38 40,39 49.105,40 54.734,41 31.182,42 30.675,44 7.796}
{0 CHEMBL49935,1 7.803,2 32.4,3 44.1,4 1.027,5 1.153,6 0.624,7 0.614,8 265.31,9 14.7,10 10,11 34,13 10,14 21,16 36,17 11,20 5,21 6,24 15,25 8,28 5,29 3,32 19,35 8.8,36 0.056,37 2,38 26,39 34.909,40 39.196,41 21.199,42 20.885,44 4.699}
{0 CHEMBL500569,1 11.447,2 39,3 39,4 1.015,5 1.123,6 0.752,7 0.688,8 469.34,9 12.2,10 16,11 41,13 16,14 28,16 44,17 16,20 11,21 5,24 16,25 9,26 2,27 1,28 5,29 2,31 1,32 25,34 1,35 4.9,36 0.091,37 4,38 36,39 41.611,40 46.042,41 30.813,42 28.201,43 2.4,44 7.319}
{0 CHEMBL509055,1 8.816,2 39,3 39,4 1.026,5 1.138,6 0.685,7 0.665,8 361.44,9 12.2,10 16,11 41,13 16,14 28,16 44,17 16,20 11,21 5,23 1,24 16,25 9,26 1,28 5,29 2,31 1,32 25,34 1,35 4.9,36 0.091,37 4,38 36,39 42.054,40 46.661,41 28.091,42 27.268,43 2.4,44 7.009}
{0 CHEMBL519809,1 8.409,2 31.4,3 40,4 1.042,5 1.157,6 0.626,7 0.631,8 294.31,9 17.1,10 10,11 35,13 11,14 23,16 37,17 11,20 6,21 5,22 1,24 14,25 10,28 6,29 4,32 21,35 11.4,36 0.054,37 2,38 29,39 36.454,40 40.488,41 21.898,42 22.095,44 7.143}
{0 CHEMBL522152,1 10.967,2 37.5,3 39.6,4 1.019,5 1.128,6 0.73,7 0.676,8 526.4,9 12.5,10 16,11 48,13 17,14 32,16 51,17 18,20 12,21 6,22 1,24 19,25 11,26 2,27 1,28 6,29 3,31 1,32 29,34 1,35 6.3,36 0.098,37 5,38 41,39 48.923,40 54.165,41 35.034,42 32.464,43 2.1,44 8.73}
{0 CHEMBL522856,1 10.301,2 39,3 39,4 1.019,5 1.126,6 0.72,7 0.681,8 422.34,9 12.2,10 16,11 41,13 16,14 28,15 1,16 44,17 16,20 11,21 5,24 16,25 9,26 2,28 5,29 2,31 1,32 25,34 1,35 4.9,36 0.091,37 4,38 36,39 41.771,40 46.163,41 29.506,42 27.91,43 2.4,44 8.201}
{0 CHEMBL561976,1 10.749,2 39,3 36.6,4 1.033,5 1.132,6 0.711,7 0.689,8 440.71,9 12.2,10 16,11 41,13 16,14 29,15 1,16 44,17 16,18 1,20 11,21 5,24 15,25 10,26 2,28 5,29 3,32 26,34 2,35 7.3,36 0.091,37 4,38 37,39 42.345,40 46.397,41 29.171,42 28.265,43 4.9,44 7.082}
{0 CHEMBL573937,1 7.979,2 35.3,3 45.1,4 1.017,5 1.143,6 0.649,7 0.624,8 406.92,9 11.8,10 10,11 51,13 11,14 32,16 55,17 18,18 1,20 6,21 12,22 1,24 23,25 10,26 1,28 6,29 3,32 28,34 1,35 5.9,36 0.073,37 4,38 38,39 51.869,40 58.299,41 33.108,42 31.842,43 2,44 8.237}
{0 CHEMBL574212,1 7.513,2 40,3 46.7,4 1.003,5 1.128,6 0.663,7 0.627,8 1126.92,9 6.7,10 28,11 150,13 38,14 88,16 158,17 60,18 1,19 2,20 33,21 25,22 9,24 70,25 20,26 2,28 10,29 8,31 1,32 80,33 1,34 1,35 5.3,36 0.133,37 21,38 113,39 150.486,40 169.186,41 99.421,42 94.014,43 0.7,44 8.017}
{0 CHEMBL583745,1 7.729,2 37.7,3 45.5,4 1.011,5 1.137,6 0.654,7 0.626,8 595.17,9 10.4,10 16,11 77,13 19,14 46,16 81,17 29,18 1,19 2,20 13,21 14,22 2,24 35,25 13,26 1,28 8,29 4,32 42,33 1,34 1,35 5.2,36 0.136,37 11,38 58,39 77.818,40 87.581,41 50.381,42 48.233,43 1.3,44 8.061}
{0 CHEMBL583862,1 8.451,2 40.9,3 40.9,4 1.015,5 1.131,6 0.685,7 0.66,8 371.86,9 11.4,10 16,11 44,13 16,14 30,16 48,17 18,18 1,20 11,21 7,24 18,25 8,26 1,28 5,29 2,32 26,34 1,35 4.5,36 0.083,37 4,38 38,39 44.673,40 49.761,41 30.125,42 29.052,43 2.3,44 7.693}
{0 CHEMBL603974,1 7.398,2 37,3 46.3,4 1.012,5 1.139,6 0.638,7 0.615,8 399.5,9 9.3,10 16,11 54,13 16,14 32,16 57,17 20,20 11,21 9,24 25,25 9,28 5,29 4,32 29,35 7.4,36 0.105,37 6,38 40,39 54.654,40 61.481,41 34.461,42 33.234,44 6.174}
{0 CHEMBL603977,1 7.398,2 37,3 46.3,4 1.012,5 1.139,6 0.638,7 0.615,8 399.5,9 9.3,10 16,11 54,13 16,14 32,16 57,17 20,20 11,21 9,24 25,25 9,28 5,29 4,32 29,35 7.4,36 0.105,37 6,38 40,39 54.654,40 61.481,41 34.461,42 33.234,44 5}
{0 CHEMBL605034,1 10.282,2 37.3,3 41.2,4 1.021,5 1.135,6 0.698,7 0.657,8 524.36,9 11.8,10 16,11 51,13 17,14 33,16 54,17 19,20 12,21 7,22 1,24 21,25 11,26 1,27 1,28 6,29 4,32 30,34 1,35 7.8,36 0.093,37 5,38 42,39 52.058,40 57.87,41 35.603,42 33.519,43 2,44 6.495}
{0 CHEMBL605646,1 7.398,2 37,3 46.3,4 1.012,5 1.139,6 0.638,7 0.615,8 399.5,9 9.3,10 16,11 54,13 16,14 32,16 57,17 20,20 11,21 9,24 25,25 9,28 5,29 4,32 29,35 7.4,36 0.105,37 6,38 40,39 54.654,40 61.481,41 34.461,42 33.234,44 5.21}
{0 CHEMBL605866,1 8.759,2 31.3,3 37.5,4 1.049,5 1.159,6 0.629,7 0.643,8 280.28,9 18.8,10 10,11 32,13 11,14 22,16 34,17 10,20 6,21 4,22 1,24 12,25 10,28 6,29 4,32 20,35 12.5,36 0.059,37 2,38 28,39 33.571,40 37.073,41 20.136,42 20.568,44 5.851}
{0 CHEMBL606061,1 7.28,2 33.3,3 47.9,4 1.016,5 1.147,6 0.619,7 0.598,8 349.44,9 10.4,10 10,11 48,13 10,14 28,16 51,17 16,20 5,21 11,24 23,25 9,28 5,29 4,32 25,35 8.3,36 0.078,37 4,38 33,39 48.771,40 55.066,41 29.699,42 28.707,44 5.287}
{0 CHEMBL607784,1 6.948,2 32.3,3 50.8,4 1.013,5 1.147,6 0.606,7 0.581,8 451.59,9 7.7,10 5,11 65,13 8,14 34,16 67,17 21,20 6,21 15,22 3,24 33,25 11,28 5,29 6,32 32,35 9.2,36 0.149,37 10,38 39.5,39 65.843,40 74.561,41 39.415,42 37.771,44 5.58}
{0 CHEMBL607941,1 9.009,2 36.4,3 36.4,4 1.054,5 1.161,6 0.64,7 0.656,8 495.47,9 12.7,10 16,11 55,13 18,14 38,16 58,17 20,20 13,21 7,22 2,23 3,24 20,25 15,28 7,29 5,32 35,34 3,35 9.1,36 0.086,37 5,38 48,39 57.956,40 63.876,41 35.216,42 36.088,43 5.5,44 7.114}
{0 CHEMBL608026,1 8.151,2 31,3 42.9,4 1.045,5 1.152,6 0.608,7 0.614,8 342.35,9 9.5,10 5,11 42,13 7,14 26,16 44,17 13,20 5,21 8,22 2,24 18,25 11,28 4,29 7,32 24,35 16.7,36 0.068,37 3,38 30.5,39 43.884,40 48.365,41 25.534,42 25.777,44 7.131}
{0 CHEMBL608044,1 7.039,2 35,3 50.5,4 1.003,5 1.139,6 0.633,7 0.595,8 725.03,9 7.8,10 21,11 103,13 24,14 55,16 107,17 36,20 16,21 20,22 3,24 52,25 15,26 1,28 8,29 6,31 1,32 51,35 5.8,36 0.187,37 20,38 68.5,39 103.294,40 117.297,41 65.171,42 61.237,44 5.602}
{0 CHEMBL608207,1 9.009,2 36.4,3 36.4,4 1.054,5 1.161,6 0.64,7 0.656,8 495.47,9 12.7,10 16,11 55,13 18,14 38,16 58,17 20,20 13,21 7,22 2,23 3,24 20,25 15,28 7,29 5,32 35,34 3,35 9.1,36 0.086,37 5,38 48,39 57.956,40 63.876,41 35.216,42 36.088,43 5.5,44 6.824}
{0 CHEMBL608327,1 11.349,2 37.5,3 37.5,4 1.031,5 1.133,6 0.723,7 0.684,8 544.77,9 12.5,10 16,11 48,13 17,14 33,16 51,17 18,18 1,20 12,21 6,22 1,24 18,25 12,26 2,27 1,28 6,29 4,32 30,34 2,35 8.3,36 0.098,37 5,38 42,39 49.498,40 54.398,41 34.699,42 32.82,43 4.2,44 9.481}
{0 CHEMBL608647,1 7.319,2 32.8,3 48.3,4 1.022,5 1.146,6 0.609,7 0.593,8 424.51,9 6.9,10 5,11 58,13 8,14 32,16 60,17 19,20 6,21 13,22 3,24 28,25 11,28 4,29 7,32 30,35 12.1,36 0.15,37 9,38 37.5,39 59.302,40 66.441,41 35.341,42 34.411,44 5.491}
{0 CHEMBL608652,1 8.933,2 34.6,3 38.5,4 1.042,5 1.14,6 0.658,7 0.654,8 464.51,9 11.5,10 16,11 52,13 19,14 35,16 55,17 18,20 12,21 6,22 3,24 20,25 14,26 1,28 6,29 7,31 1,32 32,35 13.5,36 0.109,37 6,38 46,39 54.164,40 59.282,41 34.193,42 34.007,44 5.347}
{0 CHEMBL608653,1 7.639,2 37,3 44.4,4 1.016,5 1.14,6 0.643,7 0.625,8 412.5,9 11.1,10 16,11 54,13 17,14 33,16 57,17 20,20 12,21 8,22 1,24 24,25 10,28 6,29 4,32 30,35 7.4,36 0.105,37 6,38 42,39 54.872,40 61.564,41 34.705,42 33.729,44 6.306}
{0 CHEMBL608657,1 7.312,2 32.1,3 48.2,4 1.021,5 1.148,6 0.609,7 0.593,8 409.5,9 8.9,10 5,11 56,13 8,14 31,16 58,17 18,20 6,21 12,22 3,24 27,25 11,28 5,29 6,32 29,35 10.7,36 0.138,37 8,38 36.5,39 57.192,40 64.315,41 34.131,42 33.191,44 4.815}
{0 CHEMBL608761,1 8.316,2 30.8,3 41,4 1.043,5 1.157,6 0.618,7 0.624,8 324.34,9 15.4,10 10,11 39,13 12,14 25,16 41,17 12,20 6,21 6,22 2,24 16,25 11,28 6,29 5,32 23,35 12.8,36 0.073,37 3,38 32,39 40.665,40 45.113,41 24.114,42 24.336,44 6.33}
{0 CHEMBL608762,1 8.871,2 37.3,3 37.3,4 1.05,5 1.16,6 0.642,7 0.654,8 452.44,9 11.8,10 16,11 51,13 17,14 35,16 54,17 19,20 12,21 7,22 1,23 3,24 19,25 13,28 6,29 4,32 32,34 3,35 7.8,36 0.093,37 5,38 44,39 53.527,40 59.168,41 32.756,42 33.352,43 5.9,44 7.509}
{0 CHEMBL608945,1 7.553,2 36.8,3 45.6,4 1.019,5 1.137,6 0.634,7 0.617,8 430.51,9 7,10 11,11 57,13 13,14 34,16 60,17 21,20 11,21 10,22 2,24 26,25 10,28 4,29 6,32 31,35 10.5,36 0.117,37 7,38 41.5,39 58.091,40 64.817,41 36.125,42 35.169,44 4.889}
{0 CHEMBL608956,1 7.367,2 32.1,3 50,4 1.013,5 1.142,6 0.626,7 0.592,8 412.57,9 7.1,10 5,11 56,13 7,14 30,16 58,17 18,20 5,21 13,22 2,24 28,25 10,26 1,28 4,29 5,31 1,32 28,35 8.9,36 0.138,37 8,38 34.5,39 56.723,40 63.943,41 35.08,42 33.168,44 5.854}
{0 CHEMBL609225,1 7.878,2 35.5,3 44.7,4 1.018,5 1.139,6 0.649,7 0.625,8 598.76,9 10.5,10 21,11 76,13 24,14 46,16 80,17 27,20 16,21 11,22 3,24 34,25 15,26 1,28 8,29 6,31 1,32 42,35 7.9,36 0.138,37 11,38 59.5,39 77.341,40 86.56,41 49.318,42 47.495,44 5.745}
{0 CHEMBL609240,1 7.178,2 32.2,3 49.2,4 1.018,5 1.148,6 0.608,7 0.588,8 423.53,9 8.5,10 5,11 59,13 8,14 32,16 61,17 19,20 6,21 13,22 3,24 29,25 11,28 5,29 6,32 30,35 10.2,36 0.131,37 8,38 37.5,39 60.076,40 67.73,41 35.892,42 34.717,44 6.64}
{0 CHEMBL609245,1 7.989,2 36,3 42,4 1.024,5 1.145,6 0.644,7 0.634,8 399.46,9 14,10 16,11 50,13 17,14 32,16 53,17 18,20 12,21 6,22 1,24 21,25 11,28 7,29 4,32 29,35 8,36 0.094,37 5,38 41,39 51.207,40 57.232,41 32.188,42 31.697,44 7.854}
{0 CHEMBL609340,1 8.994,2 35.4,3 36.9,4 1.04,5 1.143,6 0.665,7 0.663,8 584.64,9 15.4,10 22,11 65,13 26,14 45,16 69,17 23,20 17,21 6,22 4,24 24,25 18,26 1,28 10,29 7,31 1,32 41,35 10.8,36 0.116,37 8,38 60,39 67.571,40 74.275,41 43.216,42 43.092,44 6.393}
{0 CHEMBL609525,1 7.757,2 35.4,3 45.6,4 1.016,5 1.139,6 0.647,7 0.621,8 612.79,9 10.1,10 21,11 79,13 24,14 47,16 83,17 28,20 16,21 12,22 3,24 36,25 15,26 1,28 8,29 6,31 1,32 43,35 7.6,36 0.145,37 12,38 60.5,39 80.225,40 89.976,41 51.08,42 49.022,44 5.699}
{0 CHEMBL609534,1 10.247,2 36,3 42,4 1.021,5 1.137,6 0.692,7 0.65,8 512.35,9 12,10 16,11 50,13 16,14 32,16 53,17 18,20 11,21 7,24 21,25 11,26 1,27 1,28 6,29 4,32 29,34 1,35 8,36 0.113,37 6,38 40,39 51.058,40 56.87,41 34.603,42 32.519,43 2,44 7.81}
{0 CHEMBL609639,1 8.231,2 35.2,3 40.7,4 1.033,5 1.146,6 0.638,7 0.637,8 444.48,9 13,10 16,11 54,13 19,14 35,16 57,17 19,20 12,21 7,22 3,24 22,25 13,28 7,29 6,32 32,35 11.1,36 0.105,37 6,38 46,39 55.803,40 61.859,41 34.477,42 34.39,44 7.569}
{0 CHEMBL609642,1 9.653,2 37.5,3 39.6,4 1.028,5 1.137,6 0.678,7 0.66,8 463.33,9 12.5,10 16,11 48,13 17,14 32,15 1,16 51,17 18,20 12,21 6,22 1,24 19,25 11,26 1,28 6,29 4,32 29,34 1,35 8.3,36 0.098,37 5,38 41,39 49.334,40 54.575,41 32.534,42 31.7,43 2.1,44 7.921}
{0 CHEMBL609830,1 7.989,2 36,3 42,4 1.024,5 1.145,6 0.644,7 0.634,8 399.46,9 14,10 16,11 50,13 17,14 32,16 53,17 18,20 12,21 6,22 1,24 21,25 11,28 7,29 4,32 29,35 8,36 0.094,37 5,38 41,39 51.207,40 57.232,41 32.188,42 31.697,44 7.553}
{0 CHEMBL609834,1 8.36,2 32.4,3 40.5,4 1.042,5 1.152,6 0.625,7 0.63,8 309.32,9 13.5,10 10,11 37,13 11,14 24,16 39,17 12,20 6,21 6,22 1,24 15,25 10,28 5,29 5,32 22,35 13.5,36 0.077,37 3,38 30,39 38.564,40 42.615,41 23.108,42 23.315,44 5.301}
{0 CHEMBL609922,1 8.231,2 35.2,3 40.7,4 1.033,5 1.146,6 0.638,7 0.637,8 444.48,9 13,10 16,11 54,13 19,14 35,16 57,17 19,20 12,21 7,22 3,24 22,25 13,28 7,29 6,32 32,35 11.1,36 0.105,37 6,38 46,39 55.803,40 61.859,41 34.477,42 34.39,44 7.222}
{0 CHEMBL609923,1 8.727,2 37.5,3 39.6,4 1.03,5 1.139,6 0.667,7 0.656,8 418.88,9 12.5,10 16,11 48,13 17,14 32,16 51,17 18,18 1,20 12,21 6,22 1,24 19,25 11,26 1,28 6,29 4,32 29,34 1,35 8.3,36 0.098,37 5,38 41,39 49.429,40 54.678,41 32.04,42 31.503,43 2.1,44 7.77}
{0 CHEMBL610095,1 6.848,2 32.3,3 51.6,4 1.012,5 1.146,6 0.603,7 0.577,8 424.56,9 6.5,10 5,11 62,13 7,14 32,16 64,17 20,20 5,21 15,22 2,24 32,25 10,28 4,29 6,32 30,35 9.7,36 0.156,37 10,38 36.5,39 62.741,40 71.062,41 37.409,42 35.75,44 5.318}
{0 CHEMBL610112,1 8.904,2 34.8,3 37.9,4 1.041,5 1.142,6 0.658,7 0.656,8 587.64,9 13.6,10 21,11 66,13 25,14 45,16 70,17 23,20 16,21 7,22 4,24 25,25 18,26 1,28 9,29 8,31 1,32 41,35 12.1,36 0.114,37 8,38 59.5,39 68.68,40 75.402,41 43.426,42 43.312,44 6.81}
{0 CHEMBL610121,1 7.185,2 35.1,3 49.5,4 1.005,5 1.139,6 0.636,7 0.6,8 696.97,9 8.2,10 21,11 97,13 24,14 53,16 101,17 34,20 16,21 18,22 3,24 48,25 15,26 1,28 8,29 6,31 1,32 49,35 6.2,36 0.178,37 18,38 66.5,39 97.527,40 110.467,41 61.648,42 58.183,44 5.959}
{0 CHEMBL610143,1 8.589,2 36,3 38,4 1.04,5 1.145,6 0.647,7 0.652,8 429.44,9 14,10 16,11 50,13 19,14 34,16 53,17 18,20 12,21 6,22 3,24 19,25 13,28 7,29 6,32 31,35 12,36 0.113,37 6,38 45,39 51.978,40 57.236,41 32.335,42 32.599,44 7.721}
{0 CHEMBL610326,1 8.843,2 36.4,3 37.9,4 1.036,5 1.139,6 0.666,7 0.661,8 583.65,9 13.6,10 22,11 66,13 26,14 45,16 70,17 24,20 18,21 6,22 4,24 25,25 17,26 1,28 9,29 7,31 1,32 41,35 10.6,36 0.114,37 8,38 60,39 68.353,40 75.192,41 43.972,42 43.598,44 7.267}
{0 CHEMBL610394,1 7.832,2 35.5,3 43.5,4 1.024,5 1.143,6 0.635,7 0.624,8 485.56,9 11.3,10 16,11 62,13 18,14 38,16 65,17 22,20 13,21 9,22 2,24 27,25 13,28 7,29 6,32 35,35 9.7,36 0.123,37 8,38 48,39 63.512,40 70.897,41 39.381,42 38.707,44 6.971}
{0 CHEMBL610417,1 7.08,2 32.1,3 50,4 1.017,5 1.147,6 0.605,7 0.584,8 396.5,9 7.1,10 5,11 56,13 7,14 30,16 58,17 18,20 5,21 13,22 2,24 28,25 10,28 4,29 6,32 28,35 10.7,36 0.138,37 8,38 34.5,39 56.974,40 64.232,41 33.887,42 32.696,44 5.22}
{0 CHEMBL610426,1 9.36,2 37.3,3 41.2,4 1.024,5 1.137,6 0.672,7 0.652,8 477.36,9 11.8,10 16,11 51,13 17,14 33,15 1,16 54,17 19,20 12,21 7,22 1,24 21,25 11,26 1,28 6,29 4,32 30,34 1,35 7.8,36 0.111,37 6,38 42,39 52.218,40 57.991,41 34.296,42 33.227,43 2,44 8.553}
{0 CHEMBL610429,1 8.933,2 34.6,3 38.5,4 1.042,5 1.14,6 0.658,7 0.654,8 464.51,9 11.5,10 16,11 52,13 19,14 35,16 55,17 18,20 12,21 6,22 3,24 20,25 14,26 1,28 6,29 7,31 1,32 32,35 13.5,36 0.109,37 6,38 46,39 54.164,40 59.282,41 34.193,42 34.007,44 5.883}
{0 CHEMBL610662,1 6.756,2 32.4,3 52.1,4 1.009,5 1.146,6 0.605,7 0.575,8 479.65,9 7,10 5,11 71,13 8,14 36,16 73,17 23,20 6,21 17,22 3,24 37,25 11,28 5,29 6,32 34,35 8.5,36 0.164,37 12,38 41.5,39 71.61,40 81.391,41 42.938,42 40.825,44 4.987}
{0 CHEMBL610675,1 8.219,2 31.6,3 42.1,4 1.044,5 1.151,6 0.614,7 0.619,8 312.32,9 10.5,10 5,11 38,13 7,14 24,16 40,17 12,20 5,21 7,22 2,24 16,25 10,28 4,29 6,32 22,35 15.8,36 0.05,37 2,38 28.5,39 39.673,40 43.741,41 23.318,42 23.535,44 4.049}
{0 CHEMBL610700,1 7.937,2 37.5,3 42.9,4 1.027,5 1.136,6 0.64,7 0.631,8 444.49,9 7.1,10 11,11 56,13 14,14 35,16 59,17 21,20 12,21 9,22 3,24 24,25 11,28 4,29 7,32 32,35 12.5,36 0.102,37 6,38 43.5,39 57.534,40 63.611,41 35.818,42 35.357,44 4.907}
{0 CHEMBL610702,1 7.369,2 32,3 48,4 1.024,5 1.148,6 0.607,7 0.593,8 368.44,9 8,10 5,11 50,13 7,14 28,16 52,17 16,20 5,21 11,22 2,24 24,25 10,28 4,29 6,32 26,35 12,36 0.115,37 6,38 32.5,39 51.207,40 57.402,41 30.364,42 29.642,44 4.09}
{0 CHEMBL610710,1 7.894,2 38.5,3 42.3,4 1.019,5 1.137,6 0.653,7 0.639,8 410.48,9 11.5,10 16,11 52,13 17,14 34,16 56,17 20,20 12,21 8,22 1,24 22,25 10,28 6,29 4,32 30,35 7.7,36 0.107,37 6,38 43,39 52.989,40 59.149,41 33.943,42 33.202,44 6.987}
{0 CHEMBL610956,1 7.057,2 32.3,3 50,4 1.015,5 1.148,6 0.607,7 0.585,8 437.56,9 8.1,10 5,11 62,13 8,14 33,16 64,17 20,20 6,21 14,22 3,24 31,25 11,28 5,29 6,32 31,35 9.7,36 0.141,37 9,38 38.5,39 62.96,40 71.146,41 37.654,42 36.244,44 6.22}
{0 CHEMBL610996,1 8.027,2 36.4,3 41.8,4 1.026,5 1.143,6 0.644,7 0.635,8 441.5,9 12.7,10 16,11 55,13 18,14 35,16 58,17 20,20 13,21 7,22 2,24 23,25 12,28 7,29 5,32 32,35 9.1,36 0.103,37 6,38 45,39 56.418,40 62.857,41 35.404,42 34.938,44 7.383}
{0 CHEMBL611272,1 7.351,2 35.2,3 48.4,4 1.008,5 1.139,6 0.639,7 0.606,8 668.91,9 8.8,10 21,11 91,13 24,14 51,16 95,17 32,20 16,21 16,22 3,24 44,25 15,26 1,28 8,29 6,31 1,32 47,35 6.6,36 0.168,37 16,38 64.5,39 91.759,40 103.636,41 58.125,42 55.129,44 6.599}
{0 CHEMBL611863,1 6.656,2 32.4,3 52.9,4 1.007,5 1.145,6 0.602,7 0.571,8 452.62,9 5.9,10 5,11 68,13 7,14 34,16 70,17 22,20 5,21 17,22 2,24 36,25 10,28 4,29 6,32 32,35 8.8,36 0.171,37 12,38 38.5,39 68.509,40 77.893,41 40.932,42 38.803,44 4.367}
{0 CHEMBL612203,1 7.539,2 35.3,3 47.1,4 1.012,5 1.139,6 0.642,7 0.613,8 640.85,9 9.4,10 21,11 85,13 24,14 49,16 89,17 30,20 16,21 14,22 3,24 40,25 15,26 1,28 8,29 6,31 1,32 45,35 7.1,36 0.157,37 14,38 62.5,39 85.992,40 96.806,41 54.603,42 52.076,44 5.444}
{0 CHEMBL66393,1 10.74,2 37.8,3 40,4 1.024,5 1.132,6 0.707,7 0.666,8 483.3,9 11.1,10 16,11 45,13 16,14 30,16 48,17 17,20 11,21 6,24 18,25 10,26 1,27 1,28 5,29 4,32 27,34 1,35 8.9,36 0.104,37 5,38 38,39 46.073,40 50.956,41 31.835,42 29.971,43 2.2,44 7.991}
{0 CHEMBL68738,1 7.454,2 33.3,3 46.7,4 1.02,5 1.148,6 0.621,7 0.604,8 335.41,9 11.1,10 10,11 45,13 10,14 27,16 48,17 15,20 5,21 10,24 21,25 9,28 5,29 4,32 24,35 8.9,36 0.083,37 4,38 32,39 45.887,40 51.651,41 27.938,42 27.181,44 6.585}
{0 CHEMBL72862,1 7.384,2 43.8,3 45.8,4 1.007,5 1.117,6 0.659,7 0.633,8 354.43,10 12,11 48,13 14,14 28,16 50,17 21,20 15,21 6,22 2,24 22,25 5,29 5,32 26,35 10.4,36 0.14,37 7,38 36,39 48.356,40 53.614,41 31.648,42 30.369,44 4.74}
{0 CHEMBL75126,1 8.903,2 37,3 44.4,4 1.004,5 1.116,6 0.725,7 0.658,8 240.38,9 7.4,10 5,11 27,13 7,14 16,16 28,17 10,20 7,21 3,22 2,24 12,25 5,26 2,28 2,29 1,31 2,32 15,35 3.7,36 0.071,37 2,38 20.5,39 27.102,40 30.122,41 19.568,42 17.766,44 4.883}
{0 CHEMBL76874,1 8.107,2 51.2,3 39,4 1.009,5 1.101,6 0.705,7 0.685,8 332.37,10 16,11 41,13 19,14 28,16 44,17 21,20 19,21 2,22 3,24 16,25 4,29 4,32 25,35 9.8,36 0.091,37 4,38 39,39 41.378,40 45.159,41 28.909,42 28.074,44 4.91}
{0 CHEMBL86377,1 7.449,2 48.5,3 43.9,4 0.997,5 1.108,6 0.689,7 0.655,8 491.62,9 1.5,10 18,11 66,13 23,14 40,16 69,17 32,19 2,20 24,21 6,22 4,24 29,25 5,28 1,29 4,32 37,33 1,35 6.1,36 0.101,37 7,38 55,39 65.781,40 73.149,41 45.483,42 43.256,44 5.772}
{0 CHEMBL86588,1 7.449,2 48.5,3 43.9,4 0.997,5 1.108,6 0.689,7 0.655,8 491.62,9 1.5,10 18,11 66,13 23,14 40,16 69,17 32,19 2,20 24,21 6,22 4,24 29,25 5,28 1,29 4,32 37,33 1,35 6.1,36 0.101,37 7,38 55,39 65.781,40 73.149,41 45.483,42 43.256,44 5.818}
{0 CHEMBL86647,1 9.579,2 49.2,3 41.3,4 0.999,5 1.102,6 0.736,7 0.683,8 603.48,9 1.6,10 18,11 63,13 23,14 40,16 66,17 31,19 2,20 24,21 5,22 4,24 26,25 6,26 1,27 1,28 1,29 4,32 37,33 1,34 1,35 6.3,36 0.106,37 7,38 55,39 62.967,40 69.454,41 46.381,42 43.046,43 1.6,44 5.396}
{0 CHEMBL88147,1 9.392,2 48.8,3 32.6,4 1.021,5 1.115,6 0.735,7 0.721,8 403.85,9 11.6,10 26,11 43,13 27,14 33,16 47,17 21,18 1,20 20,21 1,22 1,24 14,25 8,26 1,28 5,29 2,32 29,34 1,35 4.7,36 0.085,37 4,38 47,39 43.905,40 47.93,41 31.602,42 30.998,43 2.3,44 8}
{0 CHEMBL89093,1 9.081,2 47.5,3 40,4 1.015,5 1.106,6 0.723,7 0.689,8 363.25,10 12,11 40,13 14,14 26,16 42,17 19,18 2,20 15,21 4,22 2,24 16,25 5,26 2,29 3,32 24,34 2,35 7.5,36 0.071,37 3,38 34,39 40.582,40 44.253,41 28.932,42 27.541,43 5,44 5.26}
{0 CHEMBL89803,1 7.449,2 48.5,3 43.9,4 0.997,5 1.108,6 0.689,7 0.655,8 491.62,9 1.5,10 18,11 66,13 23,14 40,16 69,17 32,19 2,20 24,21 6,22 4,24 29,25 5,28 1,29 4,32 37,33 1,35 6.1,36 0.116,37 8,38 55,39 65.781,40 73.149,41 45.483,42 43.256,44 5.879}
{0 CHEMBL89844,1 7.449,2 48.5,3 43.9,4 0.997,5 1.108,6 0.689,7 0.655,8 491.62,9 1.5,10 18,11 66,13 23,14 40,16 69,17 32,19 2,20 24,21 6,22 4,24 29,25 5,28 1,29 4,32 37,33 1,35 6.1,36 0.116,37 8,38 55,39 65.781,40 73.149,41 45.483,42 43.256,44 5.951}
{0 CHEMBL89852,1 7.581,2 49.2,3 42.9,4 0.998,5 1.107,6 0.694,7 0.662,8 477.59,9 1.6,10 18,11 63,13 23,14 39,16 66,17 31,19 2,20 24,21 5,22 4,24 27,25 5,28 1,29 4,32 36,33 1,35 6.3,36 0.106,37 7,38 54,39 62.898,40 69.734,41 43.722,42 41.729,44 5.848}
{0 CHEMBL94538,1 7.586,2 45.5,3 42.4,4 0.995,5 1.123,6 0.692,7 0.658,8 250.33,9 12.1,10 17,11 33,13 17,14 21,16 35,17 15,20 14,21 1,24 14,25 4,28 4,32 19,36 0.057,37 2,38 29.5,39 32.825,40 37.069,41 22.83,42 21.72,44 5}
{0 CHEMBL95384,1 8.476,2 50,3 36.7,4 1.015,5 1.121,6 0.707,7 0.692,8 254.28,9 6.7,10 17,11 30,13 17,14 21,16 32,17 15,20 14,21 1,23 1,24 11,25 4,28 2,29 1,32 19,34 1,35 3.3,36 0.031,37 1,38 29.5,39 30.462,40 33.622,41 21.21,42 20.775,43 3.3,44 5.337}
{0 CHEMBL96576,1 7.81,2 52.5,3 40,4 0.993,5 1.103,6 0.72,7 0.686,8 312.39,9 5,10 23,11 40,13 23,14 27,16 43,17 21,20 20,21 1,24 16,25 3,28 2,29 1,32 24,35 2.5,36 0.07,37 3,38 38.5,39 39.716,40 44.112,41 28.796,42 27.445,44 5}
{0 CHEMBL96617,1 7.08,2 44.2,3 46.5,4 0.988,5 1.124,6 0.677,7 0.635,8 304.43,9 9.3,10 17,11 43,13 17,14 26,16 46,17 19,20 14,21 5,24 20,25 4,28 4,32 23,36 0.043,37 2,38 34.5,39 42.476,40 48.315,41 29.114,42 27.3,44 5}
{0 CHEMBL97037,1 8.232,2 51.9,3 37,4 1.002,5 1.106,6 0.723,7 0.699,8 222.26,9 7.4,10 17,11 27,13 17,14 19,16 29,17 14,20 14,24 10,25 3,28 2,29 1,32 17,35 3.7,36 0.034,37 1,38 27.5,39 27.065,40 29.867,41 19.512,42 18.865,44 5.523}
{0 CHEMBL97337,1 7.591,2 48.4,3 41.9,4 0.991,5 1.115,6 0.704,7 0.668,8 235.31,9 9.7,10 17,11 31,13 17,14 20,16 33,17 15,20 14,21 1,24 13,25 3,28 3,32 18,36 0.03,37 1,38 28.5,39 30.723,40 34.571,41 21.824,42 20.698,44 5}
{0 CHEMBL97344,1 7.596,2 51.7,3 41.4,4 0.987,5 1.106,6 0.718,7 0.679,8 220.29,9 6.9,10 17,11 29,13 17,14 19,16 31,17 15,20 14,21 1,24 12,25 2,28 2,32 17,36 0.032,37 1,38 27.5,39 28.622,40 32.073,41 20.818,42 19.677,44 5}
{0 CHEMBL97549,1 7.876,2 50,3 40,4 0.998,5 1.109,6 0.709,7 0.68,8 236.29,9 6.7,10 17,11 30,13 17,14 20,16 32,17 15,20 14,21 1,24 12,25 3,28 2,29 1,32 18,35 3.3,36 0.031,37 1,38 28.5,39 29.949,40 33.282,41 21.273,42 20.392,44 5.056}
{0 CHEMBL97624,1 6.755,2 44.7,3 48.9,4 0.982,5 1.12,6 0.673,7 0.624,8 317.47,9 6.4,10 17,11 47,13 17,14 27,16 50,17 21,20 14,21 7,24 23,25 3,28 3,32 24,36 0.06,37 3,38 35.5,39 46.141,40 52.647,41 31.631,42 29.332,44 5}
{0 CHEMBL97663,1 7.24,2 42.3,3 46.2,4 0.998,5 1.126,6 0.664,7 0.63,8 376.5,9 7.7,10 17,11 52,13 18,14 31,16 55,17 22,20 15,21 7,22 1,24 24,25 6,28 4,29 2,32 28,35 3.8,36 0.073,37 4,38 40.5,39 51.898,40 58.564,41 34.546,42 32.783,44 5}
{0 CHEMBL97665,1 7.118,2 45.9,3 45.9,4 0.986,5 1.119,6 0.685,7 0.642,8 263.37,9 8.1,10 17,11 37,13 17,14 22,16 39,17 17,20 14,21 3,24 17,25 3,28 3,32 20,36 0.051,37 2,38 30.5,39 36.491,40 41.401,41 25.347,42 23.752,44 5}
{0 CHEMBL97687,1 11.154,2 51.9,3 33.3,4 1.011,5 1.1,6 0.773,7 0.737,8 301.15,9 7.4,10 17,11 27,13 17,14 20,15 1,16 29,17 14,20 14,24 9,25 4,26 1,28 2,29 1,32 18,34 1,35 3.7,36 0.034,37 1,38 28.5,39 27.294,40 29.708,41 20.864,42 19.89,43 3.7,44 5.678}
{0 CHEMBL97757,1 8.898,2 51.9,3 33.3,4 1.021,5 1.119,6 0.72,7 0.713,8 240.25,9 7.4,10 17,11 27,13 17,14 20,16 29,17 14,20 14,23 1,24 9,25 4,28 2,29 1,32 18,34 1,35 3.7,36 0.034,37 1,38 28.5,39 27.578,40 30.207,41 19.449,42 19.248,43 3.7,44 5}
{0 CHEMBL97760,1 9.507,2 51.9,3 33.3,4 1.014,5 1.104,6 0.754,7 0.729,8 256.7,9 7.4,10 17,11 27,13 17,14 20,16 29,17 14,18 1,20 14,24 9,25 4,26 1,28 2,29 1,32 18,34 1,35 3.7,36 0.034,37 1,38 28.5,39 27.389,40 29.811,41 20.369,42 19.692,43 3.7,44 5.678}
{0 CHEMBL97778,1 8.784,2 51.7,3 37.9,4 0.998,5 1.104,6 0.747,7 0.707,8 254.73,9 6.9,10 17,11 29,13 17,14 20,16 31,17 15,18 1,20 14,21 1,24 11,25 3,26 1,28 2,32 18,34 1,36 0.032,37 1,38 28.5,39 28.945,40 32.017,41 21.676,42 20.504,43 3.4,44 5}
{0 CHEMBL97895,1 7.833,2 47.1,3 41.2,4 1.005,5 1.115,6 0.691,7 0.666,8 266.32,9 5.9,10 17,11 34,13 17,14 22,16 36,17 16,20 14,21 2,24 14,25 4,28 2,29 2,32 20,35 5.9,36 0.083,37 3,38 30.5,39 34.16,40 37.907,41 23.489,42 22.633,44 5}
{0 CHEMBL97896,1 8.273,2 52.6,3 36.8,4 1.004,5 1.103,6 0.723,7 0.701,8 314.36,9 5.3,10 23,11 38,13 23,14 27,16 41,17 20,20 20,24 14,25 4,28 2,29 2,32 24,35 5.3,36 0.073,37 3,38 38.5,39 38.16,40 41.907,41 27.489,42 26.633,44 5}
{0 CHEMBL97904,1 8.509,2 50,3 35.7,4 1.014,5 1.11,6 0.713,7 0.699,8 238.26,9 7.1,10 17,11 28,13 17,14 20,16 30,17 14,20 14,24 10,25 4,28 2,29 2,32 18,35 7.1,36 0.033,37 1,38 28.5,39 28.393,40 31.076,41 19.966,42 19.58,44 5}
{0 CHEMBL98227,1 7.833,2 47.1,3 41.2,4 1.005,5 1.115,6 0.691,7 0.666,8 266.32,9 5.9,10 12,11 34,13 14,14 22,16 36,17 16,20 14,21 2,22 2,24 14,25 4,28 2,29 2,32 20,35 5.9,36 0.056,37 2,38 30,39 34.16,40 37.907,41 23.489,42 22.633,44 5}
