{
  "data_features": {
    "feature": [
      {
        "data_type": "nominal",
        "index": "0",
        "is_ignore": "false",
        "is_row_identifier": "true",
        "is_target": "false",
        "name": "molecule_id",
        "nominal_value": [
          "CHEMBL101309",
          "CHEMBL115581",
          "CHEMBL115897",
          "CHEMBL116040",
          "CHEMBL1162998",
          "CHEMBL116649",
          "CHEMBL117447",
          "CHEMBL118305",
          "CHEMBL118883",
          "CHEMBL12019",
          "CHEMBL120901",
          "CHEMBL1229",
          "CHEMBL126075",
          "CHEMBL1473252",
          "CHEMBL1592",
          "CHEMBL1629724",
          "CHEMBL1630808",
          "CHEMBL1630809",
          "CHEMBL1630810",
          "CHEMBL1630811",
          "CHEMBL1630812",
          "CHEMBL1630813",
          "CHEMBL1630814",
          "CHEMBL1630815",
          "CHEMBL1630816",
          "CHEMBL173992",
          "CHEMBL174397",
          "CHEMBL175580",
          "CHEMBL175854",
          "CHEMBL1771",
          "CHEMBL177216",
          "CHEMBL1773",
          "CHEMBL177356",
          "CHEMBL177577",
          "CHEMBL177708",
          "CHEMBL178071",
          "CHEMBL178115",
          "CHEMBL178398",
          "CHEMBL178563",
          "CHEMBL179760",
          "CHEMBL180625",
          "CHEMBL1812847",
          "CHEMBL1812848",
          "CHEMBL1812849",
          "CHEMBL1812850",
          "CHEMBL1812851",
          "CHEMBL1812852",
          "CHEMBL1812853",
          "CHEMBL1812854",
          "CHEMBL1812855",
          "CHEMBL1812856",
          "CHEMBL1812857",
          "CHEMBL1812858",
          "CHEMBL1812859",
          "CHEMBL1812860",
          "CHEMBL1812861",
          "CHEMBL1812862",
          "CHEMBL1812863",
          "CHEMBL1812864",
          "CHEMBL182199",
          "CHEMBL182206",
          "CHEMBL187266",
          "CHEMBL187460",
          "CHEMBL189162",
          "CHEMBL189727",
          "CHEMBL189886",
          "CHEMBL189988",
          "CHEMBL190496",
          "CHEMBL190613",
          "CHEMBL190660",
          "CHEMBL190672",
          "CHEMBL190677",
          "CHEMBL191513",
          "CHEMBL191625",
          "CHEMBL191676",
          "CHEMBL191688",
          "CHEMBL191739",
          "CHEMBL191796",
          "CHEMBL191800",
          "CHEMBL191822",
          "CHEMBL191847",
          "CHEMBL192039",
          "CHEMBL192139",
          "CHEMBL192180",
          "CHEMBL192241",
          "CHEMBL192252",
          "CHEMBL192258",
          "CHEMBL192410",
          "CHEMBL192474",
          "CHEMBL192589",
          "CHEMBL192592",
          "CHEMBL192595",
          "CHEMBL192625",
          "CHEMBL192627",
          "CHEMBL192648",
          "CHEMBL192657",
          "CHEMBL192712",
          "CHEMBL192809",
          "CHEMBL193140",
          "CHEMBL193180",
          "CHEMBL193228",
          "CHEMBL193229",
          "CHEMBL195713",
          "CHEMBL2069132",
          "CHEMBL219633",
          "CHEMBL219658",
          "CHEMBL219675",
          "CHEMBL219818",
          "CHEMBL219880",
          "CHEMBL219942",
          "CHEMBL219953",
          "CHEMBL220125",
          "CHEMBL220379",
          "CHEMBL220449",
          "CHEMBL220556",
          "CHEMBL220629",
          "CHEMBL220679",
          "CHEMBL220686",
          "CHEMBL220687",
          "CHEMBL220729",
          "CHEMBL220731",
          "CHEMBL220770",
          "CHEMBL220784",
          "CHEMBL221362",
          "CHEMBL221512",
          "CHEMBL221669",
          "CHEMBL221830",
          "CHEMBL221873",
          "CHEMBL222149",
          "CHEMBL222190",
          "CHEMBL222292",
          "CHEMBL222644",
          "CHEMBL222660",
          "CHEMBL222711",
          "CHEMBL222712",
          "CHEMBL222752",
          "CHEMBL222795",
          "CHEMBL222849",
          "CHEMBL222851",
          "CHEMBL222891",
          "CHEMBL222988",
          "CHEMBL222989",
          "CHEMBL222999",
          "CHEMBL223000",
          "CHEMBL223001",
          "CHEMBL223039",
          "CHEMBL223254",
          "CHEMBL223406",
          "CHEMBL223785",
          "CHEMBL224822",
          "CHEMBL224884",
          "CHEMBL224988",
          "CHEMBL225169",
          "CHEMBL225175",
          "CHEMBL226938",
          "CHEMBL226990",
          "CHEMBL227046",
          "CHEMBL227075",
          "CHEMBL235287",
          "CHEMBL235288",
          "CHEMBL235289",
          "CHEMBL235290",
          "CHEMBL235490",
          "CHEMBL235503",
          "CHEMBL235504",
          "CHEMBL235931",
          "CHEMBL236337",
          "CHEMBL236340",
          "CHEMBL242067",
          "CHEMBL242287",
          "CHEMBL242288",
          "CHEMBL242296",
          "CHEMBL242506",
          "CHEMBL242721",
          "CHEMBL242722",
          "CHEMBL242768",
          "CHEMBL242930",
          "CHEMBL242931",
          "CHEMBL242932",
          "CHEMBL244213",
          "CHEMBL244425",
          "CHEMBL244426",
          "CHEMBL244427",
          "CHEMBL244428",
          "CHEMBL244630",
          "CHEMBL244631",
          "CHEMBL244632",
          "CHEMBL244633",
          "CHEMBL254426",
          "CHEMBL258820",
          "CHEMBL260535",
          "CHEMBL260747",
          "CHEMBL261172",
          "CHEMBL270284",
          "CHEMBL270373",
          "CHEMBL270374",
          "CHEMBL270375",
          "CHEMBL271380",
          "CHEMBL271382",
          "CHEMBL271389",
          "CHEMBL271789",
          "CHEMBL272038",
          "CHEMBL272111",
          "CHEMBL272228",
          "CHEMBL272830",
          "CHEMBL273139",
          "CHEMBL284028",
          "CHEMBL285678",
          "CHEMBL290634",
          "CHEMBL292454",
          "CHEMBL293277",
          "CHEMBL317094",
          "CHEMBL325480",
          "CHEMBL326294",
          "CHEMBL327012",
          "CHEMBL329187",
          "CHEMBL333636",
          "CHEMBL35925",
          "CHEMBL361170",
          "CHEMBL361529",
          "CHEMBL362705",
          "CHEMBL362996",
          "CHEMBL363186",
          "CHEMBL363535",
          "CHEMBL363855",
          "CHEMBL363919",
          "CHEMBL364588",
          "CHEMBL364729",
          "CHEMBL364734",
          "CHEMBL364893",
          "CHEMBL365129",
          "CHEMBL365161",
          "CHEMBL365392",
          "CHEMBL365445",
          "CHEMBL365517",
          "CHEMBL365809",
          "CHEMBL365982",
          "CHEMBL366205",
          "CHEMBL366907",
          "CHEMBL366959",
          "CHEMBL367966",
          "CHEMBL36994",
          "CHEMBL370059",
          "CHEMBL370299",
          "CHEMBL371181",
          "CHEMBL371371",
          "CHEMBL371523",
          "CHEMBL371858",
          "CHEMBL372716",
          "CHEMBL372856",
          "CHEMBL373345",
          "CHEMBL373555",
          "CHEMBL373606",
          "CHEMBL373715",
          "CHEMBL373781",
          "CHEMBL374235",
          "CHEMBL374331",
          "CHEMBL374629",
          "CHEMBL374740",
          "CHEMBL374758",
          "CHEMBL374895",
          "CHEMBL374905",
          "CHEMBL374970",
          "CHEMBL375078",
          "CHEMBL375126",
          "CHEMBL375304",
          "CHEMBL376201",
          "CHEMBL376228",
          "CHEMBL376290",
          "CHEMBL376291",
          "CHEMBL376417",
          "CHEMBL376435",
          "CHEMBL376518",
          "CHEMBL385132",
          "CHEMBL385799",
          "CHEMBL385800",
          "CHEMBL386000",
          "CHEMBL388883",
          "CHEMBL39412",
          "CHEMBL394557",
          "CHEMBL394806",
          "CHEMBL394807",
          "CHEMBL395018",
          "CHEMBL395019",
          "CHEMBL395652",
          "CHEMBL395653",
          "CHEMBL395654",
          "CHEMBL396977",
          "CHEMBL397739",
          "CHEMBL398109",
          "CHEMBL402615",
          "CHEMBL406659",
          "CHEMBL40988",
          "CHEMBL413727",
          "CHEMBL422064",
          "CHEMBL424976",
          "CHEMBL425192",
          "CHEMBL426230",
          "CHEMBL426410",
          "CHEMBL426562",
          "CHEMBL426967",
          "CHEMBL433282",
          "CHEMBL435109",
          "CHEMBL437373",
          "CHEMBL440542",
          "CHEMBL441556",
          "CHEMBL441735",
          "CHEMBL442046",
          "CHEMBL448073",
          "CHEMBL448922",
          "CHEMBL449475",
          "CHEMBL449775",
          "CHEMBL450158",
          "CHEMBL451609",
          "CHEMBL454233",
          "CHEMBL455556",
          "CHEMBL456450",
          "CHEMBL45830",
          "CHEMBL459324",
          "CHEMBL460317",
          "CHEMBL460806",
          "CHEMBL460807",
          "CHEMBL460808",
          "CHEMBL460809",
          "CHEMBL461163",
          "CHEMBL461541",
          "CHEMBL461544",
          "CHEMBL462423",
          "CHEMBL463556",
          "CHEMBL464002",
          "CHEMBL466961",
          "CHEMBL467182",
          "CHEMBL467368",
          "CHEMBL467450",
          "CHEMBL467451",
          "CHEMBL467796",
          "CHEMBL467817",
          "CHEMBL468188",
          "CHEMBL468189",
          "CHEMBL468220",
          "CHEMBL468221",
          "CHEMBL468222",
          "CHEMBL469050",
          "CHEMBL469051",
          "CHEMBL469198",
          "CHEMBL476511",
          "CHEMBL476512",
          "CHEMBL477167",
          "CHEMBL477371",
          "CHEMBL477372",
          "CHEMBL478014",
          "CHEMBL478015",
          "CHEMBL478187",
          "CHEMBL478424",
          "CHEMBL478858",
          "CHEMBL479062",
          "CHEMBL481",
          "CHEMBL482441",
          "CHEMBL482442",
          "CHEMBL482639",
          "CHEMBL482640",
          "CHEMBL482650",
          "CHEMBL482847",
          "CHEMBL482848",
          "CHEMBL482853",
          "CHEMBL482854",
          "CHEMBL483071",
          "CHEMBL483072",
          "CHEMBL483467",
          "CHEMBL483468",
          "CHEMBL483470",
          "CHEMBL483471",
          "CHEMBL483675",
          "CHEMBL483676",
          "CHEMBL483683",
          "CHEMBL484275",
          "CHEMBL484276",
          "CHEMBL484698",
          "CHEMBL485106",
          "CHEMBL485107",
          "CHEMBL485244",
          "CHEMBL485245",
          "CHEMBL486072",
          "CHEMBL486277",
          "CHEMBL487102",
          "CHEMBL487299",
          "CHEMBL487300",
          "CHEMBL487303",
          "CHEMBL487304",
          "CHEMBL488111",
          "CHEMBL488335",
          "CHEMBL489005",
          "CHEMBL489006",
          "CHEMBL489652",
          "CHEMBL491256",
          "CHEMBL491262",
          "CHEMBL492066",
          "CHEMBL492067",
          "CHEMBL499975",
          "CHEMBL504330",
          "CHEMBL509333",
          "CHEMBL510996",
          "CHEMBL512107",
          "CHEMBL512965",
          "CHEMBL513787",
          "CHEMBL513892",
          "CHEMBL514043",
          "CHEMBL515490",
          "CHEMBL515606",
          "CHEMBL517827",
          "CHEMBL519072",
          "CHEMBL51931",
          "CHEMBL519326",
          "CHEMBL519501",
          "CHEMBL520371",
          "CHEMBL521072",
          "CHEMBL521292",
          "CHEMBL521447",
          "CHEMBL521464",
          "CHEMBL521499",
          "CHEMBL52347",
          "CHEMBL589355",
          "CHEMBL589356",
          "CHEMBL589417",
          "CHEMBL589583",
          "CHEMBL589821",
          "CHEMBL590799",
          "CHEMBL590800",
          "CHEMBL591439",
          "CHEMBL591584",
          "CHEMBL591585",
          "CHEMBL591586",
          "CHEMBL591818",
          "CHEMBL591819",
          "CHEMBL592009",
          "CHEMBL592011",
          "CHEMBL592229",
          "CHEMBL600685",
          "CHEMBL601039",
          "CHEMBL601045",
          "CHEMBL601287",
          "CHEMBL601463",
          "CHEMBL602959",
          "CHEMBL60569",
          "CHEMBL607",
          "CHEMBL79466",
          "CHEMBL827",
          "CHEMBL8320",
          "CHEMBL838",
          "CHEMBL86668",
          "CHEMBL89506",
          "CHEMBL89946",
          "CHEMBL90039",
          "CHEMBL90258",
          "CHEMBL90308",
          "CHEMBL91416",
          "CHEMBL91417",
          "CHEMBL93675"
        ],
        "number_of_missing_values": "0"
      },
      {
        "data_type": "numeric",
        "index": "1",
        "is_ignore": "false",
        "is_row_identifier": "false",
        "is_target": "false",
        "name": "nSO2N",
        "number_of_missing_values": "0"
      },
      {
        "data_type": "numeric",
        "index": "2",
        "is_ignore": "false",
        "is_row_identifier": "false",
        "is_target": "false",
        "name": "Eig02_EA.bo.",
        "number_of_missing_values": "0"
      },
      {
        "data_type": "numeric",
        "index": "3",
        "is_ignore": "false",
        "is_row_identifier": "false",
        "is_target": "false",
        "name": "N.070",
        "number_of_missing_values": "0"
      },
      {
        "data_type": "numeric",
        "index": "4",
        "is_ignore": "false",
        "is_row_identifier": "false",
        "is_target": "false",
        "name": "NddssS",
        "number_of_missing_values": "0"
      },
      {
        "data_type": "numeric",
        "index": "5",
        "is_ignore": "false",
        "is_row_identifier": "false",
        "is_target": "false",
        "name": "P_VSA_s_1",
        "number_of_missing_values": "0"
      },
      {
        "data_type": "numeric",
        "index": "6",
        "is_ignore": "false",
        "is_row_identifier": "false",
        "is_target": "false",
        "name": "S.110",
        "number_of_missing_values": "0"
      },
      {
        "data_type": "numeric",
        "index": "7",
        "is_ignore": "false",
        "is_row_identifier": "false",
        "is_target": "false",
        "name": "SddssS",
        "number_of_missing_values": "0"
      },
      {
        "data_type": "numeric",
        "index": "8",
        "is_ignore": "false",
        "is_row_identifier": "false",
        "is_target": "false",
        "name": "SM12_AEA.ri.",
        "number_of_missing_values": "0"
      },
      {
        "data_type": "numeric",
        "index": "9",
        "is_ignore": "false",
        "is_row_identifier": "false",
        "is_target": "false",
        "name": "Eig02_AEA.dm.",
        "number_of_missing_values": "0"
      },
      {
        "data_type": "numeric",
        "index": "10",
        "is_ignore": "false",
        "is_row_identifier": "false",
        "is_target": "false",
        "name": "SpMax5_Bh.p.",
        "number_of_missing_values": "0"
      },
      {
        "data_type": "numeric",
        "index": "11",
        "is_ignore": "false",
        "is_row_identifier": "false",
        "is_target": "false",
        "name": "Eig02_AEA.ed.",
        "number_of_missing_values": "0"
      },
      {
        "data_type": "numeric",
        "index": "12",
        "is_ignore": "false",
        "is_row_identifier": "false",
        "is_target": "false",
        "name": "Eig02_EA.ed.",
        "number_of_missing_values": "0"
      },
      {
        "data_type": "numeric",
        "index": "13",
        "is_ignore": "false",
        "is_row_identifier": "false",
        "is_target": "false",
        "name": "SM11_AEA.dm.",
        "number_of_missing_values": "0"
      },
      {
        "data_type": "numeric",
        "index": "14",
        "is_ignore": "false",
        "is_row_identifier": "false",
        "is_target": "false",
        "name": "SpMax2_Bh.e.",
        "number_of_missing_values": "0"
      },
      {
        "data_type": "numeric",
        "index": "15",
        "is_ignore": "false",
        "is_row_identifier": "false",
        "is_target": "false",
        "name": "SpMin2_Bh.e.",
        "number_of_missing_values": "0"
      },
      {
        "data_type": "numeric",
        "index": "16",
        "is_ignore": "false",
        "is_row_identifier": "false",
        "is_target": "false",
        "name": "SpMin2_Bh.i.",
        "number_of_missing_values": "0"
      },
      {
        "data_type": "numeric",
        "index": "17",
        "is_ignore": "false",
        "is_row_identifier": "false",
        "is_target": "false",
        "name": "SM03_EA.bo.",
        "number_of_missing_values": "0"
      },
      {
        "data_type": "numeric",
        "index": "18",
        "is_ignore": "false",
        "is_row_identifier": "false",
        "is_target": "false",
        "name": "SpMax3_Bh.p.",
        "number_of_missing_values": "0"
      },
      {
        "data_type": "numeric",
        "index": "19",
        "is_ignore": "false",
        "is_row_identifier": "false",
        "is_target": "false",
        "name": "SpMax3_Bh.v.",
        "number_of_missing_values": "0"
      },
      {
        "data_type": "numeric",
        "index": "20",
        "is_ignore": "false",
        "is_row_identifier": "false",
        "is_target": "false",
        "name": "nBnz",
        "number_of_missing_values": "0"
      },
      {
        "data_type": "numeric",
        "index": "21",
        "is_ignore": "false",
        "is_row_identifier": "false",
        "is_target": "false",
        "name": "SpMin3_Bh.e.",
        "number_of_missing_values": "0"
      },
      {
        "data_type": "numeric",
        "index": "22",
        "is_ignore": "false",
        "is_row_identifier": "false",
        "is_target": "false",
        "name": "SpMin3_Bh.i.",
        "number_of_missing_values": "0"
      },
      {
        "data_type": "numeric",
        "index": "23",
        "is_ignore": "false",
        "is_row_identifier": "false",
        "is_target": "false",
        "name": "Eta_betaP",
        "number_of_missing_values": "0"
      },
      {
        "data_type": "numeric",
        "index": "24",
        "is_ignore": "false",
        "is_row_identifier": "false",
        "is_target": "false",
        "name": "SM05_AEA.bo.",
        "number_of_missing_values": "0"
      },
      {
        "data_type": "numeric",
        "index": "25",
        "is_ignore": "false",
        "is_row_identifier": "false",
        "is_target": "false",
        "name": "O.058",
        "number_of_missing_values": "0"
      },
      {
        "data_type": "numeric",
        "index": "26",
        "is_ignore": "false",
        "is_row_identifier": "false",
        "is_target": "false",
        "name": "ZM2MulPer",
        "number_of_missing_values": "0"
      },
      {
        "data_type": "numeric",
        "index": "27",
        "is_ignore": "false",
        "is_row_identifier": "false",
        "is_target": "false",
        "name": "SpMin2_Bh.v.",
        "number_of_missing_values": "0"
      },
      {
        "data_type": "numeric",
        "index": "28",
        "is_ignore": "false",
        "is_row_identifier": "false",
        "is_target": "false",
        "name": "SpMax3_Bh.e.",
        "number_of_missing_values": "0"
      },
      {
        "data_type": "numeric",
        "index": "29",
        "is_ignore": "false",
        "is_row_identifier": "false",
        "is_target": "false",
        "name": "Ui",
        "number_of_missing_values": "0"
      },
      {
        "data_type": "numeric",
        "index": "30",
        "is_ignore": "false",
        "is_row_identifier": "false",
        "is_target": "false",
        "name": "SM03_AEA.bo.",
        "number_of_missing_values": "0"
      },
      {
        "data_type": "numeric",
        "index": "31",
        "is_ignore": "false",
        "is_row_identifier": "false",
        "is_target": "false",
        "name": "XMOD",
        "number_of_missing_values": "0"
      },
      {
        "data_type": "numeric",
        "index": "32",
        "is_ignore": "false",
        "is_row_identifier": "false",
        "is_target": "false",
        "name": "GGI1",
        "number_of_missing_values": "0"
      },
      {
        "data_type": "numeric",
        "index": "33",
        "is_ignore": "false",
        "is_row_identifier": "false",
        "is_target": "false",
        "name": "nCar",
        "number_of_missing_values": "0"
      },
      {
        "data_type": "numeric",
        "index": "34",
        "is_ignore": "false",
        "is_row_identifier": "false",
        "is_target": "false",
        "name": "X3sol",
        "number_of_missing_values": "0"
      },
      {
        "data_type": "numeric",
        "index": "35",
        "is_ignore": "false",
        "is_row_identifier": "false",
        "is_target": "false",
        "name": "ZM2V",
        "number_of_missing_values": "0"
      },
      {
        "data_type": "numeric",
        "index": "36",
        "is_ignore": "false",
        "is_row_identifier": "false",
        "is_target": "false",
        "name": "ATS2m",
        "number_of_missing_values": "0"
      },
      {
        "data_type": "numeric",
        "index": "37",
        "is_ignore": "false",
        "is_row_identifier": "false",
        "is_target": "false",
        "name": "nS",
        "number_of_missing_values": "0"
      },
      {
        "data_type": "numeric",
        "index": "38",
        "is_ignore": "false",
        "is_row_identifier": "false",
        "is_target": "false",
        "name": "CATS2D_09_AA",
        "number_of_missing_values": "0"
      },
      {
        "data_type": "numeric",
        "index": "39",
        "is_ignore": "false",
        "is_row_identifier": "false",
        "is_target": "false",
        "name": "SpMax5_Bh.v.",
        "number_of_missing_values": "0"
      },
      {
        "data_type": "numeric",
        "index": "40",
        "is_ignore": "false",
        "is_row_identifier": "false",
        "is_target": "false",
        "name": "X5sol",
        "number_of_missing_values": "0"
      },
      {
        "data_type": "numeric",
        "index": "41",
        "is_ignore": "false",
        "is_row_identifier": "false",
        "is_target": "false",
        "name": "SpMax4_Bh.p.",
        "number_of_missing_values": "0"
      },
      {
        "data_type": "numeric",
        "index": "42",
        "is_ignore": "false",
        "is_row_identifier": "false",
        "is_target": "false",
        "name": "D.Dtr06",
        "number_of_missing_values": "0"
      },
      {
        "data_type": "numeric",
        "index": "43",
        "is_ignore": "false",
        "is_row_identifier": "false",
        "is_target": "false",
        "name": "CATS2D_05_DD",
        "number_of_missing_values": "0"
      },
      {
        "data_type": "numeric",
        "index": "44",
        "is_ignore": "false",
        "is_row_identifier": "false",
        "is_target": "false",
        "name": "X4v",
        "number_of_missing_values": "0"
      },
      {
        "data_type": "numeric",
        "index": "45",
        "is_ignore": "false",
        "is_row_identifier": "false",
        "is_target": "false",
        "name": "SpMax5_Bh.e.",
        "number_of_missing_values": "0"
      },
      {
        "data_type": "numeric",
        "index": "46",
        "is_ignore": "false",
        "is_row_identifier": "false",
        "is_target": "false",
        "name": "Eta_beta",
        "number_of_missing_values": "0"
      },
      {
        "data_type": "numeric",
        "index": "47",
        "is_ignore": "false",
        "is_row_identifier": "false",
        "is_target": "false",
        "name": "Eig06_EA.bo.",
        "number_of_missing_values": "0"
      },
      {
        "data_type": "numeric",
        "index": "48",
        "is_ignore": "false",
        "is_row_identifier": "false",
        "is_target": "false",
        "name": "Eig08_EA.bo.",
        "number_of_missing_values": "0"
      },
      {
        "data_type": "numeric",
        "index": "49",
        "is_ignore": "false",
        "is_row_identifier": "false",
        "is_target": "false",
        "name": "Eta_B",
        "number_of_missing_values": "0"
      },
      {
        "data_type": "numeric",
        "index": "50",
        "is_ignore": "false",
        "is_row_identifier": "false",
        "is_target": "false",
        "name": "X2v",
        "number_of_missing_values": "0"
      },
      {
        "data_type": "numeric",
        "index": "51",
        "is_ignore": "false",
        "is_row_identifier": "false",
        "is_target": "false",
        "name": "nBM",
        "number_of_missing_values": "0"
      },
      {
        "data_type": "numeric",
        "index": "52",
        "is_ignore": "false",
        "is_row_identifier": "false",
        "is_target": "false",
        "name": "Uc",
        "number_of_missing_values": "0"
      },
      {
        "data_type": "numeric",
        "index": "53",
        "is_ignore": "false",
        "is_row_identifier": "false",
        "is_target": "false",
        "name": "SM02_AEA.bo.",
        "number_of_missing_values": "0"
      },
      {
        "data_type": "numeric",
        "index": "54",
        "is_ignore": "false",
        "is_row_identifier": "false",
        "is_target": "false",
        "name": "ZM1Per",
        "number_of_missing_values": "0"
      },
      {
        "data_type": "numeric",
        "index": "55",
        "is_ignore": "false",
        "is_row_identifier": "false",
        "is_target": "false",
        "name": "NdssC",
        "number_of_missing_values": "0"
      },
      {
        "data_type": "numeric",
        "index": "56",
        "is_ignore": "false",
        "is_row_identifier": "false",
        "is_target": "false",
        "name": "SpAD_EA.bo.",
        "number_of_missing_values": "0"
      },
      {
        "data_type": "numeric",
        "index": "57",
        "is_ignore": "false",
        "is_row_identifier": "false",
        "is_target": "false",
        "name": "SpMax3_Bh.i.",
        "number_of_missing_values": "0"
      },
      {
        "data_type": "numeric",
        "index": "58",
        "is_ignore": "false",
        "is_row_identifier": "false",
        "is_target": "false",
        "name": "nAB",
        "number_of_missing_values": "0"
      },
      {
        "data_type": "numeric",
        "index": "59",
        "is_ignore": "false",
        "is_row_identifier": "false",
        "is_target": "false",
        "name": "X5v",
        "number_of_missing_values": "0"
      },
      {
        "data_type": "numeric",
        "index": "60",
        "is_ignore": "false",
        "is_row_identifier": "false",
        "is_target": "false",
        "name": "nHet",
        "number_of_missing_values": "0"
      },
      {
        "data_type": "numeric",
        "index": "61",
        "is_ignore": "false",
        "is_row_identifier": "false",
        "is_target": "false",
        "name": "Eig08_EA.ed.",
        "number_of_missing_values": "0"
      },
      {
        "data_type": "numeric",
        "index": "62",
        "is_ignore": "false",
        "is_row_identifier": "false",
        "is_target": "false",
        "name": "SM03_AEA.ri.",
        "number_of_missing_values": "0"
      },
      {
        "data_type": "numeric",
        "index": "63",
        "is_ignore": "false",
        "is_row_identifier": "false",
        "is_target": "false",
        "name": "C.026",
        "number_of_missing_values": "0"
      },
      {
        "data_type": "numeric",
        "index": "64",
        "is_ignore": "false",
        "is_row_identifier": "false",
        "is_target": "false",
        "name": "Eig03_EA.bo.",
        "number_of_missing_values": "0"
      },
      {
        "data_type": "numeric",
        "index": "65",
        "is_ignore": "false",
        "is_row_identifier": "false",
        "is_target": "false",
        "name": "SM13_AEA.ri.",
        "number_of_missing_values": "0"
      },
      {
        "data_type": "numeric",
        "index": "66",
        "is_ignore": "false",
        "is_row_identifier": "false",
        "is_target": "false",
        "name": "Eig06_AEA.ri.",
        "number_of_missing_values": "0"
      },
      {
        "data_type": "numeric",
        "index": "67",
        "is_ignore": "false",
        "is_row_identifier": "false",
        "is_target": "false",
        "name": "piPC01",
        "number_of_missing_values": "0"
      },
      {
        "data_type": "numeric",
        "index": "68",
        "is_ignore": "false",
        "is_row_identifier": "false",
        "is_target": "true",
        "name": "pXC50",
        "number_of_missing_values": "0"
      }
    ]
  }
}