{
  "data_features": {
    "feature": [
      {
        "data_type": "nominal",
        "index": "0",
        "is_ignore": "false",
        "is_row_identifier": "true",
        "is_target": "false",
        "name": "molecule_id",
        "nominal_value": [
          "CHEMBL102391",
          "CHEMBL102688",
          "CHEMBL103817",
          "CHEMBL104010",
          "CHEMBL104052",
          "CHEMBL104397",
          "CHEMBL104880",
          "CHEMBL105113",
          "CHEMBL106959",
          "CHEMBL138100",
          "CHEMBL138212",
          "CHEMBL138771",
          "CHEMBL140324",
          "CHEMBL140847",
          "CHEMBL141497",
          "CHEMBL151906",
          "CHEMBL152555",
          "CHEMBL152612",
          "CHEMBL152986",
          "CHEMBL153420",
          "CHEMBL154153",
          "CHEMBL154251",
          "CHEMBL1688104",
          "CHEMBL1688105",
          "CHEMBL1688106",
          "CHEMBL1688107",
          "CHEMBL1688108",
          "CHEMBL1688109",
          "CHEMBL1688110",
          "CHEMBL1688111",
          "CHEMBL186970",
          "CHEMBL188459",
          "CHEMBL188738",
          "CHEMBL189991",
          "CHEMBL190080",
          "CHEMBL190102",
          "CHEMBL190203",
          "CHEMBL190234",
          "CHEMBL190366",
          "CHEMBL190427",
          "CHEMBL190551",
          "CHEMBL190601",
          "CHEMBL190657",
          "CHEMBL190732",
          "CHEMBL190953",
          "CHEMBL191063",
          "CHEMBL191120",
          "CHEMBL191199",
          "CHEMBL191303",
          "CHEMBL191304",
          "CHEMBL193151",
          "CHEMBL194217",
          "CHEMBL195439",
          "CHEMBL195468",
          "CHEMBL2096693",
          "CHEMBL2096710",
          "CHEMBL2096712",
          "CHEMBL2096713",
          "CHEMBL2096714",
          "CHEMBL2096715",
          "CHEMBL2096716",
          "CHEMBL2096717",
          "CHEMBL2096718",
          "CHEMBL2096719",
          "CHEMBL2096720",
          "CHEMBL2096721",
          "CHEMBL2096722",
          "CHEMBL2096723",
          "CHEMBL2096724",
          "CHEMBL2096725",
          "CHEMBL2096726",
          "CHEMBL2096727",
          "CHEMBL2096728",
          "CHEMBL2096729",
          "CHEMBL2096730",
          "CHEMBL2096731",
          "CHEMBL2096742",
          "CHEMBL2096745",
          "CHEMBL2096818",
          "CHEMBL2096819",
          "CHEMBL2112213",
          "CHEMBL214332",
          "CHEMBL216295",
          "CHEMBL224277",
          "CHEMBL2304246",
          "CHEMBL2304247",
          "CHEMBL2304248",
          "CHEMBL2304249",
          "CHEMBL2304250",
          "CHEMBL2304320",
          "CHEMBL2323529",
          "CHEMBL2323785",
          "CHEMBL2323786",
          "CHEMBL2323787",
          "CHEMBL2323788",
          "CHEMBL2323789",
          "CHEMBL2323790",
          "CHEMBL2323791",
          "CHEMBL2323792",
          "CHEMBL2323793",
          "CHEMBL2323794",
          "CHEMBL2323795",
          "CHEMBL2323796",
          "CHEMBL2323797",
          "CHEMBL2323798",
          "CHEMBL2323799",
          "CHEMBL2323800",
          "CHEMBL264190",
          "CHEMBL264536",
          "CHEMBL265236",
          "CHEMBL266417",
          "CHEMBL267794",
          "CHEMBL268361",
          "CHEMBL269274",
          "CHEMBL269837",
          "CHEMBL270270",
          "CHEMBL270689",
          "CHEMBL270691",
          "CHEMBL270923",
          "CHEMBL271586",
          "CHEMBL272437",
          "CHEMBL272439",
          "CHEMBL272660",
          "CHEMBL272662",
          "CHEMBL272843",
          "CHEMBL275303",
          "CHEMBL275999",
          "CHEMBL291870",
          "CHEMBL293673",
          "CHEMBL302703",
          "CHEMBL303283",
          "CHEMBL305132",
          "CHEMBL305391",
          "CHEMBL305559",
          "CHEMBL307457",
          "CHEMBL317210",
          "CHEMBL317228",
          "CHEMBL317968",
          "CHEMBL317969",
          "CHEMBL319871",
          "CHEMBL319922",
          "CHEMBL320157",
          "CHEMBL321870",
          "CHEMBL322610",
          "CHEMBL322889",
          "CHEMBL327479",
          "CHEMBL329490",
          "CHEMBL329847",
          "CHEMBL330233",
          "CHEMBL330561",
          "CHEMBL343094",
          "CHEMBL346925",
          "CHEMBL347216",
          "CHEMBL347364",
          "CHEMBL348901",
          "CHEMBL349795",
          "CHEMBL350012",
          "CHEMBL357558",
          "CHEMBL358833",
          "CHEMBL359318",
          "CHEMBL364711",
          "CHEMBL364726",
          "CHEMBL365794",
          "CHEMBL365913",
          "CHEMBL370254",
          "CHEMBL370261",
          "CHEMBL370321",
          "CHEMBL371610",
          "CHEMBL372237",
          "CHEMBL373344",
          "CHEMBL384224",
          "CHEMBL386081",
          "CHEMBL386583",
          "CHEMBL402258",
          "CHEMBL405087",
          "CHEMBL405174",
          "CHEMBL405335",
          "CHEMBL405791",
          "CHEMBL406032",
          "CHEMBL406550",
          "CHEMBL406651",
          "CHEMBL406842",
          "CHEMBL406891",
          "CHEMBL406985",
          "CHEMBL408398",
          "CHEMBL408600",
          "CHEMBL409190",
          "CHEMBL410091",
          "CHEMBL410404",
          "CHEMBL410435",
          "CHEMBL410763",
          "CHEMBL411378",
          "CHEMBL411400",
          "CHEMBL411775",
          "CHEMBL413212",
          "CHEMBL413465",
          "CHEMBL414900",
          "CHEMBL414965",
          "CHEMBL415200",
          "CHEMBL421028",
          "CHEMBL426282",
          "CHEMBL428134",
          "CHEMBL428615",
          "CHEMBL428801",
          "CHEMBL429236",
          "CHEMBL430239",
          "CHEMBL430489",
          "CHEMBL430843",
          "CHEMBL431092",
          "CHEMBL431242",
          "CHEMBL431523",
          "CHEMBL432018",
          "CHEMBL432027",
          "CHEMBL432201",
          "CHEMBL432895",
          "CHEMBL433296",
          "CHEMBL433522",
          "CHEMBL434178",
          "CHEMBL439490",
          "CHEMBL440633",
          "CHEMBL444219",
          "CHEMBL448536",
          "CHEMBL451423",
          "CHEMBL454736",
          "CHEMBL455826",
          "CHEMBL488355",
          "CHEMBL491870",
          "CHEMBL500516",
          "CHEMBL50056",
          "CHEMBL501394",
          "CHEMBL501679",
          "CHEMBL502093",
          "CHEMBL503449",
          "CHEMBL510687",
          "CHEMBL565474",
          "CHEMBL565688",
          "CHEMBL565740",
          "CHEMBL565900",
          "CHEMBL565927",
          "CHEMBL566150",
          "CHEMBL566162",
          "CHEMBL566545",
          "CHEMBL566760",
          "CHEMBL567039",
          "CHEMBL567233",
          "CHEMBL567240",
          "CHEMBL567634",
          "CHEMBL568341",
          "CHEMBL568409",
          "CHEMBL568577",
          "CHEMBL568836",
          "CHEMBL568940",
          "CHEMBL568965",
          "CHEMBL569076",
          "CHEMBL569086",
          "CHEMBL569104",
          "CHEMBL569220",
          "CHEMBL569221",
          "CHEMBL569693",
          "CHEMBL569694",
          "CHEMBL569695",
          "CHEMBL569696",
          "CHEMBL569697",
          "CHEMBL570903",
          "CHEMBL589308",
          "CHEMBL589468",
          "CHEMBL589515",
          "CHEMBL589516",
          "CHEMBL589517",
          "CHEMBL602299",
          "CHEMBL602650",
          "CHEMBL602651",
          "CHEMBL602652",
          "CHEMBL602653",
          "CHEMBL602654",
          "CHEMBL602852",
          "CHEMBL602853",
          "CHEMBL607103",
          "CHEMBL607104",
          "CHEMBL61681",
          "CHEMBL62228",
          "CHEMBL63850",
          "CHEMBL63867",
          "CHEMBL64954",
          "CHEMBL64967",
          "CHEMBL65339",
          "CHEMBL94369",
          "CHEMBL94391",
          "CHEMBL96531",
          "CHEMBL96871"
        ],
        "number_of_missing_values": "0"
      },
      {
        "data_type": "numeric",
        "index": "1",
        "is_ignore": "false",
        "is_row_identifier": "false",
        "is_target": "false",
        "name": "nBT",
        "number_of_missing_values": "0"
      },
      {
        "data_type": "numeric",
        "index": "2",
        "is_ignore": "false",
        "is_row_identifier": "false",
        "is_target": "false",
        "name": "nAT",
        "number_of_missing_values": "0"
      },
      {
        "data_type": "numeric",
        "index": "3",
        "is_ignore": "false",
        "is_row_identifier": "false",
        "is_target": "false",
        "name": "Se",
        "number_of_missing_values": "0"
      },
      {
        "data_type": "numeric",
        "index": "4",
        "is_ignore": "false",
        "is_row_identifier": "false",
        "is_target": "false",
        "name": "Si",
        "number_of_missing_values": "0"
      },
      {
        "data_type": "numeric",
        "index": "5",
        "is_ignore": "false",
        "is_row_identifier": "false",
        "is_target": "false",
        "name": "Sv",
        "number_of_missing_values": "0"
      },
      {
        "data_type": "numeric",
        "index": "6",
        "is_ignore": "false",
        "is_row_identifier": "false",
        "is_target": "false",
        "name": "MW",
        "number_of_missing_values": "0"
      },
      {
        "data_type": "numeric",
        "index": "7",
        "is_ignore": "false",
        "is_row_identifier": "false",
        "is_target": "false",
        "name": "nH",
        "number_of_missing_values": "0"
      },
      {
        "data_type": "numeric",
        "index": "8",
        "is_ignore": "false",
        "is_row_identifier": "false",
        "is_target": "false",
        "name": "nSK",
        "number_of_missing_values": "0"
      },
      {
        "data_type": "numeric",
        "index": "9",
        "is_ignore": "false",
        "is_row_identifier": "false",
        "is_target": "false",
        "name": "nBO",
        "number_of_missing_values": "0"
      },
      {
        "data_type": "numeric",
        "index": "10",
        "is_ignore": "false",
        "is_row_identifier": "false",
        "is_target": "false",
        "name": "SCBO",
        "number_of_missing_values": "0"
      },
      {
        "data_type": "numeric",
        "index": "11",
        "is_ignore": "false",
        "is_row_identifier": "false",
        "is_target": "false",
        "name": "nAB",
        "number_of_missing_values": "0"
      },
      {
        "data_type": "numeric",
        "index": "12",
        "is_ignore": "false",
        "is_row_identifier": "false",
        "is_target": "false",
        "name": "nCsp2",
        "number_of_missing_values": "0"
      },
      {
        "data_type": "numeric",
        "index": "13",
        "is_ignore": "false",
        "is_row_identifier": "false",
        "is_target": "false",
        "name": "nCsp3",
        "number_of_missing_values": "0"
      },
      {
        "data_type": "numeric",
        "index": "14",
        "is_ignore": "false",
        "is_row_identifier": "false",
        "is_target": "true",
        "name": "pXC50",
        "number_of_missing_values": "0"
      }
    ]
  }
}