{
  "data_set_description": {
    "collection_date": "November 2013",
    "creator": "Dr Jeremy Besnard, Dr Ivan Olier, Dr Noureddin Sadawi, Dr Larisa Soldatova, Dr Crina Grosan, Prof Ross King, Dr Richard Bickerton, Prof Andrew Hopkins and Dr Willem van Hoorn",
    "default_target_attribute": "pXC50",
    "description": "This dataset contains QSAR data (from ChEMBL version 17) showing activity values (unit is pseudo-pCI50) of several compounds on drug target ChEMBL_ID: CHEMBL3985 (TID: 100668), and it has 53 rows and 1127 features (not including molecule IDs and class feature: molecule_id and pXC50). The features represent Molecular Descriptors which were generated from SMILES strings. Missing value imputation was applied to this dataset (By choosing the Median).",
    "description_version": "1",
    "file_id": "3450972",
    "format": "ARFF",
    "id": "31496",
    "licence": "Public",
    "md5_checksum": "521685990b2eb0c5714587035c7b447b",
    "minio_url": "https://data.openml.org/datasets/0003/31496/dataset_31496.pq",
    "name": "QSAR-DATASET-FOR-DRUG-TARGET-CHEMBL3985",
    "original_data_url": "https://www.ebi.ac.uk/chembl/target/inspect/CHEMBL3985",
    "parquet_url": "https://data.openml.org/datasets/0003/31496/dataset_31496.pq",
    "processing_date": "2018-10-04 02:27:13",
    "row_id_attribute": "molecule_id",
    "status": "deactivated",
    "tag": [
      "MetaQSAR",
      "study_13"
    ],
    "upload_date": "2016-07-15T07:43:46",
    "url": "https://api.openml.org/data/v1/download/3450972/QSAR-DATASET-FOR-DRUG-TARGET-CHEMBL3985.arff",
    "version": "9",
    "visibility": "public"
  }
}