{
  "data_set_description": {
    "collection_date": "November 2013",
    "creator": "Dr Jeremy Besnard, Dr Ivan Olier, Dr Noureddin Sadawi, Dr Larisa Soldatova, Dr Crina Grosan, Prof Ross King, Dr Richard Bickerton, Prof Andrew Hopkins and Dr Willem van Hoorn",
    "default_target_attribute": "pXC50",
    "description": "This dataset contains QSAR data (from ChEMBL version 17) showing activity values (unit is pseudo-pCI50) of several compounds on drug target ChEMBL_ID: CHEMBL1822 (TID: 84), and it has 113 rows and 1290 features (not including molecule IDs and class feature: molecule_id and pXC50). The features represent Molecular Descriptors which were generated from SMILES strings. Missing value imputation was applied to this dataset (By choosing the Median).",
    "description_version": "1",
    "file_id": "3450377",
    "format": "ARFF",
    "id": "31479",
    "licence": "Public",
    "md5_checksum": "013af64f5e444cca43227da77f960f98",
    "minio_url": "https://data.openml.org/datasets/0003/31479/dataset_31479.pq",
    "name": "QSAR-DATASET-FOR-DRUG-TARGET-CHEMBL1822",
    "original_data_url": "https://www.ebi.ac.uk/chembl/target/inspect/CHEMBL1822",
    "parquet_url": "https://data.openml.org/datasets/0003/31479/dataset_31479.pq",
    "processing_date": "2018-10-04 02:26:41",
    "row_id_attribute": "molecule_id",
    "status": "deactivated",
    "tag": [
      "MetaQSAR",
      "study_13"
    ],
    "upload_date": "2016-07-15T07:41:04",
    "url": "https://api.openml.org/data/v1/download/3450377/QSAR-DATASET-FOR-DRUG-TARGET-CHEMBL1822.arff",
    "version": "9",
    "visibility": "public"
  }
}