"molecule_id","FCFP4_1024b458","FCFP4_1024b641","FCFP4_1024b87","FCFP4_1024b254","FCFP4_1024b971","FCFP4_1024b999","FCFP4_1024b651","FCFP4_1024b132","FCFP4_1024b1","FCFP4_1024b10","FCFP4_1024b100","FCFP4_1024b1000","FCFP4_1024b1001","FCFP4_1024b1002","FCFP4_1024b1003","FCFP4_1024b1004","FCFP4_1024b1005","FCFP4_1024b1006","FCFP4_1024b1007","FCFP4_1024b1008","FCFP4_1024b1009","FCFP4_1024b101","FCFP4_1024b1010","FCFP4_1024b1011","FCFP4_1024b1012","FCFP4_1024b1013","FCFP4_1024b1014","FCFP4_1024b1015","FCFP4_1024b1016","FCFP4_1024b1017","FCFP4_1024b1018","FCFP4_1024b1019","FCFP4_1024b102","FCFP4_1024b1020","FCFP4_1024b1021","FCFP4_1024b1022","FCFP4_1024b1023","FCFP4_1024b1024","FCFP4_1024b103","FCFP4_1024b104","FCFP4_1024b105","FCFP4_1024b106","FCFP4_1024b107","FCFP4_1024b108","FCFP4_1024b109","FCFP4_1024b11","FCFP4_1024b110","FCFP4_1024b111","FCFP4_1024b112","FCFP4_1024b113","FCFP4_1024b114","pXC50"
{5 1,9 1,24 1,32 1,52 5}
{0 CHEMBL101253,5 1,9 1,52 5}
{0 CHEMBL103667,9 1,10 1,43 1,52 5.014}
{0 CHEMBL105442,2 1,9 1,52 5}
{0 CHEMBL1077512,1 1,3 1,4 1,5 1,6 1,7 1,8 1,9 1,10 1,43 1,52 4.699}
{0 CHEMBL1077571,1 1,2 1,3 1,4 1,5 1,6 1,7 1,8 1,9 1,43 1,52 7.114}
{0 CHEMBL1077738,1 1,2 1,5 1,9 1,43 1,52 4.699}
{0 CHEMBL1077739,1 1,2 1,5 1,9 1,43 1,52 7.102}
{0 CHEMBL1077740,1 1,2 1,5 1,9 1,43 1,46 1,52 6.642}
{0 CHEMBL1077741,1 1,2 1,5 1,9 1,43 1,52 6.762}
{0 CHEMBL1077850,1 1,2 1,3 1,4 1,5 1,6 1,7 1,9 1,43 1,52 4.824}
{0 CHEMBL1078107,1 1,2 1,3 1,4 1,5 1,6 1,7 1,8 1,9 1,24 1,43 1,52 7.18}
{0 CHEMBL1078108,1 1,2 1,3 1,4 1,5 1,6 1,7 1,8 1,9 1,43 1,52 6.699}
{0 CHEMBL1078109,1 1,2 1,3 1,4 1,5 1,6 1,7 1,8 1,9 1,43 1,52 6.62}
{0 CHEMBL1078214,1 1,2 1,3 1,4 1,5 1,6 1,7 1,8 1,9 1,43 1,52 7.201}
{0 CHEMBL1078238,1 1,2 1,3 1,9 1,12 1,43 1,52 4.699}
{0 CHEMBL1078239,1 1,2 1,3 1,5 1,9 1,43 1,52 4.699}
{0 CHEMBL1078542,1 1,5 1,9 1,43 1,52 4.699}
{0 CHEMBL1078726,1 1,2 1,3 1,4 1,5 1,6 1,7 1,8 1,9 1,43 1,52 4.699}
{0 CHEMBL1078738,1 1,2 1,5 1,9 1,43 1,52 6.337}
{0 CHEMBL1078739,1 1,2 1,5 1,9 1,43 1,52 7.222}
{0 CHEMBL1078785,1 1,2 1,3 1,4 1,5 1,6 1,7 1,8 1,9 1,43 1,52 6}
{0 CHEMBL1078840,1 1,2 1,5 1,9 1,43 1,52 7.06}
{0 CHEMBL1078902,1 1,3 1,4 1,5 1,6 1,7 1,8 1,9 1,43 1,52 4.699}
{0 CHEMBL1078965,1 1,2 1,3 1,4 1,5 1,6 1,7 1,8 1,9 1,43 1,52 4.699}
{0 CHEMBL1079075,1 1,3 1,4 1,5 1,6 1,7 1,8 1,9 1,43 1,52 4.699}
{0 CHEMBL1080221,1 1,3 1,4 1,5 1,9 1,43 1,52 4.699}
{0 CHEMBL1080222,2 1,3 1,4 1,5 1,6 1,8 1,9 1,43 1,52 4.699}
{0 CHEMBL1080223,1 1,2 1,3 1,4 1,5 1,6 1,7 1,9 1,43 1,52 4.824}
{0 CHEMBL1080956,1 1,2 1,3 1,4 1,5 1,6 1,7 1,9 1,17 1,43 1,52 4.699}
{0 CHEMBL1080957,1 1,2 1,3 1,4 1,5 1,6 1,7 1,8 1,9 1,19 1,43 1,52 5.699}
{0 CHEMBL1080958,1 1,2 1,3 1,4 1,5 1,6 1,7 1,8 1,9 1,43 1,52 4.699}
{0 CHEMBL1080959,1 1,2 1,3 1,4 1,5 1,6 1,7 1,8 1,9 1,43 1,52 6.721}
{0 CHEMBL1081498,1 1,2 1,3 1,4 1,5 1,6 1,7 1,8 1,9 1,43 1,52 6.585}
{0 CHEMBL1081499,1 1,2 1,3 1,4 1,5 1,6 1,7 1,8 1,9 1,43 1,52 4.824}
{0 CHEMBL1173655,9 1,10 1,43 1,52 5}
{0 CHEMBL119385,9 1,15 1,26 1,52 5}
{0 CHEMBL1230020,5 1,9 1,43 1,52 5}
{0 CHEMBL1236107,3 1,5 1,9 1,52 5}
{0 CHEMBL1240703,9 1,16 1,52 5}
{0 CHEMBL1241674,9 1,34 1,52 5}
{0 CHEMBL124660,9 1,10 1,43 1,52 5}
{0 CHEMBL1287853,5 1,9 1,10 1,52 5}
{0 CHEMBL1289926,5 1,9 1,12 1,35 1,44 1,52 5}
{0 CHEMBL1336,5 1,9 1,43 1,44 1,52 5}
{0 CHEMBL1421,1 1,2 1,5 1,9 1,10 1,24 1,43 1,52 8.161}
{0 CHEMBL14762,9 1,43 1,52 5}
{0 CHEMBL1614701,2 1,9 1,47 1,52 5}
{0 CHEMBL162,9 1,44 1,52 5}
{0 CHEMBL1721885,9 1,10 1,43 1,52 5}
{0 CHEMBL1789941,5 1,9 1,10 1,47 1,52 5}
{0 CHEMBL180022,5 1,9 1,10 1,43 1,52 5}
{0 CHEMBL1908391,1 1,5 1,9 1,10 1,43 1,46 1,52 5}
{0 CHEMBL1908392,3 1,9 1,10 1,16 1,52 5}
{0 CHEMBL1908393,5 1,9 1,10 1,43 1,52 7.071}
{0 CHEMBL1908394,9 1,10 1,52 5}
{0 CHEMBL1908395,1 1,9 1,10 1,32 1,43 1,52 5}
{0 CHEMBL1908396,5 1,9 1,43 1,52 5}
{0 CHEMBL1908397,9 1,12 1,52 5}
{0 CHEMBL191003,9 1,31 1,34 1,52 5}
{0 CHEMBL1916891,5 1,9 1,10 1,13 1,19 1,52 6.456}
{0 CHEMBL1929238,9 1,10 1,14 1,43 1,52 4.523}
{0 CHEMBL1952210,3 1,5 1,9 1,52 5.963}
{0 CHEMBL215152,9 1,10 1,12 1,43 1,52 5}
{0 CHEMBL221959,9 1,10 1,18 1,52 5}
{0 CHEMBL223360,2 1,9 1,12 1,34 1,43 1,52 5.854}
{0 CHEMBL230011,34 1,52 5}
{0 CHEMBL2309006,9 1,15 1,52 5}
{0 CHEMBL2309609,9 1,16 1,52 5}
{0 CHEMBL2322989,9 1,41 1,51 1,52 5.357}
{0 CHEMBL235345,5 1,9 1,52 5.699}
{0 CHEMBL24828,2 1,9 1,10 1,52 5}
{0 CHEMBL249097,5 1,9 1,52 7.092}
{0 CHEMBL249697,5 1,9 1,43 1,52 5}
{0 CHEMBL255863,1 1,5 1,9 1,43 1,52 6}
{0 CHEMBL259084,5 1,9 1,23 1,52 5.456}
{0 CHEMBL261644,5 1,9 1,52 5.699}
{0 CHEMBL261849,5 1,9 1,34 1,52 5}
{0 CHEMBL278041,5 1,24 1,32 1,52 5}
{0 CHEMBL288441,2 1,5 1,9 1,10 1,52 6.678}
{0 CHEMBL296468,5 1,9 1,43 1,52 5}
{0 CHEMBL300138,5 1,9 1,10 1,52 5}
{0 CHEMBL31965,9 1,10 1,43 1,52 5}
{0 CHEMBL377300,2 1,3 1,4 1,5 1,9 1,52 5}
{0 CHEMBL379218,5 1,9 1,12 1,52 5}
{0 CHEMBL384304,5 1,9 1,10 1,34 1,43 1,52 5.151}
{0 CHEMBL386051,5 1,9 1,52 6.469}
{0 CHEMBL393929,5 1,9 1,52 5.699}
{0 CHEMBL396377,5 1,9 1,52 5.699}
{0 CHEMBL428690,9 1,10 1,52 5}
{0 CHEMBL440084,5 1,9 1,52 5}
{0 CHEMBL445813,1 1,9 1,12 1,43 1,52 5}
{0 CHEMBL450786,9 1,10 1,32 1,43 1,52 5}
{0 CHEMBL463119,9 1,29 1,34 1,52 5.301}
{0 CHEMBL464552,9 1,10 1,44 1,52 5}
{0 CHEMBL475251,5 1,9 1,28 1,43 1,52 5}
{0 CHEMBL477772,5 1,9 1,52 5}
{0 CHEMBL483321,5 1,9 1,44 1,52 5}
{0 CHEMBL491473,2 1,9 1,10 1,52 5}
{0 CHEMBL494089,5 1,9 1,34 1,46 1,52 5}
{0 CHEMBL509032,3 1,5 1,6 1,9 1,10 1,52 5.721}
{0 CHEMBL513909,5 1,9 1,10 1,25 1,52 5}
{0 CHEMBL521851,5 1,9 1,10 1,12 1,46 1,52 5}
{0 CHEMBL522892,3 1,9 1,10 1,39 1,43 1,52 5}
{0 CHEMBL525191,5 1,9 1,14 1,24 1,31 1,52 5}
{0 CHEMBL535,9 1,10 1,43 1,52 5}
{0 CHEMBL553,9 1,16 1,52 5}
{0 CHEMBL554,5 1,9 1,39 1,52 5}
{0 CHEMBL558752,5 1,9 1,43 1,47 1,52 5}
{0 CHEMBL566515,5 1,9 1,52 7.824}
{0 CHEMBL572878,9 1,10 1,12 1,24 1,43 1,52 5}
{0 CHEMBL572881,1 1,5 1,9 1,43 1,52 5}
{0 CHEMBL573339,5 1,9 1,29 1,46 1,52 5}
{0 CHEMBL574738,9 1,10 1,24 1,43 1,44 1,52 5}
{0 CHEMBL576982,5 1,9 1,10 1,43 1,46 1,52 5}
{0 CHEMBL601719,5 1,9 1,34 1,52 5}
{0 CHEMBL606964,3 1,5 1,9 1,52 5.903}
{0 CHEMBL607707,5 1,9 1,10 1,43 1,52 5}
{0 CHEMBL608154,1 1,5 1,9 1,43 1,52 5}
{0 CHEMBL91829,5 1,9 1,10 1,39 1,52 5}
{0 CHEMBL939,9 1,10 1,52 5}
{0 CHEMBL941,1 1,5 1,9 1,10 1,43 1,52 5}
