"molecule_id","AMW","C.","H.","Me","Mi","Mp","Mv","MW","N.","nAB","nAT","nB","nBM","nBO","nBR","nBT","nC","nCL","nCsp","nCsp2","nCsp3","nDB","nF","nH","nHet","nHM","nI","nN","nO","nP","nS","nSK","nTB","nX","O.","RBF","RBN","SCBO","Se","Si","Sp","Sv","X.","pXC50"
{1 7.712,2 39.5,3 44.4,4 1.023,5 1.128,6 0.641,7 0.628,8 624.7,9 2.5,10 18,11 81,13 21,14 48,16 84,17 32,20 21,21 11,22 3,24 36,25 13,28 2,29 11,32 45,35 13.6,36 0.155,37 13,38 60,39 82.825,40 91.358,41 51.955,42 50.861,44 6.886}
{0 CHEMBL1684361,1 7.701,2 41.8,3 44,4 1.017,5 1.123,6 0.654,7 0.636,8 700.8,9 2.2,10 24,11 91,13 27,14 55,16 95,17 38,20 27,21 11,22 3,24 40,25 13,28 2,29 11,32 51,35 12.1,36 0.147,37 14,38 70,39 92.592,40 102.189,41 59.477,42 57.915,44 7.155}
{0 CHEMBL1684363,1 7.553,2 39.2,3 45.6,4 1.019,5 1.128,6 0.639,7 0.622,8 596.69,9 2.5,10 18,11 79,13 20,14 46,16 82,17 31,20 20,21 11,22 2,24 36,25 12,28 2,29 10,32 43,35 12.7,36 0.159,37 13,38 57,39 80.498,40 89.149,41 50.5,42 49.146,44 6.086}
{0 CHEMBL1684364,1 7.559,2 41.6,3 44.9,4 1.014,5 1.123,6 0.652,7 0.631,8 672.79,9 2.2,10 24,11 89,13 26,14 53,16 93,17 37,20 26,21 11,22 2,24 40,25 12,28 2,29 10,32 49,35 11.2,36 0.151,37 14,38 67,39 90.265,40 99.979,41 58.023,42 56.2,44 5.951}
{0 CHEMBL442728,1 7.175,2 32.3,3 50,4 1.025,5 1.143,6 0.597,7 0.582,8 688.81,9 2.1,10 6,11 96,13 8,14 51,16 99,17 31,20 8,21 23,22 2,24 48,25 17,28 2,29 15,32 48,35 15.6,36 0.152,37 15,38 56,39 98.436,40 109.687,41 57.341,42 55.881,44 4.424}
{0 CHEMBL446730,1 7.795,2 36.9,3 44.7,4 1.031,5 1.133,6 0.626,7 0.619,8 802.86,9 1.9,10 18,11 103,13 21,14 61,16 107,17 38,20 21,21 17,22 3,24 46,25 19,28 2,29 17,32 57,35 16.5,36 0.15,37 16,38 73,39 106.207,40 116.691,41 64.489,42 63.784,44 5.367}
{0 CHEMBL447407,1 7.705,2 39.3,3 44.6,4 1.024,5 1.128,6 0.639,7 0.626,8 862.96,9 1.8,10 25,11 112,13 28,14 68,16 118,17 44,20 25,21 19,22 3,24 50,25 18,28 2,29 16,32 62,35 14.3,36 0.144,37 17,38 83.5,39 114.647,40 126.312,41 71.557,42 70.123,44 4.677}
{0 CHEMBL448298,1 7.348,2 36.7,3 47.7,4 1.02,5 1.133,6 0.623,7 0.605,8 800.94,9 1.8,10 18,11 109,13 20,14 61,16 113,17 40,20 20,21 20,22 2,24 52,25 17,28 2,29 15,32 57,35 13.8,36 0.168,37 19,38 72,39 111.203,40 123.518,41 67.864,42 65.935,44 5.206}
{0 CHEMBL450770,1 7.58,2 33.7,3 46.9,4 1.033,5 1.14,6 0.607,7 0.6,8 742.81,9 2,10 12,11 98,13 14,14 55,16 101,17 33,20 14,21 19,22 2,24 46,25 19,28 2,29 17,32 52,35 17.3,36 0.168,37 17,38 63,39 101.207,40 111.691,41 59.489,42 58.784,44 4.606}
{0 CHEMBL451045,1 8.028,2 36.9,3 43.7,4 1.039,5 1.143,6 0.623,7 0.622,8 826.85,9 1.9,10 18,11 103,13 20,14 62,16 107,17 38,20 20,21 18,22 2,23 3,24 45,25 20,28 2,29 15,32 58,34 3,35 14.6,36 0.15,37 16,38 73,39 106.974,40 117.706,41 64.154,42 64.031,43 2.9,44 4.347}
{0 CHEMBL451427,1 7.714,2 37.3,3 45.1,4 1.028,5 1.132,6 0.628,7 0.618,8 786.86,9 2,10 18,11 102,13 21,14 60,16 106,17 38,20 21,21 17,22 3,24 46,25 18,28 2,29 16,32 56,35 15.7,36 0.151,37 16,38 72,39 104.88,40 115.481,41 64.034,42 63.069,44 5.432}
{0 CHEMBL451579,1 7.349,2 31.9,3 48.9,4 1.031,5 1.143,6 0.596,7 0.586,8 690.78,9 2.1,10 6,11 94,13 9,14 50,16 96,17 30,20 9,21 21,22 3,24 46,25 18,28 2,29 16,32 48,35 17,36 0.177,37 17,38 56,39 96.88,40 107.481,41 56.034,42 55.069,44 4.389}
{0 CHEMBL453397,1 7.504,2 36.9,3 46.6,4 1.024,5 1.133,6 0.625,7 0.61,8 772.88,9 1.9,10 18,11 103,13 20,14 59,16 107,17 38,20 20,21 18,22 2,24 48,25 17,28 2,29 15,32 55,35 14.6,36 0.159,37 17,38 70,39 105.436,40 116.687,41 64.341,42 62.881,44 5.261}
{0 CHEMBL460576,1 7.504,2 36.9,3 46.6,4 1.024,5 1.133,6 0.625,7 0.61,8 772.88,9 1.9,10 18,11 103,13 20,14 59,16 107,17 38,20 20,21 18,22 2,24 48,25 17,28 2,29 15,32 55,35 14.6,36 0.15,37 16,38 70,39 105.436,40 116.687,41 64.341,42 62.881,44 5.007}
{0 CHEMBL467951,1 7.861,2 36.8,3 44.2,4 1.033,5 1.133,6 0.626,7 0.621,8 746.79,9 2.1,10 17,11 95,13 20,14 57,16 99,17 35,20 19,21 16,22 3,24 42,25 18,28 2,29 16,32 53,35 16.8,36 0.141,37 14,38 68.5,39 98.112,40 107.651,41 59.511,42 59.016,44 5.585}
{0 CHEMBL473316,1 8.008,2 37.3,3 43.1,4 1.036,5 1.132,6 0.629,7 0.627,8 816.84,9 2,10 18,11 102,13 22,14 62,16 106,17 38,20 22,21 16,22 4,24 44,25 20,28 2,29 18,32 58,35 17.6,36 0.151,37 16,38 75,39 105.651,40 115.485,41 64.182,42 63.972,44 4.135}
{0 CHEMBL499384,1 7.398,2 32.6,3 48.4,4 1.03,5 1.142,6 0.6,7 0.59,8 702.79,9 2.1,10 6,11 95,13 9,14 52,16 98,17 31,20 9,21 22,22 3,24 46,25 18,28 2,29 16,32 49,35 16.8,36 0.143,37 14,38 58,39 97.88,40 108.481,41 57.034,42 56.069,44 4.796}
{0 CHEMBL499744,1 7.717,2 34.4,3 45.8,4 1.035,5 1.138,6 0.612,7 0.607,8 740.79,9 2.1,10 12,11 96,13 15,14 55,16 99,17 33,20 15,21 18,22 3,24 44,25 19,28 2,29 17,32 52,35 17.7,36 0.162,37 16,38 64,39 99.323,40 109.276,41 58.727,42 58.257,44 5.116}
{0 CHEMBL500461,1 7.795,2 36.9,3 44.7,4 1.031,5 1.133,6 0.626,7 0.619,8 802.86,9 1.9,10 18,11 103,13 21,14 61,16 107,17 38,20 21,21 17,22 3,24 46,25 19,28 2,29 17,32 57,35 16.5,36 0.159,37 17,38 73,39 106.207,40 116.691,41 64.489,42 63.784,44 5.126}
{0 CHEMBL501599,1 7.795,2 36.9,3 44.7,4 1.031,5 1.133,6 0.626,7 0.619,8 802.86,9 1.9,10 18,11 103,13 21,14 61,16 107,17 38,20 21,21 17,22 3,24 46,25 19,28 2,29 17,32 57,35 16.5,36 0.15,37 16,38 73,39 106.207,40 116.691,41 64.489,42 63.784,44 6.046}
{0 CHEMBL502788,1 7.763,2 36.7,3 44.9,4 1.031,5 1.133,6 0.625,7 0.618,8 760.82,9 2,10 17,11 98,13 20,14 58,16 102,17 36,20 19,21 17,22 3,24 44,25 18,28 2,29 16,32 54,35 16.3,36 0.147,37 15,38 69.5,39 100.996,40 111.066,41 61.273,42 60.542,44 6}
{0 CHEMBL502862,1 7.672,2 36.6,3 45.5,4 1.029,5 1.133,6 0.624,7 0.615,8 774.85,9 2,10 18,11 101,13 20,14 59,16 105,17 37,20 20,21 17,22 2,24 46,25 18,28 2,29 16,32 55,35 15.8,36 0.152,37 16,38 70,39 103.88,40 114.481,41 63.034,42 62.069,44 6.448}
{0 CHEMBL503621,1 7.696,2 31.2,3 46.8,4 1.041,5 1.145,6 0.594,7 0.594,8 592.62,9 2.6,10 6,11 77,13 8,14 43,16 79,17 24,20 8,21 16,22 2,24 36,25 17,28 2,29 15,32 41,35 19.5,36 0.152,37 12,38 48,39 80.134,40 88.196,41 45.773,42 45.72,44 4.071}
{0 CHEMBL503830,1 7.806,2 37.4,3 44.4,4 1.03,5 1.132,6 0.629,7 0.622,8 772.83,9 2,10 18,11 99,13 21,14 59,16 103,17 37,20 21,21 16,22 3,24 44,25 18,28 2,29 16,32 55,35 16.2,36 0.146,37 15,38 71,39 101.996,40 112.066,41 62.273,42 61.542,44 5.959}
{0 CHEMBL504222,1 7.585,2 36.5,3 46.2,4 1.027,5 1.134,6 0.623,7 0.611,8 788.88,9 1.9,10 18,11 104,13 20,14 60,16 108,17 38,20 20,21 18,22 2,24 48,25 18,28 2,29 16,32 56,35 15.4,36 0.157,37 17,38 71,39 106.763,40 117.897,41 64.796,42 63.596,44 5.754}
{0 CHEMBL504353,1 7.795,2 36.9,3 44.7,4 1.031,5 1.133,6 0.626,7 0.619,8 802.86,9 1.9,10 18,11 103,13 21,14 61,16 107,17 38,20 21,21 17,22 3,24 46,25 19,28 2,29 17,32 57,35 16.5,36 0.159,37 17,38 73,39 106.207,40 116.691,41 64.489,42 63.784,44 4.367}
{0 CHEMBL505326,1 7.672,2 36.6,3 45.5,4 1.029,5 1.133,6 0.624,7 0.615,8 774.85,9 2,10 18,11 101,13 20,14 59,16 105,17 37,20 20,21 17,22 2,24 46,25 18,28 2,29 16,32 55,35 15.8,36 0.152,37 16,38 70,39 103.88,40 114.481,41 63.034,42 62.069,44 5.762}
{0 CHEMBL505684,1 7.629,2 34.7,3 46.3,4 1.032,5 1.138,6 0.613,7 0.606,8 724.79,9 2.1,10 12,11 95,13 15,14 54,16 98,17 33,20 15,21 18,22 3,24 44,25 18,28 2,29 16,32 51,35 16.8,36 0.163,37 16,38 63,39 97.996,40 108.066,41 58.273,42 57.542,44 4.983}
{0 CHEMBL508909,1 8.008,2 37.3,3 43.1,4 1.036,5 1.132,6 0.629,7 0.627,8 816.84,9 2,10 18,11 102,13 22,14 62,16 106,17 38,20 22,21 16,22 4,24 44,25 20,28 2,29 18,32 58,35 17.6,36 0.151,37 16,38 75,39 105.651,40 115.485,41 64.182,42 63.972,44 5.147}
{0 CHEMBL509633,1 7.588,2 37,3 46,4 1.026,5 1.133,6 0.626,7 0.614,8 758.85,9 2,10 18,11 100,13 20,14 58,16 104,17 37,20 20,21 17,22 2,24 46,25 17,28 2,29 15,32 54,35 15,36 0.154,37 16,38 69,39 102.552,40 113.272,41 62.58,42 61.354,44 6.328}
{0 CHEMBL509768,1 7.888,2 37,3 44,4 1.033,5 1.133,6 0.627,7 0.623,8 788.83,9 2,10 18,11 100,13 21,14 60,16 104,17 37,20 21,21 16,22 3,24 44,25 19,28 2,29 17,32 56,35 17,36 0.144,37 15,38 72,39 103.323,40 113.276,41 62.727,42 62.257,44 6.398}
{0 CHEMBL510261,1 7.714,2 37.3,3 45.1,4 1.028,5 1.132,6 0.628,7 0.618,8 786.86,9 2,10 18,11 102,13 21,14 60,16 106,17 38,20 21,21 17,22 3,24 46,25 18,28 2,29 16,32 56,35 15.7,36 0.151,37 16,38 72,39 104.88,40 115.481,41 64.034,42 63.069,44 5.053}
{0 CHEMBL511111,1 7.672,2 36.6,3 45.5,4 1.029,5 1.133,6 0.624,7 0.615,8 774.85,9 2,10 18,11 101,13 20,14 59,16 105,17 37,20 20,21 17,22 2,24 46,25 18,28 2,29 16,32 55,35 15.8,36 0.152,37 16,38 70,39 103.88,40 114.481,41 63.034,42 62.069,44 6.638}
