"molecule_id","AMW","C.","H.","Me","Mi","Mp","Mv","MW","N.","nAB","nAT","nB","nBM","nBO","nBR","nBT","nC","nCL","nCsp","nCsp2","nCsp3","nDB","nF","nH","nHet","nHM","nI","nN","nO","nP","nS","nSK","nTB","nX","O.","RBF","RBN","SCBO","Se","Si","Sp","Sv","X.","pXC50"
{1 8.778,2 48.8,3 37.2,4 1.009,5 1.113,6 0.73,7 0.699,8 377.47,9 7,10 23,11 43,13 24,14 30,16 46,17 21,20 20,21 1,22 1,23 1,24 16,25 6,26 1,28 3,29 1,31 1,32 27,34 1,35 2.3,36 0.087,37 4,38 42.5,39 43.407,40 47.87,41 31.387,42 30.037,43 2.3,44 6.367}
{0 CHEMBL101253,1 8.671,2 50,3 37.5,4 1.001,5 1.111,6 0.736,7 0.702,8 346.84,9 10,10 23,11 40,13 23,14 28,16 43,17 20,18 1,20 19,21 1,24 15,25 5,26 1,28 4,32 25,34 1,36 0.093,37 4,38 39.5,39 40.033,40 44.428,41 29.449,42 28.074,43 2.5,44 5}
{0 CHEMBL103667,1 6.944,2 40.8,3 48.7,4 0.995,5 1.128,6 0.652,7 0.614,8 527.73,9 6.6,10 22,11 76,13 23,14 43,16 80,17 31,20 20,21 11,22 1,24 37,25 8,28 5,29 3,32 39,35 3.9,36 0.1,37 8,38 55,39 75.629,40 85.763,41 49.574,42 46.68,44 5.412}
{0 CHEMBL105442,1 12.274,2 43.6,3 35.9,4 1.034,5 1.13,6 0.754,7 0.708,8 478.68,9 5.1,10 12,11 39,13 13,14 27,16 41,17 17,18 1,20 13,21 4,22 1,23 2,24 14,25 8,26 2,27 1,28 2,29 2,32 25,34 4,35 5.1,36 0.146,37 6,38 34,39 40.345,40 44.081,41 29.404,42 27.598,43 10.3,44 5}
{0 CHEMBL1082158,1 9.584,2 45.7,3 32.6,4 1.035,5 1.137,6 0.713,7 0.709,8 440.87,9 13,10 22,11 46,13 23,14 35,16 50,17 21,18 1,20 18,21 3,22 1,23 2,24 15,25 10,26 1,28 6,29 1,32 31,34 3,35 2.2,36 0.1,37 5,38 47,39 47.589,40 52.314,41 32.79,42 32.598,43 6.5,44 8.398}
{0 CHEMBL1088751,1 9.741,2 44.9,3 38.8,4 1.026,5 1.129,6 0.698,7 0.679,8 477.33,9 4.1,10 12,11 49,13 16,14 32,15 1,16 51,17 22,20 18,21 4,22 4,23 2,24 19,25 8,26 1,28 2,29 3,32 30,34 3,35 6.1,36 0.098,37 5,38 42,39 50.276,40 55.298,41 34.216,42 33.247,43 6.1,44 7.398}
{0 CHEMBL1088752,1 7.102,2 40.7,3 48.1,4 1.001,5 1.134,6 0.648,7 0.615,8 383.51,9 5.6,10 12,11 54,13 14,14 30,16 56,17 22,20 13,21 9,22 2,23 1,24 26,25 6,28 3,29 2,32 28,34 1,35 3.7,36 0.107,37 6,38 38,39 54.076,40 61.236,41 35,42 33.199,43 1.9,44 7.6}
{0 CHEMBL1088897,1 8.51,2 40.8,3 42.9,4 1.008,5 1.123,6 0.7,7 0.659,8 416.97,9 8.2,10 17,11 49,13 19,14 31,16 52,17 20,18 1,20 14,21 6,22 2,24 21,25 8,26 2,28 4,29 2,31 1,32 28,34 1,35 4.1,36 0.077,37 4,38 41.5,39 49.414,40 55.013,41 34.29,42 32.271,43 2,44 5.452}
{0 CHEMBL1088914,1 8.707,2 39.6,3 41.7,4 1.013,5 1.127,6 0.699,7 0.662,8 417.96,9 10.4,10 17,11 48,13 19,14 31,16 51,17 19,18 1,20 13,21 6,22 2,24 20,25 9,26 2,28 5,29 2,31 1,32 28,34 1,35 4.2,36 0.078,37 4,38 41.5,39 48.633,40 54.096,41 33.534,42 31.766,43 2.1,44 5.387}
{0 CHEMBL1089172,1 7.571,2 41.1,3 46.4,4 0.998,5 1.129,6 0.674,7 0.633,8 423.99,9 8.9,10 17,11 56,13 17,14 34,16 60,17 23,18 1,20 13,21 10,24 26,25 7,26 1,28 5,29 1,32 30,34 1,35 1.8,36 0.067,37 4,38 42.5,39 55.88,40 63.212,41 37.716,42 35.444,43 1.8,44 5.471}
{0 CHEMBL1089173,1 8.126,2 42.6,3 42.6,4 1.005,5 1.127,6 0.69,7 0.657,8 381.9,9 10.6,10 17,11 47,13 18,14 30,16 50,17 20,18 1,20 14,21 6,22 1,24 20,25 7,26 1,28 5,29 1,32 27,34 1,35 2.1,36 0.06,37 3,38 39.5,39 47.229,40 52.967,41 32.432,42 30.864,43 2.1,44 5.431}
{0 CHEMBL1089197,1 7.49,2 41.5,3 47.2,4 0.996,5 1.127,6 0.674,7 0.631,8 396.96,9 7.5,10 17,11 53,13 17,14 31,16 56,17 22,18 1,20 14,21 8,24 25,25 6,26 1,28 4,29 1,32 28,34 1,35 1.9,36 0.107,37 6,38 39.5,39 52.778,40 59.714,41 35.711,42 33.423,43 1.9,44 5.173}
{0 CHEMBL1089198,1 7.339,2 41.1,3 48.2,4 0.994,5 1.127,6 0.669,7 0.624,8 410.99,9 7.1,10 17,11 56,13 17,14 32,16 59,17 23,18 1,20 14,21 9,24 27,25 6,26 1,28 4,29 1,32 29,34 1,35 1.8,36 0.119,37 7,38 40.5,39 55.661,40 63.129,41 37.472,42 34.949,43 1.8,44 5.184}
{0 CHEMBL1089520,1 8.707,2 39.6,3 41.7,4 1.013,5 1.127,6 0.699,7 0.662,8 417.96,9 10.4,10 17,11 48,13 19,14 31,16 51,17 19,18 1,20 14,21 5,22 2,24 20,25 9,26 2,28 5,29 2,31 1,32 28,34 1,35 4.2,36 0.078,37 4,38 41.5,39 48.633,40 54.096,41 33.534,42 31.766,43 2.1,44 5.783}
{0 CHEMBL1089865,1 8.355,2 46.2,3 38.5,4 1.02,5 1.131,6 0.686,7 0.674,8 434.48,9 7.7,10 17,11 52,13 20,14 36,16 56,17 24,20 19,21 5,22 3,23 2,24 20,25 8,28 4,29 2,32 32,34 2,35 3.8,36 0.071,37 4,38 47.5,39 53.04,40 58.828,41 35.659,42 35.023,43 3.8,44 8.602}
{0 CHEMBL1090089,1 8.294,2 38.8,3 40.8,4 1.035,5 1.148,6 0.644,7 0.642,8 406.43,9 8.2,10 12,11 49,13 14,14 31,16 51,17 19,20 13,21 6,22 2,23 2,24 20,25 10,28 4,29 4,32 29,34 2,35 8.2,36 0.157,37 8,38 39,39 50.694,40 56.247,41 31.568,42 31.453,43 4.1,44 6.921}
{0 CHEMBL1090090,1 9.862,2 46.3,3 29.3,4 1.059,5 1.153,6 0.689,7 0.712,8 404.35,9 9.8,10 18,11 41,13 20,14 31,16 43,17 19,20 19,22 2,23 4,24 12,25 10,28 4,29 2,32 29,34 4,35 4.9,36 0.093,37 4,38 42,39 43.414,40 47.262,41 28.25,42 29.209,43 9.8,44 7.77}
{0 CHEMBL1090173,1 8.29,2 41.7,3 41.7,4 1.012,5 1.129,6 0.685,7 0.658,8 397.9,9 10.4,10 17,11 48,13 18,14 31,16 51,17 20,18 1,20 14,21 6,22 1,24 20,25 8,26 1,28 5,29 2,32 28,34 1,35 4.2,36 0.078,37 4,38 40.5,39 48.556,40 54.176,41 32.887,42 31.579,43 2.1,44 5.462}
{0 CHEMBL1090174,1 8.077,2 41.2,3 43.1,4 1.009,5 1.129,6 0.679,7 0.649,8 411.93,9 9.8,10 17,11 51,13 18,14 32,16 54,17 21,18 1,20 14,21 7,22 1,24 22,25 8,26 1,28 5,29 2,32 29,34 1,35 3.9,36 0.093,37 5,38 41.5,39 51.44,40 57.591,41 34.648,42 33.105,43 2,44 5.488}
{0 CHEMBL1090511,1 7.887,2 42.9,3 42.9,4 1.016,5 1.146,6 0.662,7 0.643,8 386.46,9 8.2,10 17,11 49,13 17,14 31,16 52,17 21,20 14,21 7,23 3,24 21,25 7,28 4,32 28,34 3,36 0.058,37 3,38 39.5,39 49.781,40 56.164,41 32.449,42 31.504,43 6.1,44 5.424}
{0 CHEMBL1090512,1 7.887,2 42.9,3 42.9,4 1.016,5 1.146,6 0.662,7 0.643,8 386.46,9 8.2,10 17,11 49,13 17,14 31,16 52,17 21,20 14,21 7,23 3,24 21,25 7,28 4,32 28,34 3,36 0.058,37 3,38 39.5,39 49.781,40 56.164,41 32.449,42 31.504,43 6.1,44 6.785}
{0 CHEMBL1090836,1 6.786,2 42.9,3 49,4 0.985,5 1.125,6 0.666,7 0.619,8 332.49,9 8.2,10 17,11 49,13 17,14 28,16 52,17 21,20 14,21 7,24 24,25 4,28 4,32 25,36 0.058,37 3,38 36.5,39 48.243,40 55.145,41 32.637,42 30.354,44 5.513}
{0 CHEMBL1090837,1 6.786,2 42.9,3 49,4 0.985,5 1.125,6 0.666,7 0.619,8 332.49,9 8.2,10 17,11 49,13 17,14 28,16 52,17 21,20 14,21 7,24 24,25 4,28 4,32 25,36 0.058,37 3,38 36.5,39 48.243,40 55.145,41 32.637,42 30.354,44 5.629}
{0 CHEMBL1091552,1 7.498,2 44.2,3 44.2,4 1,5 1.132,6 0.676,7 0.644,8 322.42,9 9.3,10 17,11 43,13 17,14 27,16 46,17 19,20 14,21 5,23 1,24 19,25 5,28 4,32 24,34 1,36 0.065,37 3,38 35.5,39 42.989,40 48.655,41 29.052,42 27.683,43 2.3,44 6.394}
{0 CHEMBL1091560,1 7.314,2 43.5,3 45.7,4 0.997,5 1.132,6 0.67,7 0.635,8 336.45,9 8.7,10 17,11 46,13 17,14 28,16 49,17 20,20 14,21 6,23 1,24 21,25 5,28 4,32 25,34 1,36 0.061,37 3,38 36.5,39 45.872,40 52.07,41 30.813,42 29.21,43 2.2,44 5.599}
{0 CHEMBL1091667,1 7.498,2 44.2,3 44.2,4 1,5 1.132,6 0.676,7 0.644,8 322.42,9 9.3,10 17,11 43,13 17,14 27,16 46,17 19,20 14,21 5,23 1,24 19,25 5,28 4,32 24,34 1,36 0.065,37 3,38 35.5,39 42.989,40 48.655,41 29.052,42 27.683,43 2.3,44 6.292}
{0 CHEMBL1091668,1 7.314,2 43.5,3 45.7,4 0.997,5 1.132,6 0.67,7 0.635,8 336.45,9 8.7,10 17,11 46,13 17,14 28,16 49,17 20,20 14,21 6,23 1,24 21,25 5,28 4,32 25,34 1,36 0.061,37 3,38 36.5,39 45.872,40 52.07,41 30.813,42 29.21,43 2.2,44 5.708}
{0 CHEMBL1091912,1 7.903,2 40.4,3 44.2,4 1.004,5 1.132,6 0.677,7 0.643,8 410.95,9 11.5,10 17,11 52,13 18,14 32,16 55,17 21,18 1,20 14,21 7,22 1,24 23,25 8,26 1,28 6,29 1,32 29,34 1,35 1.9,36 0.055,37 3,38 41.5,39 52.214,40 58.88,41 35.199,42 33.412,43 1.9,44 5.458}
{0 CHEMBL1091921,1 7.936,2 43.8,3 43.8,4 1,5 1.123,6 0.691,7 0.654,8 380.91,9 8.3,10 17,11 48,13 18,14 30,16 51,17 21,18 1,20 15,21 6,22 1,24 21,25 6,26 1,28 4,29 1,32 27,34 1,35 2.1,36 0.059,37 3,38 39.5,39 48.011,40 53.883,41 33.188,42 31.369,43 2.1,44 5.504}
{0 CHEMBL1091922,1 8.1,2 42.9,3 42.9,4 1.007,5 1.124,6 0.687,7 0.655,8 396.91,9 8.2,10 17,11 49,13 18,14 31,16 52,17 21,18 1,20 15,21 6,22 1,24 21,25 7,26 1,28 4,29 2,32 28,34 1,35 4.1,36 0.077,37 4,38 40.5,39 49.338,40 55.093,41 33.642,42 32.084,43 2,44 5.747}
{0 CHEMBL1091923,1 7.903,2 42.3,3 44.2,4 1.004,5 1.125,6 0.681,7 0.646,8 410.94,9 7.7,10 17,11 52,13 18,14 32,16 55,17 22,18 1,20 15,21 7,22 1,24 23,25 7,26 1,28 4,29 2,32 29,34 1,35 3.8,36 0.091,37 5,38 41.5,39 52.222,40 58.508,41 35.404,42 33.611,43 1.9,44 5.462}
{0 CHEMBL1092001,1 7.735,2 41.5,3 45.3,4 1,5 1.128,6 0.678,7 0.64,8 409.96,9 9.4,10 17,11 53,13 17,14 33,16 57,17 22,18 1,20 13,21 9,24 24,25 7,26 1,28 5,29 1,32 29,34 1,35 1.9,36 0.07,37 4,38 41.5,39 52.996,40 59.797,41 35.955,42 33.917,43 1.9,44 5.13}
{0 CHEMBL1092246,1 7.571,2 41.1,3 46.4,4 0.998,5 1.129,6 0.674,7 0.633,8 423.99,9 8.9,10 17,11 56,13 18,14 33,16 59,17 23,18 1,20 15,21 8,22 1,24 26,25 7,26 1,28 5,29 1,32 30,34 1,35 1.8,36 0.085,37 5,38 42.5,39 55.88,40 63.212,41 37.716,42 35.444,43 1.8,44 5.173}
{0 CHEMBL1092383,1 8.1,2 42.9,3 42.9,4 1.007,5 1.124,6 0.687,7 0.655,8 396.91,9 8.2,10 17,11 49,13 18,14 31,16 52,17 21,18 1,20 15,21 6,22 1,24 21,25 7,26 1,28 4,29 2,32 28,34 1,35 4.1,36 0.096,37 5,38 40.5,39 49.338,40 55.093,41 33.642,42 32.084,43 2,44 5.363}
{0 CHEMBL1092648,1 7.571,2 41.1,3 46.4,4 0.998,5 1.129,6 0.674,7 0.633,8 423.99,9 8.9,10 17,11 56,13 17,14 34,16 60,17 23,18 1,20 13,21 10,24 26,25 7,26 1,28 5,29 1,32 30,34 1,35 1.8,36 0.067,37 4,38 42.5,39 55.88,40 63.212,41 37.716,42 35.444,43 1.8,44 5.022}
{0 CHEMBL1092722,1 7.864,2 42.2,3 44.4,4 0.998,5 1.128,6 0.688,7 0.648,8 353.89,9 11.1,10 17,11 45,13 17,14 28,16 48,17 19,18 1,20 13,21 6,24 20,25 6,26 1,28 5,32 25,34 1,36 0.063,37 3,38 36.5,39 44.902,40 50.757,41 30.978,42 29.149,43 2.2,44 5.635}
{0 CHEMBL1092901,1 7.593,2 43.8,3 43.8,4 1.004,5 1.131,6 0.672,7 0.644,8 364.46,9 8.3,10 17,11 48,13 18,14 30,16 51,17 21,20 15,21 6,22 1,23 1,24 21,25 6,28 4,29 1,32 27,34 1,35 2.1,36 0.059,37 3,38 39.5,39 48.2,40 54.279,41 32.267,42 30.925,43 2.1,44 5.775}
{0 CHEMBL1092902,1 7.672,2 43.5,3 45.7,4 0.993,5 1.123,6 0.69,7 0.645,8 352.9,9 8.7,10 17,11 46,13 17,14 28,16 49,17 20,18 1,20 14,21 6,24 21,25 5,26 1,28 4,32 25,34 1,36 0.061,37 3,38 36.5,39 45.683,40 51.674,41 31.733,42 29.654,43 2.2,44 5.572}
{0 CHEMBL1092903,1 7.672,2 43.5,3 45.7,4 0.993,5 1.123,6 0.69,7 0.645,8 352.9,9 8.7,10 17,11 46,13 17,14 28,16 49,17 20,18 1,20 14,21 6,24 21,25 5,26 1,28 4,32 25,34 1,36 0.061,37 3,38 36.5,39 45.683,40 51.674,41 31.733,42 29.654,43 2.2,44 5.979}
{0 CHEMBL1092906,1 7.491,2 40,3 47.3,4 0.998,5 1.131,6 0.668,7 0.626,8 411.98,9 9.1,10 17,11 55,13 17,14 32,16 58,17 22,18 1,20 13,21 9,24 26,25 7,26 1,28 5,29 1,32 29,34 1,35 1.8,36 0.086,37 5,38 40.5,39 54.88,40 62.212,41 36.716,42 34.444,43 1.8,44 5.556}
{0 CHEMBL1092907,1 7.491,2 40,3 47.3,4 0.998,5 1.131,6 0.668,7 0.626,8 411.98,9 9.1,10 17,11 55,13 17,14 32,16 58,17 22,18 1,20 13,21 9,24 26,25 7,26 1,28 5,29 1,32 29,34 1,35 1.8,36 0.086,37 5,38 40.5,39 54.88,40 62.212,41 36.716,42 34.444,43 1.8,44 5.01}
{0 CHEMBL1093007,1 7.835,2 40.8,3 44.9,4 1.002,5 1.13,6 0.677,7 0.641,8 383.92,9 10.2,10 17,11 49,13 17,14 30,16 52,17 20,18 1,20 13,21 7,24 22,25 7,26 1,28 5,29 1,32 27,34 1,35 2,36 0.096,37 5,38 38.5,39 49.112,40 55.382,41 33.194,42 31.391,43 2,44 5.595}
{0 CHEMBL1093301,1 7.981,2 44.4,3 42.6,4 0.998,5 1.124,6 0.699,7 0.661,8 430.98,9 11.1,10 23,11 54,13 23,14 35,16 58,17 24,18 1,20 18,21 6,24 23,25 7,26 1,28 6,32 31,34 1,36 0.086,37 5,38 46.5,39 53.887,40 60.671,41 37.745,42 35.697,43 1.9,44 5.483}
{0 CHEMBL1093456,1 7.659,2 42,3 46,4 0.998,5 1.126,6 0.679,7 0.638,8 382.93,9 8,10 17,11 50,13 17,14 30,16 53,17 21,18 1,20 14,21 7,24 23,25 6,26 1,28 4,29 1,32 27,34 1,35 2,36 0.094,37 5,38 38.5,39 49.894,40 56.299,41 33.949,42 31.896,43 2,44 5.47}
{0 CHEMBL1171204,1 7.907,2 46.2,3 41,4 1.01,5 1.116,6 0.685,7 0.663,8 308.36,9 5.1,10 16,11 39,13 18,14 25,16 41,17 18,20 16,21 2,22 2,24 16,25 5,28 2,29 3,32 23,35 7.7,36 0.122,37 5,38 35,39 39.371,40 43.531,41 26.705,42 25.875,44 5.2}
{0 CHEMBL1173655,1 8.237,2 40.7,3 42.4,4 1.018,5 1.135,6 0.671,7 0.648,8 485.99,9 8.5,10 17,11 59,13 19,14 37,16 62,17 24,18 1,20 17,21 7,22 2,23 1,24 25,25 10,26 1,28 5,29 3,32 34,34 2,35 5.1,36 0.129,37 8,38 47.5,39 60.047,40 66.971,41 39.563,42 38.257,43 3.4,44 5}
{0 CHEMBL119385,1 11.791,2 51.4,3 24.3,4 1.049,5 1.115,6 0.798,7 0.784,8 436.28,9 8.1,10 12,11 37,13 17,14 31,16 40,17 19,18 2,20 19,22 5,23 2,24 9,25 9,26 3,28 3,29 1,31 1,32 28,34 4,35 2.7,36 0.075,37 3,38 42,39 38.8,40 41.268,41 29.517,42 29.022,43 10.8,44 6.727}
{0 CHEMBL1209288,1 7.336,2 46.9,3 44.9,4 0.993,5 1.122,6 0.685,7 0.647,8 359.48,9 6.1,10 17,11 49,13 18,14 31,16 53,17 23,20 17,21 6,22 1,23 1,24 22,25 4,28 3,32 27,34 1,36 0.057,37 3,38 40.5,39 48.654,40 54.987,41 33.569,42 31.716,43 2,44 6.243}
{0 CHEMBL1222044,1 13.572,2 36,3 16,4 1.123,5 1.161,6 0.739,7 0.78,8 339.3,9 12,10 10,11 25,13 14,14 22,16 26,17 9,20 8,21 1,22 4,23 3,24 4,25 12,26 2,28 3,29 4,31 2,32 21,34 3,35 16,36 0.115,37 3,38 31,39 28.073,40 29.022,41 18.466,42 19.501,43 12,44 4}
{0 CHEMBL1230020,1 10.094,2 41.5,3 34.1,4 1.046,5 1.136,6 0.71,7 0.699,8 413.86,9 7.3,10 16,11 41,13 19,14 29,16 43,17 17,18 1,20 14,21 3,22 3,23 2,24 14,25 10,26 2,28 3,29 3,31 1,32 27,34 3,35 7.3,36 0.14,37 6,38 40,39 42.898,40 46.573,41 29.091,42 28.677,43 7.3,44 5}
{0 CHEMBL1230122,1 8.444,2 41.3,3 39.1,4 1.032,5 1.144,6 0.66,7 0.657,8 388.41,9 8.7,10 12,11 46,13 14,14 31,16 49,17 19,20 13,21 6,22 2,23 2,24 18,25 9,28 4,29 3,32 28,34 2,35 6.5,36 0.082,37 4,38 39,39 47.483,40 52.622,41 30.353,42 30.211,43 4.3,44 7.538}
{0 CHEMBL1232769,1 9.031,2 38.3,3 38.3,4 1.04,5 1.144,6 0.669,7 0.662,8 424.47,9 8.5,10 12,11 47,13 16,14 31,16 49,17 18,20 13,21 5,22 4,23 2,24 18,25 11,26 1,28 4,29 4,31 1,32 29,34 2,35 8.5,36 0.122,37 6,38 41,39 48.887,40 53.752,41 31.455,42 31.113,43 4.3,44 8.06}
{0 CHEMBL1236107,1 9.217,2 46.2,3 33.3,4 1.011,5 1.119,6 0.743,7 0.716,8 359.45,9 17.9,10 26,11 39,13 26,14 30,16 43,17 18,20 17,21 1,24 13,25 8,26 1,28 7,31 1,32 26,36 0.07,37 3,38 43,39 39.44,40 43.654,41 28.972,42 27.917,44 5}
{0 CHEMBL1236810,1 9.352,2 36.6,3 36.6,4 1.046,5 1.151,6 0.67,7 0.667,8 383.42,9 12.2,10 16,11 41,13 18,14 28,16 43,17 15,20 11,21 4,22 2,23 2,24 15,25 11,26 1,28 5,29 3,31 1,32 26,34 2,35 7.3,36 0.14,37 6,38 38,39 42.894,40 47.21,41 27.483,42 27.366,43 4.9,44 7.602}
{0 CHEMBL1240703,1 7.928,2 47.3,3 40.5,4 1.007,5 1.114,6 0.692,7 0.669,8 586.69,9 5.4,10 30,11 74,13 32,14 52,16 82,17 35,20 26,21 9,22 2,24 30,25 9,28 4,29 5,32 44,35 6.8,36 0.037,37 3,38 69,39 74.531,40 82.438,41 51.193,42 49.508,44 5}
{0 CHEMBL1241674,1 7.907,2 41,3 41,4 1.009,5 1.135,6 0.674,7 0.653,8 308.38,9 15.4,10 20,11 39,13 20,14 26,16 42,17 16,20 13,21 3,24 16,25 7,28 6,29 1,32 23,35 2.6,36 0.048,37 2,38 36,39 39.356,40 44.275,41 26.296,42 25.477,44 5}
{0 CHEMBL124660,1 6.781,2 37.3,3 50.6,4 0.998,5 1.136,6 0.633,7 0.596,8 562.79,9 7.2,10 17,11 83,13 18,14 45,16 87,17 31,20 15,21 16,22 1,24 42,25 10,28 6,29 4,32 41,35 4.8,36 0.115,37 10,38 54.5,39 82.825,40 94.301,41 52.557,42 49.47,44 5}
{0 CHEMBL1270230,1 8.216,2 44.1,3 38.2,4 1.011,5 1.128,6 0.692,7 0.674,8 279.33,9 14.7,10 17,11 34,13 18,14 23,16 36,17 15,20 15,22 1,24 13,25 6,28 5,29 1,32 21,35 2.9,36 0.083,37 3,38 32.5,39 34.371,40 38.362,41 23.529,42 22.929,44 5}
{0 CHEMBL128239,1 10.618,2 46.3,3 31.7,4 1.031,5 1.118,6 0.765,7 0.736,8 435.33,9 9.8,10 18,11 41,13 19,14 31,16 44,17 19,18 2,20 18,21 1,22 1,23 1,24 13,25 9,26 3,28 4,29 1,31 1,32 28,34 3,35 2.4,36 0.068,37 3,38 41,39 42.273,40 45.842,41 31.347,42 30.187,43 7.3,44 5.873}
{0 CHEMBL128257,1 10.179,2 46.3,3 34.1,4 1.019,5 1.11,6 0.766,7 0.727,8 417.34,9 9.8,10 18,11 41,13 19,14 30,16 44,17 19,18 2,20 18,21 1,22 1,24 14,25 8,26 3,28 4,29 1,31 1,32 27,34 2,35 2.4,36 0.068,37 3,38 40,39 41.76,40 45.502,41 31.409,42 29.803,43 4.9,44 5.561}
{0 CHEMBL128414,1 11.055,2 47.6,3 28.6,4 1.043,5 1.113,6 0.768,7 0.752,8 464.32,9 7.1,10 18,11 42,13 20,14 33,16 45,17 20,18 2,20 19,21 1,22 2,23 1,24 12,25 10,26 3,28 3,29 3,31 1,32 30,34 3,35 7.1,36 0.089,37 4,38 44,39 43.825,40 46.762,41 32.25,42 31.595,43 7.1,44 6.276}
{0 CHEMBL128440,1 12.082,2 48.7,3 28.2,4 1.033,5 1.1,6 0.824,7 0.78,8 471.2,9 7.7,10 18,11 39,13 19,14 31,16 42,17 19,18 4,20 18,21 1,22 1,24 11,25 9,26 5,28 3,29 1,31 1,32 28,34 4,35 2.6,36 0.071,37 3,38 41,39 40.306,40 42.892,41 32.119,42 30.437,43 10.3,44 6.721}
{0 CHEMBL128516,1 9.521,2 47.6,3 35.7,4 1.017,5 1.115,6 0.744,7 0.711,8 399.9,9 7.1,10 18,11 42,13 19,14 30,16 45,17 20,18 1,20 18,21 2,22 1,23 1,24 15,25 7,26 2,28 3,29 1,31 1,32 27,34 2,35 2.4,36 0.067,37 3,38 40,39 42.731,40 46.814,41 31.245,42 29.865,43 4.8,44 7.284}
{0 CHEMBL128756,1 9.521,2 47.6,3 35.7,4 1.017,5 1.115,6 0.744,7 0.711,8 399.9,9 7.1,10 18,11 42,13 19,14 30,16 45,17 20,18 1,20 18,21 2,22 1,23 1,24 15,25 7,26 2,28 3,29 1,31 1,32 27,34 2,35 2.4,36 0.067,37 3,38 40,39 42.731,40 46.814,41 31.245,42 29.865,43 4.8,44 6.614}
{0 CHEMBL1287853,1 7.188,2 37,3 49.3,4 0.999,5 1.134,6 0.65,7 0.608,8 524.76,9 8.2,10 18,11 73,13 20,14 40,16 76,17 27,20 16,21 11,22 2,24 36,25 10,26 1,28 6,29 3,31 1,32 37,35 4.1,36 0.145,37 11,38 51,39 72.923,40 82.766,41 47.466,42 44.362,44 5}
{0 CHEMBL128813,1 11.66,2 48.7,3 28.2,4 1.038,5 1.11,6 0.8,7 0.769,8 454.75,9 7.7,10 18,11 39,13 19,14 31,16 42,17 19,18 3,20 18,21 1,22 1,23 1,24 11,25 9,26 4,28 3,29 1,31 1,32 28,34 4,35 2.6,36 0.071,37 3,38 41,39 40.495,40 43.287,41 31.199,42 29.993,43 10.3,44 7.244}
{0 CHEMBL1289926,1 8.402,2 47.8,3 39.1,4 1,5 1.109,6 0.727,7 0.689,8 386.51,9 8.7,10 22,11 46,13 24,14 31,16 49,17 22,20 21,21 1,22 2,24 18,25 6,26 1,28 4,29 1,31 1,32 28,35 2.2,36 0.102,37 5,38 44,39 45.996,40 51.029,41 33.455,42 31.675,44 5}
{0 CHEMBL129174,1 9.564,2 46.7,3 37.8,4 1.009,5 1.107,6 0.754,7 0.707,8 430.38,9 6.7,10 18,11 45,13 19,14 31,16 48,17 21,18 2,20 18,21 3,22 1,24 17,25 7,26 3,28 3,29 1,31 1,32 28,34 2,35 2.2,36 0.063,37 3,38 41,39 45.425,40 49.834,41 33.926,42 31.836,43 4.4,44 6.009}
{0 CHEMBL129305,1 10.806,2 47.6,3 28.6,4 1.054,5 1.139,6 0.739,7 0.738,8 453.87,9 7.1,10 18,11 42,13 19,14 33,16 45,17 20,18 1,20 18,21 2,22 1,23 4,24 12,25 10,26 2,28 3,29 1,31 1,32 30,34 5,35 2.4,36 0.067,37 3,38 43,39 44.269,40 47.834,41 31.057,42 31.014,43 11.9,44 6.022}
{0 CHEMBL129375,1 9.54,2 45.8,3 35.4,4 1.026,5 1.118,6 0.727,7 0.705,8 457.94,9 6.3,10 18,11 48,13 20,14 34,16 51,17 22,18 1,20 19,21 3,22 2,23 1,24 17,25 9,26 2,28 3,29 3,31 1,32 31,34 2,35 6.3,36 0.098,37 5,38 45,39 49.269,40 53.648,41 34.915,42 33.821,43 4.2,44 6.602}
{0 CHEMBL129628,1 10.63,2 46.7,3 31.1,4 1.038,5 1.115,6 0.756,7 0.736,8 478.35,9 6.7,10 18,11 45,13 20,14 34,16 48,17 21,18 2,20 19,21 2,22 2,23 1,24 14,25 10,26 3,28 3,29 3,31 1,32 31,34 3,35 6.7,36 0.104,37 5,38 45,39 46.709,40 50.177,41 34.011,42 33.122,43 6.7,44 7.137}
{0 CHEMBL129704,1 9.198,2 46.7,3 37.8,4 1.014,5 1.116,6 0.733,7 0.698,8 413.93,9 6.7,10 18,11 45,13 19,14 31,16 48,17 21,18 1,20 18,21 3,22 1,23 1,24 17,25 7,26 2,28 3,29 1,31 1,32 28,34 2,35 2.2,36 0.083,37 4,38 41,39 45.614,40 50.23,41 33.006,42 31.391,43 4.4,44 6.699}
{0 CHEMBL129720,1 10.894,2 45.5,3 29.5,4 1.044,5 1.12,6 0.756,7 0.741,8 479.34,9 9.1,10 18,11 44,13 20,14 34,16 47,17 20,18 2,20 19,21 1,22 2,23 1,24 13,25 11,26 3,28 4,29 3,31 1,32 31,34 3,35 6.8,36 0.106,37 5,38 45,39 45.927,40 49.26,41 33.256,42 32.616,43 6.8,44 6.658}
{0 CHEMBL129775,1 10.508,2 47.7,3 31.8,4 1.031,5 1.113,6 0.763,7 0.737,8 462.35,9 6.8,10 18,11 44,13 20,14 33,16 47,17 21,18 2,20 19,21 2,22 2,23 1,24 14,25 9,26 3,28 3,29 2,31 1,32 30,34 3,35 4.5,36 0.085,37 4,38 44,39 45.382,40 48.968,41 33.557,42 32.407,43 6.8,44 6.678}
{0 CHEMBL131176,1 10.316,2 48.7,3 33.3,4 1.017,5 1.103,6 0.78,7 0.738,8 402.32,9 7.7,10 18,11 39,13 19,14 29,16 42,17 19,18 2,20 18,21 1,22 1,24 13,25 7,26 3,28 3,29 1,31 1,32 26,34 2,35 2.6,36 0.071,37 3,38 39,39 39.658,40 43.004,41 30.404,42 28.782,43 5.1,44 5.625}
{0 CHEMBL131194,1 12.339,2 48.7,3 30.8,4 1.023,5 1.099,6 0.814,7 0.764,8 481.21,9 7.7,10 18,11 39,13 19,14 30,15 1,16 42,17 19,18 2,20 18,21 1,22 1,24 12,25 8,26 4,28 3,29 1,31 1,32 27,34 3,35 2.6,36 0.071,37 3,38 40,39 39.887,40 42.845,41 31.756,42 29.807,43 7.7,44 5.83}
{0 CHEMBL1336,1 9.685,2 43.8,3 33.3,4 1.048,5 1.144,6 0.691,7 0.696,8 464.86,9 8.3,10 18,11 48,13 20,14 34,16 50,17 21,18 1,20 19,21 2,22 2,23 3,24 16,25 11,26 1,28 4,29 3,32 32,34 4,35 6.3,36 0.1,37 5,38 45,39 50.32,40 54.906,41 33.148,42 33.422,43 8.3,44 6.669}
{0 CHEMBL1421,1 8.272,2 37.3,3 44.1,4 1.01,5 1.134,6 0.679,7 0.642,8 488.07,9 11.9,10 17,11 59,13 18,14 36,16 62,17 22,18 1,20 14,21 8,22 1,24 26,25 11,26 2,28 7,29 2,31 1,32 33,34 1,35 3.4,36 0.113,37 7,38 45.5,39 59.603,40 66.923,41 40.068,42 37.862,43 1.7,44 6.387}
{0 CHEMBL14762,1 6.817,2 36.5,3 50,4 0.996,5 1.141,6 0.637,7 0.598,8 354.51,9 11.5,10 16,11 52,13 16,14 28,16 54,17 19,20 11,21 8,24 26,25 7,28 6,29 1,32 26,35 1.9,36 0.148,37 8,38 36,39 51.774,40 59.351,41 33.103,42 31.111,44 5}
{0 CHEMBL1614701,1 10.898,2 40.5,3 35.7,4 1.039,5 1.135,6 0.711,7 0.694,8 457.71,9 9.5,10 16,11 42,13 17,14 29,15 1,16 44,17 17,18 1,20 14,21 3,22 1,23 1,24 15,25 10,26 2,28 4,29 3,32 27,34 3,35 7.1,36 0.136,37 6,38 38,39 43.64,40 47.653,41 29.864,42 29.154,43 7.1,44 5}
{0 CHEMBL162,1 7.649,2 45.9,3 42.6,4 1.002,5 1.118,6 0.685,7 0.656,8 466.58,9 6.6,10 24,11 61,13 25,14 42,16 68,17 28,20 19,21 9,22 1,24 26,25 7,28 4,29 3,32 35,35 4.9,36 0.029,37 2,38 55,39 61.109,40 68.189,41 41.762,42 40.025,44 5}
{0 CHEMBL1721885,1 7.501,2 39,3 45.8,4 1.014,5 1.138,6 0.643,7 0.621,8 442.54,9 6.8,10 11,11 59,13 14,14 35,16 62,17 23,20 14,21 9,22 3,23 1,24 27,25 9,28 4,29 4,32 32,34 1,35 6.8,36 0.097,37 6,38 43.5,39 59.832,40 67.153,41 37.915,42 36.65,43 1.7,44 5}
{0 CHEMBL1738710,1 9.181,2 42.9,3 36.7,4 1.039,5 1.137,6 0.682,7 0.679,8 449.87,9 6.1,10 12,11 49,13 16,14 33,16 51,17 21,18 1,20 17,21 4,22 4,23 2,24 18,25 10,26 1,28 3,29 4,32 31,34 3,35 8.2,36 0.137,37 7,38 43,39 50.916,40 55.693,41 33.421,42 33.259,43 6.1,44 6.604}
{0 CHEMBL1765781,1 7.176,2 39.4,3 47,4 1,5 1.135,6 0.653,7 0.62,8 473.64,9 10.6,10 12,11 66,13 16,14 39,16 70,17 26,20 16,21 10,22 4,24 31,25 9,28 7,29 2,32 35,35 3,36 0.1,37 7,38 49,39 65.97,40 74.889,41 43.086,42 40.901,44 6}
{0 CHEMBL1773329,1 8.322,2 32.8,3 44.8,4 1.021,5 1.138,6 0.659,7 0.627,8 482.65,9 10.3,10 12,11 58,13 16,14 35,16 61,17 19,20 10,21 9,22 4,24 26,25 13,26 2,28 6,29 5,31 2,32 32,35 8.6,36 0.098,37 6,38 45,39 59.236,40 66.029,41 38.216,42 36.345,44 6.678}
{0 CHEMBL1773334,1 7.455,2 35.2,3 48.1,4 1.003,5 1.139,6 0.652,7 0.611,8 402.58,9 11.1,10 12,11 54,13 14,14 31,16 57,17 19,20 10,21 9,22 2,24 26,25 9,26 1,28 6,29 2,31 1,32 28,35 3.7,36 0.088,37 5,38 39,39 54.178,40 61.481,41 35.205,42 33.013,44 4.523}
{0 CHEMBL1784172,1 7.499,2 42.9,3 44.9,4 1.006,5 1.131,6 0.663,7 0.636,8 367.46,9 6.1,10 12,11 49,13 14,14 30,16 52,17 21,20 13,21 8,22 2,23 1,24 22,25 6,28 3,29 2,32 27,34 1,35 4.1,36 0.115,37 6,38 38,39 49.309,40 55.405,41 32.478,42 31.145,43 2,44 7.6}
{0 CHEMBL1784173,1 7.245,2 41.2,3 47.1,4 1.004,5 1.134,6 0.652,7 0.621,8 369.48,9 5.9,10 12,11 51,13 14,14 29,16 53,17 21,20 13,21 8,22 2,23 1,24 24,25 6,28 3,29 2,32 27,34 1,35 3.9,36 0.113,37 6,38 37,39 51.192,40 57.821,41 33.239,42 31.672,43 2,44 6.8}
{0 CHEMBL1789941,1 7.473,2 41.5,3 43.9,4 0.998,5 1.134,6 0.673,7 0.641,8 306.41,9 14.6,10 15,11 41,13 16,14 26,16 44,17 17,19 1,20 9,21 7,24 18,25 6,28 6,32 23,33 1,36 0.091,37 4,38 35.5,39 40.912,40 46.481,41 27.603,42 26.289,44 5}
{0 CHEMBL1795685,1 8.259,2 42.3,3 40.4,4 1.028,5 1.138,6 0.66,7 0.653,8 429.46,9 5.8,10 12,11 52,13 16,14 33,16 54,17 22,20 17,21 5,22 4,23 2,24 21,25 9,28 3,29 4,32 31,34 2,35 7.7,36 0.13,37 7,38 43,39 53.476,40 59.164,41 34.324,42 33.958,43 3.8,44 7.77}
{0 CHEMBL1795686,1 8.063,2 41.8,3 41.8,4 1.025,5 1.138,6 0.656,7 0.645,8 443.49,9 5.5,10 12,11 55,13 16,14 34,16 57,17 23,20 17,21 6,22 4,23 2,24 23,25 9,28 3,29 4,32 32,34 2,35 7.3,36 0.14,37 8,38 44,39 56.36,40 62.579,41 36.086,42 35.485,43 3.6,44 8.222}
{0 CHEMBL180022,1 8.074,2 43.5,3 42,4 1.008,5 1.124,6 0.687,7 0.658,8 557.1,9 8.7,10 23,11 69,13 26,14 43,16 72,17 30,18 1,19 1,20 23,21 6,22 2,24 29,25 10,26 1,28 6,29 3,32 40,33 1,34 1,35 4.3,36 0.153,37 11,38 58.5,39 69.52,40 77.544,41 47.392,42 45.422,43 1.4,44 5}
{0 CHEMBL1807446,1 7.737,2 45.5,3 41.8,4 1.002,5 1.121,6 0.687,7 0.66,8 425.53,9 9.1,10 22,11 55,13 24,14 36,16 59,17 25,20 20,21 5,22 2,24 23,25 7,28 5,29 2,32 32,35 3.6,36 0.102,37 6,38 49,39 55.116,40 61.647,41 37.79,42 36.278,44 7.721}
{0 CHEMBL186526,1 7.49,2 44.2,3 44.2,4 1.002,5 1.121,6 0.673,7 0.644,8 389.49,9 5.8,10 18,11 52,13 20,14 31,16 54,17 23,20 20,21 3,22 2,24 23,25 6,28 3,29 3,32 29,35 5.8,36 0.093,37 5,38 42,39 52.123,40 58.275,41 34.995,42 33.477,44 5.699}
{0 CHEMBL1908391,1 7.556,2 42.4,3 45.5,4 0.994,5 1.123,6 0.686,7 0.642,8 498.71,9 9.1,10 23,11 66,13 24,14 40,16 70,17 28,20 21,21 7,22 1,24 30,25 8,26 1,28 6,29 1,31 1,32 36,35 1.5,36 0.1,37 7,38 52.5,39 65.618,40 74.102,41 45.273,42 42.352,44 5}
{0 CHEMBL1908392,1 7.189,2 43.3,3 46.3,4 0.995,5 1.124,6 0.669,7 0.633,8 481.65,9 7.5,10 22,11 67,13 24,14 40,16 71,17 29,20 22,21 7,22 2,24 31,25 7,28 5,29 2,32 36,35 3,36 0.085,37 6,38 53,39 66.65,40 75.308,41 44.836,42 42.385,44 5}
{0 CHEMBL1908393,1 7.741,2 41.5,3 43.9,4 1.017,5 1.134,6 0.653,7 0.635,8 634.74,9 4.9,10 17,11 82,13 21,14 51,16 87,17 34,20 21,21 13,22 4,23 2,24 36,25 12,28 4,29 6,32 46,34 2,35 7.3,36 0.138,37 12,38 63.5,39 83.418,40 92.987,41 53.569,42 52.097,43 2.4,44 6.119}
{0 CHEMBL1908394,1 8.237,2 40.9,3 42.4,4 1.019,5 1.14,6 0.671,7 0.647,8 543.67,9 7.6,10 21,11 66,13 22,14 42,16 70,17 27,20 18,21 9,22 1,23 3,24 28,25 11,26 1,28 5,29 2,31 1,32 38,34 3,35 3,36 0.1,37 7,38 53.5,39 67.265,40 75.247,41 44.296,42 42.722,43 4.5,44 5}
{0 CHEMBL1908395,1 6.979,2 39.4,3 48.5,4 0.996,5 1.133,6 0.649,7 0.612,8 460.64,9 9.1,10 11,11 66,13 15,14 37,16 69,17 26,19 1,20 13,21 12,22 3,24 32,25 8,28 6,29 2,32 34,33 1,35 3,36 0.087,37 6,38 47.5,39 65.752,40 74.806,41 42.841,42 40.406,44 5}
{0 CHEMBL1908396,1 8.286,2 41.4,3 41.4,4 1.016,5 1.123,6 0.682,7 0.657,8 480.59,9 6.9,10 22,11 58,13 23,14 37,16 61,17 24,20 19,21 5,22 1,24 24,25 10,26 1,28 4,29 5,31 1,32 34,35 8.6,36 0.131,37 8,38 49,39 58.956,40 65.112,41 39.557,42 38.115,44 5}
{0 CHEMBL1908397,1 7.388,2 44.4,3 44.4,4 0.996,5 1.123,6 0.679,7 0.645,8 332.44,9 8.9,10 16,11 45,13 18,14 28,16 48,17 20,20 16,21 4,22 2,24 20,25 5,28 4,29 1,32 25,35 2.2,36 0.063,37 3,38 38,39 44.803,40 50.524,41 30.569,42 29.015,44 5.854}
{0 CHEMBL191003,1 10.113,2 38.5,3 30.8,4 1.057,5 1.151,6 0.691,7 0.701,8 394.4,9 15.4,10 17,11 39,13 20,14 29,16 41,17 15,20 15,22 3,23 2,24 12,25 12,26 1,28 6,29 3,31 1,32 27,34 2,35 7.7,36 0.098,37 4,38 40.5,39 41.229,40 44.878,41 26.966,42 27.334,43 5.1,44 5}
{0 CHEMBL1916359,1 11.342,2 54.1,3 27,4 1.036,5 1.105,6 0.799,7 0.778,8 419.67,9 5.4,10 23,11 37,13 24,14 30,16 40,17 20,18 3,20 20,22 1,23 1,24 10,25 7,26 3,28 2,29 1,32 27,34 4,35 2.7,36 0.05,37 2,38 42.5,39 38.316,40 40.869,41 29.546,42 28.784,43 10.8,44 5}
{0 CHEMBL1929238,1 8.038,2 36.2,3 47.8,4 1.007,5 1.133,6 0.669,7 0.623,8 554.6,9 7.2,10 11,11 69,13 14,14 38,16 71,17 25,18 2,20 13,21 12,22 3,24 33,25 11,26 3,28 5,29 3,31 1,32 36,34 2,35 4.3,36 0.099,37 7,38 46.5,39 69.469,40 78.156,41 46.176,42 42.995,43 2.9,44 7.301}
{0 CHEMBL1938400,1 8.541,2 42.7,3 41.5,4 1.007,5 1.118,6 0.71,7 0.669,8 700.35,9 8.5,10 33,11 82,13 34,14 53,16 87,17 35,18 1,20 28,21 7,22 1,24 34,25 13,26 3,28 7,29 3,31 2,32 48,34 1,35 3.7,36 0.126,37 11,38 70.5,39 82.541,40 91.713,41 58.216,42 54.871,43 1.2,44 7.638}
{0 CHEMBL199679,1 8.331,2 46.2,3 43.1,4 1.007,5 1.123,6 0.7,7 0.663,8 541.5,9 3.1,10 18,11 65,13 20,14 41,16 69,17 30,18 2,20 21,21 9,22 2,23 2,24 28,25 7,26 2,28 2,29 1,32 37,34 4,35 1.5,36 0.058,37 4,38 52,39 65.458,40 73.001,41 45.478,42 43.081,43 6.2,44 9.602}
{0 CHEMBL203567,1 8.253,2 42.2,3 40,4 1.027,5 1.133,6 0.664,7 0.656,8 371.4,9 6.7,10 17,11 45,13 18,14 29,16 47,17 19,20 16,21 3,22 1,23 1,24 18,25 8,28 3,29 4,32 27,34 1,35 8.9,36 0.149,37 7,38 38.5,39 46.196,40 50.994,41 29.864,42 29.521,43 2.2,44 7.301}
{0 CHEMBL2070412,1 8.066,2 42.5,3 43.8,4 1.003,5 1.116,6 0.696,7 0.653,8 588.81,9 5.5,10 18,11 73,13 22,14 45,16 77,17 31,20 23,21 8,22 4,24 32,25 10,26 2,28 4,29 4,31 2,32 41,35 5.5,36 0.13,37 10,38 58,39 73.24,40 81.484,41 50.796,42 47.694,44 4.523}
{0 CHEMBL2070413,1 8.066,2 42.5,3 43.8,4 1.003,5 1.116,6 0.696,7 0.653,8 588.81,9 5.5,10 18,11 73,13 22,14 45,16 77,17 31,20 23,21 8,22 4,24 32,25 10,26 2,28 4,29 4,31 2,32 41,35 5.5,36 0.13,37 10,38 58,39 73.24,40 81.484,41 50.796,42 47.694,44 4.523}
{0 CHEMBL2070416,1 8.232,2 44.1,3 42.6,4 1.004,5 1.111,6 0.706,7 0.664,8 559.76,9 4.4,10 18,11 68,13 22,14 43,16 72,17 30,20 23,21 7,22 4,24 29,25 9,26 2,28 3,29 4,31 2,32 39,35 5.9,36 0.139,37 10,38 56,39 68.254,40 75.57,41 48.029,42 45.146,44 4.523}
{0 CHEMBL215152,1 7.577,2 38.8,3 44.8,4 1.012,5 1.141,6 0.649,7 0.627,8 507.63,9 10.4,10 22,11 67,13 23,14 40,16 70,17 26,20 18,21 8,22 1,23 1,24 30,25 11,28 7,29 3,32 37,34 1,35 4.5,36 0.186,37 13,38 52,39 67.81,40 76.438,41 43.478,42 41.999,43 1.5,44 5}
{0 CHEMBL215803,1 7.911,2 43.1,3 41.2,4 1.011,5 1.126,6 0.676,7 0.656,8 403.48,9 9.8,10 21,11 51,13 21,14 35,16 56,17 22,20 15,21 7,24 21,25 8,28 5,29 3,32 30,35 5.9,38 45.5,39 51.56,40 57.441,41 34.483,42 33.466,44 6}
{0 CHEMBL2170294,1 7.991,2 44.4,3 40.7,4 1.012,5 1.129,6 0.68,7 0.66,8 431.51,9 9.3,10 17,11 54,13 20,14 36,16 58,17 24,20 19,21 5,22 3,23 1,24 22,25 8,28 5,29 2,32 32,34 1,35 3.7,36 0.069,37 4,38 47.5,39 54.629,40 60.987,41 36.728,42 35.661,43 1.9,44 7.444}
{0 CHEMBL218661,1 8.204,2 41,3 44.3,4 1.007,5 1.128,6 0.685,7 0.648,8 500.47,9 8.2,10 12,11 61,13 16,14 37,16 64,17 25,18 2,20 17,21 8,22 4,24 27,25 9,26 2,28 5,29 2,32 34,34 2,35 3.3,36 0.141,37 9,38 47,39 61.414,40 68.781,41 41.79,42 39.513,43 3.3,44 7.509}
{0 CHEMBL2205766,1 8.249,2 35.7,3 42.9,4 1.015,5 1.139,6 0.67,7 0.641,8 346.46,9 14.3,10 16,11 42,13 18,14 26,16 44,17 15,20 11,21 4,22 2,24 18,25 9,26 1,28 6,29 2,31 1,32 24,35 4.8,36 0.091,37 4,38 36,39 42.643,40 47.82,41 28.159,42 26.906,44 5}
{0 CHEMBL221071,1 10.423,2 48.6,3 31.4,4 1.036,5 1.121,6 0.755,7 0.734,8 364.82,9 5.7,10 12,11 35,13 15,14 26,16 37,17 17,18 1,20 16,21 1,22 3,23 2,24 11,25 7,26 2,28 2,29 1,31 1,32 24,34 3,35 2.9,36 0.081,37 3,38 35,39 36.258,40 39.241,41 26.415,42 25.7,43 8.6,44 6.071}
{0 CHEMBL221246,1 8.526,2 40.7,3 42.6,4 1.012,5 1.129,6 0.69,7 0.657,8 460.4,9 9.3,10 12,11 54,13 16,14 33,16 56,17 22,18 2,20 17,21 5,22 4,24 23,25 9,26 2,28 5,29 2,32 31,34 2,35 3.7,36 0.161,37 9,38 43,39 54.647,40 60.95,41 37.267,42 35.46,43 3.7,44 7.538}
{0 CHEMBL221312,1 9.856,2 45,3 35,4 1.033,5 1.126,6 0.723,7 0.705,8 394.25,9 7.5,10 12,11 40,13 15,14 28,16 42,17 18,18 2,20 16,21 2,22 3,23 1,24 14,25 8,26 2,28 3,29 2,32 26,34 3,35 5,36 0.119,37 5,38 37,39 41.305,40 45.048,41 28.909,42 28.22,43 7.5,44 6.87}
{0 CHEMBL221546,1 8.848,2 43.2,3 40.9,4 1.01,5 1.123,6 0.711,7 0.674,8 389.31,9 9.1,10 12,11 44,13 15,14 28,16 46,17 19,18 2,20 16,21 3,22 3,24 18,25 7,26 2,28 4,29 1,32 26,34 2,35 2.3,36 0.13,37 6,38 37,39 44.451,40 49.412,41 31.284,42 29.67,43 4.5,44 6.676}
{0 CHEMBL221547,1 9.275,2 48.2,3 35.7,4 1.018,5 1.112,6 0.731,7 0.708,8 519.41,9 7.1,10 18,11 56,13 23,14 40,16 60,17 27,18 2,20 24,21 3,22 5,24 20,25 9,26 2,28 4,29 3,32 36,34 2,35 5.4,36 0.117,37 7,38 54,39 56.989,40 62.246,41 40.955,42 39.626,43 3.6,44 7.824}
{0 CHEMBL221595,1 9.596,2 48.2,3 33.9,4 1.027,5 1.118,6 0.73,7 0.714,8 537.4,9 7.1,10 18,11 56,13 23,14 41,16 60,17 27,18 2,20 24,21 3,22 5,23 1,24 19,25 10,26 2,28 4,29 3,32 37,34 3,35 5.4,36 0.117,37 7,38 55,39 57.502,40 62.586,41 40.892,42 40.009,43 5.4,44 7.699}
{0 CHEMBL221648,1 8.204,2 41,3 44.3,4 1.007,5 1.128,6 0.685,7 0.648,8 500.47,9 8.2,10 12,11 61,13 16,14 37,16 64,17 25,18 2,20 17,21 8,22 4,24 27,25 9,26 2,28 5,29 2,32 34,34 2,35 3.3,36 0.125,37 8,38 47,39 61.414,40 68.781,41 41.79,42 39.513,43 3.3,44 7.538}
{0 CHEMBL221700,1 8.73,2 41.5,3 41.5,4 1.025,5 1.14,6 0.679,7 0.657,8 567.48,9 6.2,10 12,11 65,13 16,14 41,16 68,17 27,18 2,20 17,21 10,22 4,23 3,24 27,25 11,26 2,28 4,29 2,32 38,34 5,35 3.1,36 0.118,37 8,38 51,39 66.618,40 74.132,41 44.12,42 42.695,43 7.7,44 8.699}
{0 CHEMBL221791,1 8.661,2 47.2,3 38.9,4 1.007,5 1.115,6 0.719,7 0.688,8 311.79,9 8.3,10 12,11 36,13 15,14 24,16 38,17 17,18 1,20 16,21 1,22 3,24 14,25 5,26 1,28 3,29 1,32 22,34 1,35 2.8,36 0.079,37 3,38 33,39 36.258,40 40.14,41 25.898,42 24.767,43 2.8,44 6.347}
{0 CHEMBL221959,1 7.266,2 37.2,3 46.5,4 1.003,5 1.142,6 0.647,7 0.617,8 312.42,9 14,10 10,11 43,13 12,14 25,16 45,17 16,19 1,20 7,21 8,22 1,24 20,25 7,28 6,29 1,32 23,33 1,35 2.3,36 0.067,37 3,38 33,39 43.123,40 49.106,41 27.819,42 26.531,44 5}
{0 CHEMBL222109,1 10.067,2 48.5,3 33.3,4 1.021,5 1.111,6 0.757,7 0.729,8 332.2,9 9.1,10 12,11 33,13 15,14 24,16 35,17 16,18 2,20 16,22 3,24 11,25 6,26 2,28 3,29 1,32 22,34 2,35 3,36 0.086,37 3,38 33,39 33.698,40 36.668,41 24.994,42 24.068,43 6.1,44 6.004}
{0 CHEMBL223360,1 8.162,2 45.7,3 39.1,4 1.012,5 1.129,6 0.69,7 0.672,8 375.44,9 10.9,10 22,11 46,13 23,14 31,16 49,17 21,20 20,21 1,22 1,23 1,24 18,25 7,28 5,29 1,32 28,34 1,35 2.2,36 0.061,37 3,38 43,39 46.534,40 51.947,41 31.75,42 30.893,43 2.2,44 5}
{0 CHEMBL225088,1 6.537,2 33.3,3 52.8,4 0.996,5 1.148,6 0.616,7 0.576,8 470.7,9 11.1,10 12,11 72,13 13,14 36,16 74,17 24,20 10,21 14,22 1,24 38,25 10,28 8,29 2,32 34,35 2.8,36 0.108,37 8,38 43,39 71.723,40 82.633,41 44.376,42 41.503,44 7.658}
{0 CHEMBL225519,1 7.899,2 44.4,3 40.7,4 1.006,5 1.125,6 0.686,7 0.662,8 213.26,9 11.1,10 11,11 27,13 12,14 18,16 29,17 12,20 10,21 2,22 1,24 11,25 4,28 3,29 1,32 16,35 3.7,36 0.034,37 1,38 24.5,39 27.167,40 30.365,41 18.517,42 17.886,44 5}
{0 CHEMBL22978,1 7.683,2 43.5,3 43.5,4 1.009,5 1.13,6 0.668,7 0.644,8 353.43,9 6.5,10 17,11 46,13 17,14 29,16 49,17 20,20 14,21 6,23 1,24 20,25 6,28 3,29 2,32 26,34 1,35 4.3,36 0.061,37 3,38 37.5,39 46.425,40 51.99,41 30.716,42 29.618,43 2.2,44 5.618}
{0 CHEMBL230011,1 8.659,2 45,3 35,4 1.02,5 1.127,6 0.7,7 0.692,8 346.38,9 15,10 23,11 40,13 23,14 29,16 43,17 18,20 18,24 14,25 8,28 6,29 2,32 26,35 5,36 0.047,37 2,38 40.5,39 40.8,40 45.069,41 27.989,42 27.665,44 5}
{0 CHEMBL2309006,1 8.139,2 48.1,3 38.9,4 1.011,5 1.112,6 0.698,7 0.679,8 439.5,9 5.6,10 24,11 54,13 25,14 40,16 61,17 26,20 19,21 7,22 1,24 21,25 7,28 3,29 4,32 33,35 7.4,36 0.016,37 1,38 53,39 54.567,40 60.069,41 37.688,42 36.665,44 5}
{0 CHEMBL2309609,1 7.818,2 47.9,3 41.1,4 1.003,5 1.113,6 0.695,7 0.668,8 570.69,9 5.5,10 30,11 73,13 32,14 51,16 81,17 35,20 26,21 9,22 2,24 30,25 8,28 4,29 4,32 43,35 5.5,36 0.037,37 3,38 68,39 73.203,40 81.228,41 50.739,42 48.793,44 5}
{0 CHEMBL231568,1 8.194,2 41.9,3 41.9,4 1.014,5 1.126,6 0.679,7 0.655,8 508.02,9 8.1,10 22,11 62,13 23,14 40,16 66,17 26,18 1,20 19,21 7,22 1,24 26,25 10,26 1,28 5,29 4,32 36,34 1,35 6.5,36 0.121,37 8,38 52,39 62.862,40 69.84,41 42.08,42 40.588,43 1.6,44 4.398}
{0 CHEMBL24828,1 8.804,2 40.7,3 44.4,4 1.01,5 1.133,6 0.678,7 0.643,8 475.4,9 7.4,10 17,11 54,13 17,14 33,15 1,16 57,17 22,20 14,21 8,23 1,24 24,25 8,26 1,28 4,29 2,32 30,34 2,35 3.7,36 0.105,37 6,38 41.5,39 54.523,40 61.161,41 36.597,42 34.718,43 3.7,44 5}
{0 CHEMBL249697,1 7.093,2 38.9,3 47.2,4 0.995,5 1.138,6 0.655,7 0.619,8 255.36,9 13.9,10 15,11 36,13 15,14 21,16 38,17 14,20 10,21 4,24 17,25 5,28 5,32 19,36 0.079,37 3,38 28.5,39 35.811,40 40.983,41 23.597,42 22.268,44 5}
{0 CHEMBL252128,1 7.649,2 38,3 44,4 1.013,5 1.139,6 0.65,7 0.63,8 382.47,9 12,10 16,11 50,13 18,14 30,16 52,17 19,20 14,21 5,22 2,24 22,25 9,28 6,29 3,32 28,35 6,36 0.115,37 6,38 40,39 50.662,40 56.94,41 32.489,42 31.487,44 7.824}
{0 CHEMBL255863,1 8.681,2 45.9,3 36.1,4 1.025,5 1.139,6 0.691,7 0.685,8 529.57,9 11.5,10 29,11 61,13 30,14 43,16 65,17 28,20 25,21 3,22 1,23 3,24 22,25 11,28 7,29 1,32 39,34 3,35 1.6,36 0.092,37 6,38 58.5,39 62.53,40 69.453,41 42.159,42 41.756,43 4.9,44 7.444}
{0 CHEMBL258202,1 7.533,2 37,3 47.8,4 1.002,5 1.132,6 0.662,7 0.618,8 346.5,9 8.7,10 11,11 46,13 13,14 25,16 47,17 17,20 11,21 6,22 2,24 22,25 7,26 1,28 4,29 2,31 1,32 24,35 4.3,36 0.128,37 6,38 32.5,39 46.091,40 52.069,41 30.432,42 28.444,44 8.824}
{0 CHEMBL259084,1 9.732,2 51,3 30.6,4 1.033,5 1.121,6 0.735,7 0.731,8 476.89,9 8.2,10 24,11 49,13 26,14 38,16 53,17 25,18 1,20 24,21 1,22 2,23 2,24 15,25 9,26 1,28 4,29 2,32 34,34 3,35 4.1,36 0.075,37 4,38 52,39 50.596,40 54.942,41 35.995,42 35.797,43 6.1,44 5}
{0 CHEMBL261849,1 7.479,2 40.8,3 44.9,4 1.007,5 1.13,6 0.658,7 0.632,8 366.46,9 8.2,10 18,11 49,13 18,14 29,16 51,17 20,20 16,21 4,24 22,25 7,28 4,29 3,32 27,35 6.1,36 0.137,37 7,38 38,39 49.342,40 55.358,41 32.239,42 30.971,44 5}
{0 CHEMBL271271,1 7.658,2 46.3,3 42.6,4 1.002,5 1.116,6 0.685,7 0.657,8 413.51,9 5.6,10 23,11 54,13 24,14 34,16 57,17 25,20 21,21 4,22 1,24 23,25 6,28 3,29 3,32 31,35 5.6,36 0.105,37 6,38 46.5,39 54.123,40 60.275,41 36.995,42 35.477,44 6.476}
{0 CHEMBL273158,1 7.393,2 44.7,3 44.7,4 0.998,5 1.12,6 0.676,7 0.643,8 347.45,9 6.4,10 17,11 47,13 18,14 29,16 50,17 21,20 15,21 6,22 1,24 21,25 5,28 3,29 2,32 26,35 4.3,36 0.1,37 5,38 38.5,39 46.912,40 52.651,41 31.779,42 30.235,44 5.745}
{0 CHEMBL278041,1 8.497,2 51.3,3 35.9,4 1.011,5 1.116,6 0.717,7 0.701,8 331.37,9 7.7,10 23,11 39,13 23,14 28,16 42,17 20,20 20,23 1,24 14,25 5,28 3,29 1,32 25,34 1,35 2.6,36 0.071,37 3,38 39.5,39 39.447,40 43.535,41 27.978,42 27.323,43 2.6,44 7.248}
{0 CHEMBL288441,1 8.162,2 40,3 44.6,4 1.01,5 1.129,6 0.677,7 0.642,8 530.5,9 7.7,10 17,11 65,13 18,14 39,16 68,17 26,18 2,19 1,20 15,21 10,24 29,25 10,26 2,28 5,29 3,32 36,33 1,34 2,35 4.6,36 0.132,37 9,38 49.5,39 65.625,40 73.405,41 44.006,42 41.755,43 3.1,44 5}
{0 CHEMBL288812,1 6.991,2 40.4,3 48.1,4 0.994,5 1.132,6 0.656,7 0.617,8 363.51,9 9.6,10 17,11 52,13 18,14 29,16 54,17 21,20 15,21 6,22 1,24 25,25 6,28 5,29 1,32 27,35 1.9,36 0.093,37 5,38 38.5,39 51.672,40 58.853,41 34.097,42 32.09,44 6.959}
{0 CHEMBL296468,1 7.767,2 34.7,3 49,4 1.001,5 1.131,6 0.67,7 0.615,8 380.59,9 8.2,10 10,11 49,13 11,14 27,16 51,17 17,20 7,21 10,22 1,24 24,25 8,26 2,28 4,29 2,31 2,32 25,35 4.1,36 0.118,37 6,38 33,39 49.051,40 55.404,41 32.841,42 30.157,44 5}
{0 CHEMBL300138,1 7.583,2 47.1,3 42.6,4 0.997,5 1.116,6 0.692,7 0.66,8 515.66,9 7.4,10 26,11 68,13 29,14 45,16 74,17 32,20 25,21 7,22 3,24 29,25 7,28 5,29 2,32 39,35 2.9,36 0.068,37 5,38 61,39 67.767,40 75.893,41 47.074,42 44.858,44 5}
{0 CHEMBL303144,1 7.547,2 43.3,3 44.8,4 1.006,5 1.139,6 0.664,7 0.636,8 505.64,9 7.5,10 23,11 67,13 23,14 41,16 71,17 29,20 20,21 9,23 3,24 30,25 8,28 5,32 37,34 3,36 0.085,37 6,38 52.5,39 67.418,40 76.323,41 44.501,42 42.632,43 4.5,44 10}
{0 CHEMBL316275,1 8.722,2 48.9,3 37.8,4 1.011,5 1.111,6 0.724,7 0.695,8 392.48,9 4.4,10 23,11 45,13 25,14 31,16 48,17 22,20 21,21 1,22 2,23 1,24 17,25 6,26 1,28 2,29 2,31 1,32 28,34 1,35 4.4,36 0.083,37 4,38 44.5,39 45.516,40 49.997,41 32.597,42 31.257,43 2.2,44 8}
{0 CHEMBL31965,1 8.237,2 40.7,3 42.4,4 1.018,5 1.135,6 0.671,7 0.648,8 485.99,9 8.5,10 17,11 59,13 19,14 37,16 62,17 24,18 1,20 17,21 7,22 2,23 1,24 25,25 10,26 1,28 5,29 3,32 34,34 2,35 5.1,36 0.145,37 9,38 47.5,39 60.047,40 66.971,41 39.563,42 38.257,43 3.4,44 5}
{0 CHEMBL335878,1 9.286,2 46.5,3 37.2,4 1.013,5 1.116,6 0.733,7 0.701,8 399.3,9 9.3,10 18,11 43,13 19,14 30,16 46,17 20,18 2,20 18,21 2,22 1,24 16,25 7,26 2,28 4,29 1,32 27,34 2,35 2.3,36 0.087,37 4,38 40,39 43.567,40 47.997,41 31.523,42 30.143,43 4.7,44 6.009}
{0 CHEMBL338612,1 9.894,2 48.7,3 33.3,4 1.022,5 1.113,6 0.756,7 0.727,8 385.87,9 7.7,10 18,11 39,13 19,14 29,16 42,17 19,18 1,20 18,21 1,22 1,23 1,24 13,25 7,26 2,28 3,29 1,31 1,32 26,34 2,35 2.6,36 0.071,37 3,38 39,39 39.847,40 43.399,41 29.483,42 28.338,43 5.1,44 6.276}
{0 CHEMBL339095,1 10.055,2 46.5,3 34.9,4 1.02,5 1.108,6 0.759,7 0.721,8 432.35,9 7,10 18,11 43,13 19,14 31,16 46,17 20,18 2,20 18,21 2,22 1,24 15,25 8,26 3,28 3,29 2,31 1,32 28,34 2,35 4.7,36 0.087,37 4,38 41,39 43.869,40 47.628,41 32.619,42 31.024,43 4.7,44 5.465}
{0 CHEMBL340687,1 11.199,2 48.7,3 30.8,4 1.025,5 1.101,6 0.802,7 0.759,8 436.76,9 7.7,10 18,11 39,13 19,14 30,16 42,17 19,18 3,20 18,21 1,22 1,24 12,25 8,26 4,28 3,29 1,31 1,32 27,34 3,35 2.6,36 0.071,37 3,38 40,39 39.982,40 42.948,41 31.261,42 29.609,43 7.7,44 5.827}
{0 CHEMBL363648,1 7.991,2 48,3 42,4 0.993,5 1.107,6 0.719,7 0.674,8 399.55,9 6,10 23,11 50,13 24,14 32,16 53,17 24,20 21,21 3,22 1,24 21,25 5,26 1,28 3,29 1,31 1,32 29,35 2,36 0.094,37 5,38 44.5,39 49.662,40 55.361,41 35.972,42 33.707,44 6.699}
{0 CHEMBL365847,1 7.089,2 39.7,3 47.6,4 0.998,5 1.133,6 0.652,7 0.617,8 446.61,9 9.5,10 12,11 63,13 15,14 37,16 67,17 25,20 14,21 11,22 3,24 30,25 8,28 6,29 2,32 33,35 3.2,36 0.075,37 5,38 46,39 62.869,40 71.391,41 41.08,42 38.88,44 5}
{0 CHEMBL373767,1 8.859,2 45.9,3 37.8,4 1.016,5 1.118,6 0.712,7 0.689,8 327.79,9 8.1,10 12,11 37,13 15,14 25,16 39,17 17,18 1,20 16,21 1,22 3,24 14,25 6,26 1,28 3,29 2,32 23,34 1,35 5.4,36 0.103,37 4,38 34,39 37.585,40 41.349,41 26.352,42 25.482,43 2.7,44 6.036}
{0 CHEMBL373934,1 10.4,2 50,3 31.3,4 1.027,5 1.109,6 0.772,7 0.743,8 332.8,9 6.3,10 12,11 32,13 15,14 24,16 34,17 16,18 1,20 16,22 3,23 1,24 10,25 6,26 2,28 2,29 1,31 1,32 22,34 2,35 3.1,36 0.088,37 3,38 33,39 32.862,40 35.486,41 24.716,42 23.79,43 6.3,44 6.347}
{0 CHEMBL374216,1 8.254,2 42,3 43.5,4 1.011,5 1.124,6 0.684,7 0.652,8 569.53,9 5.8,10 18,11 69,13 21,14 42,16 72,17 29,18 2,20 22,21 7,22 3,24 30,25 10,26 2,28 4,29 4,32 39,34 2,35 5.8,36 0.167,37 12,38 54,39 69.734,40 77.532,41 47.216,42 44.975,43 2.9,44 6.222}
{0 CHEMBL376045,1 8.752,2 41.2,3 41.2,4 1.015,5 1.128,6 0.696,7 0.665,8 446.37,9 9.8,10 12,11 51,13 16,14 32,16 53,17 21,18 2,20 17,21 4,22 4,24 21,25 9,26 2,28 5,29 2,32 30,34 2,35 3.9,36 0.151,37 8,38 42,39 51.763,40 57.535,41 35.506,42 33.933,43 3.9,44 7.387}
{0 CHEMBL377300,1 8.053,2 41.3,3 41.3,4 1.021,5 1.137,6 0.661,7 0.648,8 370.42,9 8.7,10 20,11 46,13 20,14 30,16 49,17 19,20 14,21 5,23 1,24 19,25 8,28 4,29 3,32 27,34 1,35 6.5,36 0.102,37 5,38 40,39 46.971,40 52.283,41 30.415,42 29.828,43 2.2,44 5}
{0 CHEMBL379218,1 7.316,2 44.9,3 44.9,4 0.994,5 1.121,6 0.68,7 0.644,8 358.48,9 8.2,10 22,11 49,13 22,14 30,16 52,17 22,20 18,21 4,24 22,25 5,28 4,29 1,32 27,35 2,36 0.115,37 6,38 41,39 48.687,40 54.939,41 33.33,42 31.542,44 5}
{0 CHEMBL383172,1 7.912,2 41.2,3 41.2,4 1.011,5 1.134,6 0.672,7 0.652,8 403.49,9 13.7,10 17,11 51,13 19,14 33,16 54,17 21,19 1,20 14,21 6,22 1,24 21,25 9,28 7,29 2,32 30,33 1,35 3.9,36 0.111,37 6,38 44.5,39 51.552,40 57.813,41 34.279,42 33.267,44 7}
{0 CHEMBL384304,1 8.657,2 35.3,3 41.2,4 1.037,5 1.15,6 0.651,7 0.64,8 441.51,9 9.8,10 12,11 51,13 15,14 32,16 53,17 18,20 11,21 7,22 3,23 2,24 21,25 12,26 1,28 5,29 4,31 1,32 30,34 2,35 7.8,36 0.113,37 6,38 41,39 52.872,40 58.665,41 33.222,42 32.661,43 3.9,44 5}
{0 CHEMBL386051,1 9.853,2 46.7,3 35.6,4 1.014,5 1.109,6 0.759,7 0.718,8 443.38,9 8.9,10 18,11 45,13 20,14 32,16 48,17 21,18 2,20 19,21 2,22 2,24 16,25 8,26 3,28 4,29 1,31 1,32 29,34 2,35 2.2,36 0.083,37 4,38 43,39 45.644,40 49.917,41 34.171,42 32.33,43 4.4,44 7.013}
{0 CHEMBL412281,1 7.75,2 42,3 42,4 1.005,5 1.132,6 0.676,7 0.651,8 387.49,9 14,10 22,11 50,13 23,14 32,16 53,17 21,20 18,21 3,22 1,24 21,25 8,28 7,29 1,32 29,35 2,36 0.094,37 5,38 44,39 50.225,40 56.604,41 33.824,42 32.552,44 7.921}
{0 CHEMBL428690,1 8.372,2 43.8,3 41.7,4 1.019,5 1.118,6 0.682,7 0.66,8 401.87,9 2.1,10 12,11 48,13 14,14 31,16 51,17 21,18 1,20 15,21 6,22 2,24 20,25 7,26 1,28 1,29 5,32 28,34 1,35 10.4,36 0.039,37 2,38 39,39 48.898,40 53.641,41 32.75,42 31.691,43 2.1,44 5}
{0 CHEMBL434434,1 9.377,2 42.1,3 38.6,4 1.022,5 1.126,6 0.717,7 0.685,8 534.48,9 8.8,10 18,11 57,13 20,14 38,16 60,17 24,18 2,20 19,21 5,22 2,23 1,24 22,25 11,26 3,28 5,29 2,31 1,32 35,34 3,35 3.5,36 0.117,37 7,38 49,39 58.236,40 64.21,41 40.852,42 39.03,43 5.3,44 5.91}
{0 CHEMBL440084,1 8.543,2 48.9,3 35.6,4 1.015,5 1.114,6 0.71,7 0.698,8 384.42,9 8.9,10 23,11 45,13 24,14 33,16 49,17 22,20 21,21 1,22 1,24 16,25 7,28 4,29 3,32 29,35 6.7,36 0.082,37 4,38 45.5,39 45.691,40 50.113,41 31.955,42 31.391,44 5}
{0 CHEMBL443285,1 9.913,2 47.6,3 35.7,4 1.013,5 1.105,6 0.766,7 0.722,8 416.35,9 7.1,10 18,11 42,13 19,14 30,16 45,17 20,18 2,20 18,21 2,22 1,24 15,25 7,26 3,28 3,29 1,31 1,32 27,34 2,35 2.4,36 0.067,37 3,38 40,39 42.542,40 46.419,41 32.165,42 30.309,43 4.8,44 6.097}
{0 CHEMBL445813,1 9.102,2 38.1,3 40.5,4 1.024,5 1.136,6 0.69,7 0.664,8 382.28,9 11.9,10 11,11 42,13 13,14 27,16 44,17 16,18 2,20 11,21 5,22 2,24 17,25 9,26 2,28 5,29 2,32 25,34 2,35 4.8,36 0.091,37 4,38 34.5,39 42.996,40 47.705,41 28.983,42 27.879,43 4.8,44 5}
{0 CHEMBL450786,1 8.333,2 41.6,3 44.2,4 1.008,5 1.121,6 0.693,7 0.652,8 641.67,9 5.2,10 17,11 77,13 22,14 48,16 82,17 32,18 2,20 20,21 12,22 5,24 34,25 11,26 3,28 4,29 4,31 1,32 43,34 2,35 5.2,36 0.085,37 7,38 61.5,39 77.578,40 86.282,41 53.387,42 50.216,43 2.6,44 5}
{0 CHEMBL464552,1 7.833,2 39.7,3 42.6,4 1.015,5 1.14,6 0.658,7 0.64,8 532.64,9 11.8,10 22,11 68,13 24,14 43,16 72,17 27,20 20,21 7,22 2,23 1,24 29,25 12,28 8,29 3,32 39,34 1,35 4.4,36 0.111,37 8,38 56,39 69.029,40 77.522,41 44.722,42 43.494,43 1.5,44 5}
{0 CHEMBL475251,1 8.255,2 38.6,3 40.4,4 1.03,5 1.142,6 0.651,7 0.646,8 470.51,9 10.5,10 18,11 57,13 19,14 37,16 60,17 22,20 16,21 6,22 1,23 1,24 23,25 12,28 6,29 5,32 34,34 1,35 8.8,36 0.117,37 7,38 47,39 58.712,40 65.113,41 37.097,42 36.827,43 1.8,44 5}
{0 CHEMBL476124,1 12.801,2 37.5,3 16.7,4 1.125,5 1.171,6 0.701,7 0.763,8 307.23,9 12.5,10 10,11 24,13 14,14 21,16 25,17 9,20 8,21 1,22 4,23 3,24 4,25 11,26 1,28 3,29 4,31 1,32 20,34 3,35 16.7,36 0.08,37 2,38 30,39 26.996,40 28.102,41 16.818,42 18.314,43 12.5,44 4}
{0 CHEMBL476141,1 6.995,2 43.3,3 47.8,4 0.992,5 1.123,6 0.666,7 0.625,8 468.65,9 6,10 18,11 67,13 20,14 39,16 71,17 29,20 19,21 10,22 2,24 32,25 6,28 4,29 2,32 35,35 3,36 0.099,37 7,38 50,39 66.432,40 75.225,41 44.591,42 41.89,44 5}
{0 CHEMBL477772,1 8.103,2 38.9,3 42.6,4 1.009,5 1.132,6 0.679,7 0.648,8 437.58,9 13,10 22,11 54,13 24,14 34,16 57,17 21,20 17,21 4,22 2,24 23,25 10,26 1,28 7,29 2,31 1,32 31,35 3.7,36 0.088,37 5,38 47,39 54.512,40 61.149,41 36.688,42 34.981,44 5}
{0 CHEMBL478649,1 6.97,2 44,3 48,4 0.992,5 1.12,6 0.666,7 0.625,8 348.48,9 4,10 12,11 50,13 14,14 29,16 53,17 22,20 14,21 8,22 2,24 24,25 4,28 2,29 2,32 26,35 4,36 0.113,37 6,38 37,39 49.578,40 55.983,41 33.296,42 31.267,44 6}
{0 CHEMBL483321,1 7.574,2 43.5,3 43.5,4 1.003,5 1.124,6 0.674,7 0.646,8 469.59,9 8.1,10 23,11 62,13 25,14 38,16 65,17 27,20 22,21 5,22 2,24 27,25 8,28 5,29 3,32 35,35 4.8,36 0.138,37 9,38 51.5,39 62.211,40 69.687,41 41.767,42 40.046,44 5}
{0 CHEMBL491473,1 7.509,2 41.7,3 45,4 1.008,5 1.132,6 0.658,7 0.632,8 450.56,9 6.7,10 21,11 60,13 21,14 37,16 64,17 25,20 16,21 9,23 1,24 27,25 8,28 4,29 3,32 33,34 1,35 5,36 0.125,37 8,38 47.5,39 60.505,40 67.944,41 39.461,42 37.935,43 1.7,44 5}
{0 CHEMBL494089,1 7.337,2 36.2,3 46.6,4 1.009,5 1.143,6 0.638,7 0.613,8 425.55,9 12.1,10 15,11 58,13 16,14 34,16 61,17 21,19 2,20 8,21 11,24 27,25 10,28 7,29 3,32 31,33 1,35 5.2,36 0.082,37 5,38 43.5,39 58.531,40 66.268,41 37.017,42 35.562,44 5}
{0 CHEMBL509032,1 7.491,2 36.6,3 48.8,4 1.001,5 1.135,6 0.657,7 0.613,8 614.29,9 8.5,10 18,11 82,13 20,14 46,16 86,17 30,18 1,20 16,21 14,22 2,24 40,25 12,26 2,28 7,29 3,31 1,32 42,34 1,35 3.7,36 0.105,37 9,38 57,39 82.116,40 93.039,41 53.853,42 50.264,43 1.2,44 5}
{0 CHEMBL513909,1 6.776,2 36.4,3 50.6,4 0.998,5 1.14,6 0.631,7 0.594,8 521.74,9 9.1,10 12,11 77,13 14,14 42,16 81,17 28,20 12,21 16,22 2,24 39,25 10,28 7,29 3,32 38,35 3.9,36 0.086,37 7,38 50,39 76.832,40 87.76,41 48.586,42 45.723,44 5}
{0 CHEMBL514201,1 7.774,2 40.9,3 45.5,4 1.009,5 1.132,6 0.664,7 0.634,8 513.06,9 6.1,10 16,11 66,13 19,14 39,16 69,17 27,18 1,20 17,21 10,22 3,23 1,24 30,25 9,26 1,28 4,29 3,32 36,34 2,35 4.5,36 0.072,37 5,38 50,39 66.596,40 74.718,41 43.841,42 41.816,43 3,44 7.417}
{0 CHEMBL521851,1 8.286,2 37.1,3 43.5,4 1.011,5 1.131,6 0.682,7 0.644,8 513.71,9 11.3,10 20,11 62,13 22,14 40,16 67,17 23,20 13,21 10,22 2,24 27,25 12,26 2,28 7,29 3,31 2,32 35,35 4.8,36 0.075,37 5,38 52,39 62.683,40 70.108,41 42.313,42 39.936,44 5}
{0 CHEMBL522892,1 7.85,2 42,3 42,4 1.01,5 1.137,6 0.67,7 0.649,8 392.48,9 12,10 16,11 50,13 18,14 33,16 54,17 21,20 16,21 5,22 2,23 1,24 21,25 8,28 6,29 1,32 29,34 1,35 2,36 0.037,37 2,38 43,39 50.52,40 56.861,41 33.517,42 32.441,43 2,44 5}
{0 CHEMBL523374,1 7.49,2 42.3,3 44.2,4 1.002,5 1.128,6 0.669,7 0.64,8 389.5,9 9.6,10 21,11 52,13 21,14 33,16 56,17 22,20 15,21 7,24 23,25 7,28 5,29 2,32 29,35 3.8,36 0.054,37 3,38 43.5,39 52.116,40 58.647,41 34.79,42 33.278,44 8.745}
{0 CHEMBL524266,1 8.098,2 38.2,3 41.2,4 1.023,5 1.15,6 0.654,7 0.642,8 275.32,9 14.7,10 11,11 34,13 12,14 22,16 36,17 13,20 9,21 4,22 1,23 1,24 14,25 7,28 5,29 1,32 20,34 1,35 2.9,36 0.056,37 2,38 28.5,39 34.767,40 39.117,41 22.228,42 21.839,43 2.9,44 5.398}
{0 CHEMBL525191,1 7.777,2 44.2,3 41.9,4 1.006,5 1.124,6 0.681,7 0.656,8 334.41,9 9.3,10 17,11 43,13 18,14 28,16 46,17 19,20 15,21 4,22 1,24 18,25 6,28 4,29 2,32 25,35 4.7,36 0.087,37 4,38 37.5,39 43.247,40 48.318,41 29.262,42 28.203,44 5}
{0 CHEMBL535,1 7.117,2 39.3,3 48.2,4 1.003,5 1.138,6 0.643,7 0.611,8 398.53,9 7.1,10 11,11 56,13 14,14 31,16 58,17 22,20 14,21 8,22 3,23 1,24 27,25 7,28 4,29 2,32 29,34 1,35 3.6,36 0.121,37 7,38 39.5,39 56.178,40 63.734,41 36.006,42 34.22,43 1.8,44 5}
{0 CHEMBL553,1 7.567,2 42.3,3 44.2,4 1.009,5 1.125,6 0.662,7 0.638,8 393.48,9 5.8,10 17,11 52,13 18,14 31,16 54,17 22,19 2,20 14,21 6,24 23,25 7,28 3,29 4,32 29,33 1,35 7.7,36 0.185,37 10,38 41.5,39 52.451,40 58.485,41 34.449,42 33.191,44 5}
{0 CHEMBL554,1 8.805,2 43.9,3 39.4,4 1.019,5 1.121,6 0.703,7 0.677,8 581.11,9 6.1,10 28,11 66,13 30,14 44,16 70,17 29,18 1,20 24,21 5,22 2,23 1,24 26,25 11,26 2,28 4,29 4,31 1,32 40,34 2,35 6.1,36 0.157,37 11,38 60,39 67.232,40 74.017,41 46.421,42 44.664,43 3,44 5}
{0 CHEMBL558752,1 9.782,2 45.3,3 30.2,4 1.058,5 1.161,6 0.683,7 0.705,8 518.46,9 11.3,10 27,11 53,13 27,14 41,16 57,17 24,20 21,21 3,23 6,24 16,25 13,28 6,29 1,32 37,34 6,35 1.9,36 0.088,37 5,38 54.5,39 56.083,40 61.559,41 36.205,42 37.357,43 11.3,44 5}
{0 CHEMBL561932,1 8.861,2 45.1,3 37.3,4 1.021,5 1.128,6 0.702,7 0.686,8 451.92,9 9.8,10 17,11 51,13 20,14 36,16 55,17 23,18 1,20 19,21 4,22 3,23 1,24 19,25 9,26 1,28 5,29 2,32 32,34 2,35 3.9,36 0.091,37 5,38 47.5,39 52.069,40 57.516,41 35.824,42 34.962,43 3.9,44 5}
{0 CHEMBL564829,1 6.98,2 37.9,3 48.5,4 0.996,5 1.139,6 0.646,7 0.609,8 460.65,9 12.1,10 17,11 66,13 18,14 38,16 70,17 25,20 14,21 11,22 1,24 32,25 9,28 8,29 1,32 34,35 1.5,36 0.057,37 4,38 47.5,39 65.745,40 75.178,41 42.637,42 40.208,44 5}
{0 CHEMBL572878,1 7.617,2 37.7,3 45.9,4 1.001,5 1.136,6 0.668,7 0.629,8 464.66,9 13.1,10 17,11 61,13 18,14 37,16 65,17 23,20 14,21 9,22 1,24 28,25 10,26 1,28 8,29 1,31 1,32 33,35 1.6,36 0.108,37 7,38 46.5,39 61.054,40 69.268,41 40.762,42 38.341,44 5}
{0 CHEMBL572881,1 7.324,2 43.1,3 45.1,4 0.996,5 1.126,6 0.673,7 0.638,8 373.5,9 9.8,10 18,11 51,13 19,14 31,16 54,17 22,20 17,21 5,22 1,24 23,25 6,28 5,29 1,32 28,35 2,36 0.093,37 5,38 41,39 50.789,40 57.438,41 34.336,42 32.563,44 5}
{0 CHEMBL573339,1 8.295,2 45.2,3 38.1,4 1.016,5 1.122,6 0.689,7 0.676,8 348.39,9 9.5,10 21,11 42,13 21,14 30,16 46,17 19,20 15,21 4,24 16,25 7,28 4,29 3,32 26,35 7.1,36 0.043,37 2,38 40.5,39 42.691,40 47.113,41 28.955,42 28.391,44 5}
{0 CHEMBL574738,1 7.789,2 38.2,3 44.1,4 1.02,5 1.152,6 0.642,7 0.626,8 529.63,9 10.3,10 18,11 68,13 19,14 41,16 71,17 26,20 17,21 9,22 1,23 3,24 30,25 12,28 7,29 2,32 38,34 3,35 2.9,36 0.113,37 8,38 51,39 69.392,40 78.324,41 43.66,42 42.578,43 4.4,44 6.367}
{0 CHEMBL576620,1 8.497,2 51.3,3 35.9,4 1.011,5 1.116,6 0.717,7 0.701,8 331.37,9 7.7,10 17,11 39,13 19,14 27,16 41,17 20,19 4,20 14,21 2,23 1,24 14,25 5,28 3,29 1,32 25,33 2,34 1,35 2.6,36 0.073,37 3,38 39.5,39 39.447,40 43.535,41 27.978,42 27.323,43 2.6,44 5.268}
{0 CHEMBL576982,1 7.788,2 40.3,3 44.4,4 1.007,5 1.127,6 0.672,7 0.639,8 560.74,9 8.3,10 25,11 72,13 26,14 45,16 77,17 29,20 19,21 10,22 1,24 32,25 11,26 1,28 6,29 4,31 1,32 40,35 5.6,36 0.104,37 8,38 58.5,39 72.483,40 81.145,41 48.398,42 46.023,44 5}
{0 CHEMBL601719,1 8.661,2 40.4,3 42.3,4 1.016,5 1.136,6 0.688,7 0.656,8 450.38,9 9.6,10 17,11 52,13 17,14 33,16 55,17 21,18 2,20 14,21 7,23 1,24 22,25 9,26 2,28 5,29 1,32 30,34 3,35 1.9,36 0.091,37 5,38 41.5,39 52.832,40 59.081,41 35.75,42 34.128,43 5.8,44 5}
{0 CHEMBL607707,1 8.357,2 42.9,3 41.1,4 1.015,5 1.131,6 0.685,7 0.661,8 467.97,9 8.9,10 17,11 56,13 20,14 35,16 58,17 24,18 1,19 1,20 18,21 5,22 2,23 1,24 23,25 9,26 1,28 5,29 2,32 33,33 1,34 2,35 3.6,36 0.138,37 8,38 47.5,39 56.836,40 63.346,41 38.347,42 37.015,43 3.6,44 5}
{0 CHEMBL608154,1 8.947,2 46.3,3 36.6,4 1.017,5 1.118,6 0.716,7 0.695,8 366.83,9 9.8,10 21,11 41,13 22,14 29,16 44,17 19,18 1,20 17,21 2,22 1,24 15,25 7,26 1,28 4,29 2,32 26,34 1,35 4.9,36 0.068,37 3,38 40.5,39 41.687,40 45.847,41 29.358,42 28.504,43 2.4,44 5}
{0 CHEMBL64040,1 8.538,2 40.8,3 42.9,4 1.009,5 1.129,6 0.695,7 0.658,8 418.36,9 10.2,10 17,11 49,13 18,14 30,16 51,17 20,18 2,20 16,21 4,22 1,24 21,25 8,26 2,28 5,29 1,32 28,34 2,35 2,36 0.078,37 4,38 39.5,39 49.436,40 55.326,41 34.051,42 32.218,43 4.1,44 7.284}
{0 CHEMBL88486,1 8.556,2 50,3 38.6,4 1.004,5 1.109,6 0.731,7 0.694,8 376.48,9 4.5,10 23,11 44,13 24,14 30,16 47,17 22,20 21,21 1,22 1,23 1,24 17,25 5,26 1,28 2,29 1,31 1,32 27,34 1,35 2.3,36 0.085,37 4,38 42.5,39 44.189,40 48.787,41 32.142,42 30.542,43 2.3,44 8.092}
{0 CHEMBL91829,1 7.438,2 44.4,3 44.4,4 1,5 1.121,6 0.675,7 0.644,8 468.6,9 6.3,10 20,11 63,13 23,14 40,16 68,17 28,20 20,21 8,22 3,24 28,25 7,28 4,29 3,32 35,35 4.8,36 0.029,37 2,38 53,39 62.992,40 70.604,41 42.523,42 40.552,44 5}
{0 CHEMBL92788,1 11.238,2 48.7,3 28.2,4 1.043,5 1.12,6 0.776,7 0.758,8 438.3,9 7.7,10 18,11 39,13 19,14 31,16 42,17 19,18 2,20 18,21 1,22 1,23 2,24 11,25 9,26 3,28 3,29 1,31 1,32 28,34 4,35 2.6,36 0.071,37 3,38 41,39 40.684,40 43.683,41 30.279,42 29.549,43 10.3,44 6.602}
{0 CHEMBL939,1 8.126,2 40,3 43.6,4 1.017,5 1.136,6 0.665,7 0.641,8 446.95,9 7.3,10 17,11 55,13 17,14 34,16 58,17 22,18 1,20 14,21 8,23 1,24 24,25 9,26 1,28 4,29 3,32 31,34 2,35 5.5,36 0.138,37 8,38 42.5,39 55.945,40 62.472,41 36.557,42 35.236,43 3.6,44 5}
{0 CHEMBL941,1 7.26,2 42.6,3 45.6,4 0.995,5 1.128,6 0.671,7 0.635,8 493.67,9 10.3,10 24,11 68,13 25,14 41,16 72,17 29,20 22,21 7,22 1,24 31,25 8,28 7,29 1,32 37,35 1.5,36 0.097,37 7,38 54,39 67.643,40 76.68,41 45.631,42 43.186,44 5}
{0 CHEMBL97162,1 7.676,2 41.7,3 43.8,4 1.011,5 1.135,6 0.661,7 0.638,8 368.45,9 8.3,10 17,11 48,13 17,14 30,16 51,17 20,20 13,21 7,23 1,24 21,25 7,28 4,29 2,32 27,34 1,35 4.2,36 0.078,37 4,38 38.5,39 48.527,40 54.489,41 31.722,42 30.64,43 2.1,44 7.357}
