{
  "data_features": {
    "feature": [
      {
        "data_type": "nominal",
        "index": "0",
        "is_ignore": "false",
        "is_row_identifier": "true",
        "is_target": "false",
        "name": "molecule_id",
        "nominal_value": [
          "CHEMBL1182312",
          "CHEMBL1201201",
          "CHEMBL1230845",
          "CHEMBL1546",
          "CHEMBL1598",
          "CHEMBL1600",
          "CHEMBL1669632",
          "CHEMBL1669669",
          "CHEMBL1927024",
          "CHEMBL1927030",
          "CHEMBL19393",
          "CHEMBL200088",
          "CHEMBL201001",
          "CHEMBL201002",
          "CHEMBL201047",
          "CHEMBL201623",
          "CHEMBL201864",
          "CHEMBL201885",
          "CHEMBL201892",
          "CHEMBL201896",
          "CHEMBL201922",
          "CHEMBL201965",
          "CHEMBL201993",
          "CHEMBL202021",
          "CHEMBL202024",
          "CHEMBL202046",
          "CHEMBL202047",
          "CHEMBL202071",
          "CHEMBL202099",
          "CHEMBL202172",
          "CHEMBL202183",
          "CHEMBL202209",
          "CHEMBL202279",
          "CHEMBL202330",
          "CHEMBL202335",
          "CHEMBL202395",
          "CHEMBL202457",
          "CHEMBL202548",
          "CHEMBL2206371",
          "CHEMBL2206375",
          "CHEMBL2206381",
          "CHEMBL2206388",
          "CHEMBL2206404",
          "CHEMBL2206890",
          "CHEMBL229075",
          "CHEMBL229126",
          "CHEMBL229127",
          "CHEMBL229182",
          "CHEMBL229183",
          "CHEMBL229184",
          "CHEMBL229185",
          "CHEMBL229234",
          "CHEMBL229235",
          "CHEMBL229236",
          "CHEMBL229237",
          "CHEMBL229288",
          "CHEMBL229289",
          "CHEMBL229295",
          "CHEMBL229296",
          "CHEMBL229636",
          "CHEMBL229686",
          "CHEMBL229687",
          "CHEMBL229688",
          "CHEMBL229958",
          "CHEMBL229959",
          "CHEMBL312689",
          "CHEMBL371324",
          "CHEMBL372534",
          "CHEMBL375467",
          "CHEMBL375468",
          "CHEMBL375469",
          "CHEMBL375470",
          "CHEMBL381288",
          "CHEMBL381531",
          "CHEMBL382580",
          "CHEMBL383495",
          "CHEMBL388953",
          "CHEMBL425035",
          "CHEMBL425223",
          "CHEMBL425398",
          "CHEMBL425579",
          "CHEMBL43048",
          "CHEMBL447626",
          "CHEMBL461546",
          "CHEMBL461724",
          "CHEMBL518352",
          "CHEMBL541905",
          "CHEMBL610",
          "CHEMBL612"
        ],
        "number_of_missing_values": "0"
      },
      {
        "data_type": "numeric",
        "index": "1",
        "is_ignore": "false",
        "is_row_identifier": "false",
        "is_target": "false",
        "name": "FCFP4_1024b826",
        "number_of_missing_values": "0"
      },
      {
        "data_type": "numeric",
        "index": "2",
        "is_ignore": "false",
        "is_row_identifier": "false",
        "is_target": "false",
        "name": "FCFP4_1024b922",
        "number_of_missing_values": "0"
      },
      {
        "data_type": "numeric",
        "index": "3",
        "is_ignore": "false",
        "is_row_identifier": "false",
        "is_target": "false",
        "name": "FCFP4_1024b680",
        "number_of_missing_values": "0"
      },
      {
        "data_type": "numeric",
        "index": "4",
        "is_ignore": "false",
        "is_row_identifier": "false",
        "is_target": "false",
        "name": "FCFP4_1024b71",
        "number_of_missing_values": "0"
      },
      {
        "data_type": "numeric",
        "index": "5",
        "is_ignore": "false",
        "is_row_identifier": "false",
        "is_target": "false",
        "name": "FCFP4_1024b1",
        "number_of_missing_values": "0"
      },
      {
        "data_type": "numeric",
        "index": "6",
        "is_ignore": "false",
        "is_row_identifier": "false",
        "is_target": "false",
        "name": "FCFP4_1024b10",
        "number_of_missing_values": "0"
      },
      {
        "data_type": "numeric",
        "index": "7",
        "is_ignore": "false",
        "is_row_identifier": "false",
        "is_target": "false",
        "name": "FCFP4_1024b100",
        "number_of_missing_values": "0"
      },
      {
        "data_type": "numeric",
        "index": "8",
        "is_ignore": "false",
        "is_row_identifier": "false",
        "is_target": "false",
        "name": "FCFP4_1024b1000",
        "number_of_missing_values": "0"
      },
      {
        "data_type": "numeric",
        "index": "9",
        "is_ignore": "false",
        "is_row_identifier": "false",
        "is_target": "false",
        "name": "FCFP4_1024b1001",
        "number_of_missing_values": "0"
      },
      {
        "data_type": "numeric",
        "index": "10",
        "is_ignore": "false",
        "is_row_identifier": "false",
        "is_target": "false",
        "name": "FCFP4_1024b1002",
        "number_of_missing_values": "0"
      },
      {
        "data_type": "numeric",
        "index": "11",
        "is_ignore": "false",
        "is_row_identifier": "false",
        "is_target": "false",
        "name": "FCFP4_1024b1003",
        "number_of_missing_values": "0"
      },
      {
        "data_type": "numeric",
        "index": "12",
        "is_ignore": "false",
        "is_row_identifier": "false",
        "is_target": "false",
        "name": "FCFP4_1024b1004",
        "number_of_missing_values": "0"
      },
      {
        "data_type": "numeric",
        "index": "13",
        "is_ignore": "false",
        "is_row_identifier": "false",
        "is_target": "false",
        "name": "FCFP4_1024b1005",
        "number_of_missing_values": "0"
      },
      {
        "data_type": "numeric",
        "index": "14",
        "is_ignore": "false",
        "is_row_identifier": "false",
        "is_target": "false",
        "name": "FCFP4_1024b1006",
        "number_of_missing_values": "0"
      },
      {
        "data_type": "numeric",
        "index": "15",
        "is_ignore": "false",
        "is_row_identifier": "false",
        "is_target": "false",
        "name": "FCFP4_1024b1007",
        "number_of_missing_values": "0"
      },
      {
        "data_type": "numeric",
        "index": "16",
        "is_ignore": "false",
        "is_row_identifier": "false",
        "is_target": "false",
        "name": "FCFP4_1024b1008",
        "number_of_missing_values": "0"
      },
      {
        "data_type": "numeric",
        "index": "17",
        "is_ignore": "false",
        "is_row_identifier": "false",
        "is_target": "false",
        "name": "FCFP4_1024b1009",
        "number_of_missing_values": "0"
      },
      {
        "data_type": "numeric",
        "index": "18",
        "is_ignore": "false",
        "is_row_identifier": "false",
        "is_target": "false",
        "name": "FCFP4_1024b101",
        "number_of_missing_values": "0"
      },
      {
        "data_type": "numeric",
        "index": "19",
        "is_ignore": "false",
        "is_row_identifier": "false",
        "is_target": "false",
        "name": "FCFP4_1024b1010",
        "number_of_missing_values": "0"
      },
      {
        "data_type": "numeric",
        "index": "20",
        "is_ignore": "false",
        "is_row_identifier": "false",
        "is_target": "false",
        "name": "FCFP4_1024b1011",
        "number_of_missing_values": "0"
      },
      {
        "data_type": "numeric",
        "index": "21",
        "is_ignore": "false",
        "is_row_identifier": "false",
        "is_target": "false",
        "name": "FCFP4_1024b1012",
        "number_of_missing_values": "0"
      },
      {
        "data_type": "numeric",
        "index": "22",
        "is_ignore": "false",
        "is_row_identifier": "false",
        "is_target": "false",
        "name": "FCFP4_1024b1013",
        "number_of_missing_values": "0"
      },
      {
        "data_type": "numeric",
        "index": "23",
        "is_ignore": "false",
        "is_row_identifier": "false",
        "is_target": "false",
        "name": "FCFP4_1024b1014",
        "number_of_missing_values": "0"
      },
      {
        "data_type": "numeric",
        "index": "24",
        "is_ignore": "false",
        "is_row_identifier": "false",
        "is_target": "false",
        "name": "FCFP4_1024b1015",
        "number_of_missing_values": "0"
      },
      {
        "data_type": "numeric",
        "index": "25",
        "is_ignore": "false",
        "is_row_identifier": "false",
        "is_target": "false",
        "name": "FCFP4_1024b1016",
        "number_of_missing_values": "0"
      },
      {
        "data_type": "numeric",
        "index": "26",
        "is_ignore": "false",
        "is_row_identifier": "false",
        "is_target": "false",
        "name": "FCFP4_1024b1017",
        "number_of_missing_values": "0"
      },
      {
        "data_type": "numeric",
        "index": "27",
        "is_ignore": "false",
        "is_row_identifier": "false",
        "is_target": "false",
        "name": "FCFP4_1024b1018",
        "number_of_missing_values": "0"
      },
      {
        "data_type": "numeric",
        "index": "28",
        "is_ignore": "false",
        "is_row_identifier": "false",
        "is_target": "false",
        "name": "FCFP4_1024b1019",
        "number_of_missing_values": "0"
      },
      {
        "data_type": "numeric",
        "index": "29",
        "is_ignore": "false",
        "is_row_identifier": "false",
        "is_target": "false",
        "name": "FCFP4_1024b102",
        "number_of_missing_values": "0"
      },
      {
        "data_type": "numeric",
        "index": "30",
        "is_ignore": "false",
        "is_row_identifier": "false",
        "is_target": "false",
        "name": "FCFP4_1024b1020",
        "number_of_missing_values": "0"
      },
      {
        "data_type": "numeric",
        "index": "31",
        "is_ignore": "false",
        "is_row_identifier": "false",
        "is_target": "false",
        "name": "FCFP4_1024b1021",
        "number_of_missing_values": "0"
      },
      {
        "data_type": "numeric",
        "index": "32",
        "is_ignore": "false",
        "is_row_identifier": "false",
        "is_target": "false",
        "name": "FCFP4_1024b1022",
        "number_of_missing_values": "0"
      },
      {
        "data_type": "numeric",
        "index": "33",
        "is_ignore": "false",
        "is_row_identifier": "false",
        "is_target": "false",
        "name": "FCFP4_1024b1023",
        "number_of_missing_values": "0"
      },
      {
        "data_type": "numeric",
        "index": "34",
        "is_ignore": "false",
        "is_row_identifier": "false",
        "is_target": "false",
        "name": "FCFP4_1024b1024",
        "number_of_missing_values": "0"
      },
      {
        "data_type": "numeric",
        "index": "35",
        "is_ignore": "false",
        "is_row_identifier": "false",
        "is_target": "false",
        "name": "FCFP4_1024b103",
        "number_of_missing_values": "0"
      },
      {
        "data_type": "numeric",
        "index": "36",
        "is_ignore": "false",
        "is_row_identifier": "false",
        "is_target": "false",
        "name": "FCFP4_1024b104",
        "number_of_missing_values": "0"
      },
      {
        "data_type": "numeric",
        "index": "37",
        "is_ignore": "false",
        "is_row_identifier": "false",
        "is_target": "false",
        "name": "FCFP4_1024b105",
        "number_of_missing_values": "0"
      },
      {
        "data_type": "numeric",
        "index": "38",
        "is_ignore": "false",
        "is_row_identifier": "false",
        "is_target": "false",
        "name": "FCFP4_1024b106",
        "number_of_missing_values": "0"
      },
      {
        "data_type": "numeric",
        "index": "39",
        "is_ignore": "false",
        "is_row_identifier": "false",
        "is_target": "false",
        "name": "FCFP4_1024b107",
        "number_of_missing_values": "0"
      },
      {
        "data_type": "numeric",
        "index": "40",
        "is_ignore": "false",
        "is_row_identifier": "false",
        "is_target": "false",
        "name": "FCFP4_1024b108",
        "number_of_missing_values": "0"
      },
      {
        "data_type": "numeric",
        "index": "41",
        "is_ignore": "false",
        "is_row_identifier": "false",
        "is_target": "false",
        "name": "FCFP4_1024b109",
        "number_of_missing_values": "0"
      },
      {
        "data_type": "numeric",
        "index": "42",
        "is_ignore": "false",
        "is_row_identifier": "false",
        "is_target": "false",
        "name": "FCFP4_1024b11",
        "number_of_missing_values": "0"
      },
      {
        "data_type": "numeric",
        "index": "43",
        "is_ignore": "false",
        "is_row_identifier": "false",
        "is_target": "false",
        "name": "FCFP4_1024b110",
        "number_of_missing_values": "0"
      },
      {
        "data_type": "numeric",
        "index": "44",
        "is_ignore": "false",
        "is_row_identifier": "false",
        "is_target": "false",
        "name": "FCFP4_1024b111",
        "number_of_missing_values": "0"
      },
      {
        "data_type": "numeric",
        "index": "45",
        "is_ignore": "false",
        "is_row_identifier": "false",
        "is_target": "false",
        "name": "FCFP4_1024b112",
        "number_of_missing_values": "0"
      },
      {
        "data_type": "numeric",
        "index": "46",
        "is_ignore": "false",
        "is_row_identifier": "false",
        "is_target": "false",
        "name": "FCFP4_1024b113",
        "number_of_missing_values": "0"
      },
      {
        "data_type": "numeric",
        "index": "47",
        "is_ignore": "false",
        "is_row_identifier": "false",
        "is_target": "false",
        "name": "FCFP4_1024b114",
        "number_of_missing_values": "0"
      },
      {
        "data_type": "numeric",
        "index": "48",
        "is_ignore": "false",
        "is_row_identifier": "false",
        "is_target": "false",
        "name": "FCFP4_1024b115",
        "number_of_missing_values": "0"
      },
      {
        "data_type": "numeric",
        "index": "49",
        "is_ignore": "false",
        "is_row_identifier": "false",
        "is_target": "false",
        "name": "FCFP4_1024b116",
        "number_of_missing_values": "0"
      },
      {
        "data_type": "numeric",
        "index": "50",
        "is_ignore": "false",
        "is_row_identifier": "false",
        "is_target": "false",
        "name": "FCFP4_1024b117",
        "number_of_missing_values": "0"
      },
      {
        "data_type": "numeric",
        "index": "51",
        "is_ignore": "false",
        "is_row_identifier": "false",
        "is_target": "false",
        "name": "FCFP4_1024b118",
        "number_of_missing_values": "0"
      },
      {
        "data_type": "numeric",
        "index": "52",
        "is_ignore": "false",
        "is_row_identifier": "false",
        "is_target": "false",
        "name": "FCFP4_1024b119",
        "number_of_missing_values": "0"
      },
      {
        "data_type": "numeric",
        "index": "53",
        "is_ignore": "false",
        "is_row_identifier": "false",
        "is_target": "false",
        "name": "FCFP4_1024b12",
        "number_of_missing_values": "0"
      },
      {
        "data_type": "numeric",
        "index": "54",
        "is_ignore": "false",
        "is_row_identifier": "false",
        "is_target": "false",
        "name": "FCFP4_1024b120",
        "number_of_missing_values": "0"
      },
      {
        "data_type": "numeric",
        "index": "55",
        "is_ignore": "false",
        "is_row_identifier": "false",
        "is_target": "false",
        "name": "FCFP4_1024b121",
        "number_of_missing_values": "0"
      },
      {
        "data_type": "numeric",
        "index": "56",
        "is_ignore": "false",
        "is_row_identifier": "false",
        "is_target": "false",
        "name": "FCFP4_1024b122",
        "number_of_missing_values": "0"
      },
      {
        "data_type": "numeric",
        "index": "57",
        "is_ignore": "false",
        "is_row_identifier": "false",
        "is_target": "false",
        "name": "FCFP4_1024b123",
        "number_of_missing_values": "0"
      },
      {
        "data_type": "numeric",
        "index": "58",
        "is_ignore": "false",
        "is_row_identifier": "false",
        "is_target": "false",
        "name": "FCFP4_1024b124",
        "number_of_missing_values": "0"
      },
      {
        "data_type": "numeric",
        "index": "59",
        "is_ignore": "false",
        "is_row_identifier": "false",
        "is_target": "false",
        "name": "FCFP4_1024b125",
        "number_of_missing_values": "0"
      },
      {
        "data_type": "numeric",
        "index": "60",
        "is_ignore": "false",
        "is_row_identifier": "false",
        "is_target": "false",
        "name": "FCFP4_1024b126",
        "number_of_missing_values": "0"
      },
      {
        "data_type": "numeric",
        "index": "61",
        "is_ignore": "false",
        "is_row_identifier": "false",
        "is_target": "false",
        "name": "FCFP4_1024b127",
        "number_of_missing_values": "0"
      },
      {
        "data_type": "numeric",
        "index": "62",
        "is_ignore": "false",
        "is_row_identifier": "false",
        "is_target": "false",
        "name": "FCFP4_1024b128",
        "number_of_missing_values": "0"
      },
      {
        "data_type": "numeric",
        "index": "63",
        "is_ignore": "false",
        "is_row_identifier": "false",
        "is_target": "false",
        "name": "FCFP4_1024b129",
        "number_of_missing_values": "0"
      },
      {
        "data_type": "numeric",
        "index": "64",
        "is_ignore": "false",
        "is_row_identifier": "false",
        "is_target": "false",
        "name": "FCFP4_1024b13",
        "number_of_missing_values": "0"
      },
      {
        "data_type": "numeric",
        "index": "65",
        "is_ignore": "false",
        "is_row_identifier": "false",
        "is_target": "false",
        "name": "FCFP4_1024b130",
        "number_of_missing_values": "0"
      },
      {
        "data_type": "numeric",
        "index": "66",
        "is_ignore": "false",
        "is_row_identifier": "false",
        "is_target": "false",
        "name": "FCFP4_1024b131",
        "number_of_missing_values": "0"
      },
      {
        "data_type": "numeric",
        "index": "67",
        "is_ignore": "false",
        "is_row_identifier": "false",
        "is_target": "false",
        "name": "FCFP4_1024b132",
        "number_of_missing_values": "0"
      },
      {
        "data_type": "numeric",
        "index": "68",
        "is_ignore": "false",
        "is_row_identifier": "false",
        "is_target": "false",
        "name": "FCFP4_1024b133",
        "number_of_missing_values": "0"
      },
      {
        "data_type": "numeric",
        "index": "69",
        "is_ignore": "false",
        "is_row_identifier": "false",
        "is_target": "false",
        "name": "FCFP4_1024b134",
        "number_of_missing_values": "0"
      },
      {
        "data_type": "numeric",
        "index": "70",
        "is_ignore": "false",
        "is_row_identifier": "false",
        "is_target": "false",
        "name": "FCFP4_1024b135",
        "number_of_missing_values": "0"
      },
      {
        "data_type": "numeric",
        "index": "71",
        "is_ignore": "false",
        "is_row_identifier": "false",
        "is_target": "false",
        "name": "FCFP4_1024b136",
        "number_of_missing_values": "0"
      },
      {
        "data_type": "numeric",
        "index": "72",
        "is_ignore": "false",
        "is_row_identifier": "false",
        "is_target": "false",
        "name": "FCFP4_1024b137",
        "number_of_missing_values": "0"
      },
      {
        "data_type": "numeric",
        "index": "73",
        "is_ignore": "false",
        "is_row_identifier": "false",
        "is_target": "false",
        "name": "FCFP4_1024b138",
        "number_of_missing_values": "0"
      },
      {
        "data_type": "numeric",
        "index": "74",
        "is_ignore": "false",
        "is_row_identifier": "false",
        "is_target": "false",
        "name": "FCFP4_1024b139",
        "number_of_missing_values": "0"
      },
      {
        "data_type": "numeric",
        "index": "75",
        "is_ignore": "false",
        "is_row_identifier": "false",
        "is_target": "false",
        "name": "FCFP4_1024b14",
        "number_of_missing_values": "0"
      },
      {
        "data_type": "numeric",
        "index": "76",
        "is_ignore": "false",
        "is_row_identifier": "false",
        "is_target": "false",
        "name": "FCFP4_1024b140",
        "number_of_missing_values": "0"
      },
      {
        "data_type": "numeric",
        "index": "77",
        "is_ignore": "false",
        "is_row_identifier": "false",
        "is_target": "false",
        "name": "FCFP4_1024b141",
        "number_of_missing_values": "0"
      },
      {
        "data_type": "numeric",
        "index": "78",
        "is_ignore": "false",
        "is_row_identifier": "false",
        "is_target": "false",
        "name": "FCFP4_1024b142",
        "number_of_missing_values": "0"
      },
      {
        "data_type": "numeric",
        "index": "79",
        "is_ignore": "false",
        "is_row_identifier": "false",
        "is_target": "false",
        "name": "FCFP4_1024b143",
        "number_of_missing_values": "0"
      },
      {
        "data_type": "numeric",
        "index": "80",
        "is_ignore": "false",
        "is_row_identifier": "false",
        "is_target": "false",
        "name": "FCFP4_1024b144",
        "number_of_missing_values": "0"
      },
      {
        "data_type": "numeric",
        "index": "81",
        "is_ignore": "false",
        "is_row_identifier": "false",
        "is_target": "false",
        "name": "FCFP4_1024b145",
        "number_of_missing_values": "0"
      },
      {
        "data_type": "numeric",
        "index": "82",
        "is_ignore": "false",
        "is_row_identifier": "false",
        "is_target": "false",
        "name": "FCFP4_1024b146",
        "number_of_missing_values": "0"
      },
      {
        "data_type": "numeric",
        "index": "83",
        "is_ignore": "false",
        "is_row_identifier": "false",
        "is_target": "false",
        "name": "FCFP4_1024b147",
        "number_of_missing_values": "0"
      },
      {
        "data_type": "numeric",
        "index": "84",
        "is_ignore": "false",
        "is_row_identifier": "false",
        "is_target": "false",
        "name": "FCFP4_1024b148",
        "number_of_missing_values": "0"
      },
      {
        "data_type": "numeric",
        "index": "85",
        "is_ignore": "false",
        "is_row_identifier": "false",
        "is_target": "false",
        "name": "FCFP4_1024b149",
        "number_of_missing_values": "0"
      },
      {
        "data_type": "numeric",
        "index": "86",
        "is_ignore": "false",
        "is_row_identifier": "false",
        "is_target": "false",
        "name": "FCFP4_1024b15",
        "number_of_missing_values": "0"
      },
      {
        "data_type": "numeric",
        "index": "87",
        "is_ignore": "false",
        "is_row_identifier": "false",
        "is_target": "false",
        "name": "FCFP4_1024b150",
        "number_of_missing_values": "0"
      },
      {
        "data_type": "numeric",
        "index": "88",
        "is_ignore": "false",
        "is_row_identifier": "false",
        "is_target": "false",
        "name": "FCFP4_1024b151",
        "number_of_missing_values": "0"
      },
      {
        "data_type": "numeric",
        "index": "89",
        "is_ignore": "false",
        "is_row_identifier": "false",
        "is_target": "false",
        "name": "FCFP4_1024b152",
        "number_of_missing_values": "0"
      },
      {
        "data_type": "numeric",
        "index": "90",
        "is_ignore": "false",
        "is_row_identifier": "false",
        "is_target": "false",
        "name": "FCFP4_1024b153",
        "number_of_missing_values": "0"
      },
      {
        "data_type": "numeric",
        "index": "91",
        "is_ignore": "false",
        "is_row_identifier": "false",
        "is_target": "false",
        "name": "FCFP4_1024b154",
        "number_of_missing_values": "0"
      },
      {
        "data_type": "numeric",
        "index": "92",
        "is_ignore": "false",
        "is_row_identifier": "false",
        "is_target": "false",
        "name": "FCFP4_1024b155",
        "number_of_missing_values": "0"
      },
      {
        "data_type": "numeric",
        "index": "93",
        "is_ignore": "false",
        "is_row_identifier": "false",
        "is_target": "false",
        "name": "FCFP4_1024b156",
        "number_of_missing_values": "0"
      },
      {
        "data_type": "numeric",
        "index": "94",
        "is_ignore": "false",
        "is_row_identifier": "false",
        "is_target": "false",
        "name": "FCFP4_1024b157",
        "number_of_missing_values": "0"
      },
      {
        "data_type": "numeric",
        "index": "95",
        "is_ignore": "false",
        "is_row_identifier": "false",
        "is_target": "false",
        "name": "FCFP4_1024b158",
        "number_of_missing_values": "0"
      },
      {
        "data_type": "numeric",
        "index": "96",
        "is_ignore": "false",
        "is_row_identifier": "false",
        "is_target": "false",
        "name": "FCFP4_1024b159",
        "number_of_missing_values": "0"
      },
      {
        "data_type": "numeric",
        "index": "97",
        "is_ignore": "false",
        "is_row_identifier": "false",
        "is_target": "false",
        "name": "FCFP4_1024b16",
        "number_of_missing_values": "0"
      },
      {
        "data_type": "numeric",
        "index": "98",
        "is_ignore": "false",
        "is_row_identifier": "false",
        "is_target": "false",
        "name": "FCFP4_1024b160",
        "number_of_missing_values": "0"
      },
      {
        "data_type": "numeric",
        "index": "99",
        "is_ignore": "false",
        "is_row_identifier": "false",
        "is_target": "false",
        "name": "FCFP4_1024b161",
        "number_of_missing_values": "0"
      },
      {
        "data_type": "numeric",
        "index": "100",
        "is_ignore": "false",
        "is_row_identifier": "false",
        "is_target": "false",
        "name": "FCFP4_1024b162",
        "number_of_missing_values": "0"
      },
      {
        "data_type": "numeric",
        "index": "101",
        "is_ignore": "false",
        "is_row_identifier": "false",
        "is_target": "false",
        "name": "FCFP4_1024b163",
        "number_of_missing_values": "0"
      },
      {
        "data_type": "numeric",
        "index": "102",
        "is_ignore": "false",
        "is_row_identifier": "false",
        "is_target": "false",
        "name": "FCFP4_1024b164",
        "number_of_missing_values": "0"
      },
      {
        "data_type": "numeric",
        "index": "103",
        "is_ignore": "false",
        "is_row_identifier": "false",
        "is_target": "true",
        "name": "pXC50",
        "number_of_missing_values": "0"
      }
    ]
  }
}