"molecule_id","FCFP4_1024b925","FCFP4_1024b619","FCFP4_1024b855","FCFP4_1024b148","FCFP4_1024b507","FCFP4_1024b838","FCFP4_1024b872","FCFP4_1024b284","FCFP4_1024b438","FCFP4_1024b235","FCFP4_1024b574","FCFP4_1024b374","FCFP4_1024b785","FCFP4_1024b648","FCFP4_1024b894","FCFP4_1024b9","FCFP4_1024b229","FCFP4_1024b704","FCFP4_1024b668","FCFP4_1024b179","FCFP4_1024b1","FCFP4_1024b10","FCFP4_1024b100","FCFP4_1024b1000","FCFP4_1024b1001","FCFP4_1024b1002","FCFP4_1024b1003","FCFP4_1024b1004","FCFP4_1024b1005","FCFP4_1024b1006","FCFP4_1024b1007","FCFP4_1024b1008","FCFP4_1024b1009","FCFP4_1024b101","FCFP4_1024b1010","FCFP4_1024b1011","FCFP4_1024b1012","FCFP4_1024b1013","FCFP4_1024b1014","FCFP4_1024b1015","FCFP4_1024b1016","FCFP4_1024b1017","FCFP4_1024b1018","FCFP4_1024b1019","FCFP4_1024b102","FCFP4_1024b1020","FCFP4_1024b1021","FCFP4_1024b1022","FCFP4_1024b1023","FCFP4_1024b1024","FCFP4_1024b103","pXC50"
{1 1,21 1,25 1,52 4.336}
{0 CHEMBL116548,16 1,21 1,46 1,52 5.595}
{0 CHEMBL118678,52 5.411}
{0 CHEMBL122355,46 1,52 4.588}
{0 CHEMBL124006,11 1,21 1,22 1,52 4.237}
{0 CHEMBL1255944,11 1,12 1,21 1,22 1,46 1,48 1,52 4.613}
{0 CHEMBL1256708,21 1,22 1,52 4.582}
{0 CHEMBL1257065,2 1,4 1,6 1,16 1,21 1,52 5.59}
{0 CHEMBL1300059,11 1,12 1,21 1,50 1,52 5.293}
{0 CHEMBL1300403,13 1,21 1,40 1,52 5.545}
{0 CHEMBL1301497,10 1,11 1,12 1,18 1,21 1,52 5.092}
{0 CHEMBL1301673,1 1,5 1,11 1,19 1,21 1,27 1,46 1,52 5.467}
{0 CHEMBL1301786,10 1,11 1,21 1,52 4.004}
{0 CHEMBL1301999,1 1,7 1,11 1,17 1,21 1,22 1,52 4.959}
{0 CHEMBL1302328,1 1,21 1,35 1,44 1,47 1,52 4.377}
{0 CHEMBL1302524,1 1,21 1,35 1,52 5.095}
{0 CHEMBL1302583,11 1,12 1,21 1,43 1,52 5.199}
{0 CHEMBL1302913,1 1,4 1,6 1,11 1,16 1,21 1,22 1,52 5.359}
{0 CHEMBL1303289,1 1,21 1,22 1,38 1,44 1,52 5.465}
{0 CHEMBL1303365,1 1,8 1,11 1,16 1,21 1,52 4.387}
{0 CHEMBL1304096,2 1,3 1,5 1,7 1,8 1,10 1,11 1,12 1,14 1,21 1,38 1,52 5.68}
{0 CHEMBL1304193,1 1,21 1,22 1,26 1,52 5.259}
{0 CHEMBL1304408,1 1,11 1,21 1,41 1,52 4.597}
{0 CHEMBL1304540,10 1,11 1,12 1,16 1,18 1,21 1,52 5.456}
{0 CHEMBL1304687,1 1,3 1,7 1,9 1,21 1,52 4.186}
{0 CHEMBL1304739,1 1,4 1,6 1,11 1,16 1,21 1,52 5.592}
{0 CHEMBL1305391,1 1,7 1,11 1,19 1,21 1,52 4.389}
{0 CHEMBL1306005,1 1,12 1,21 1,41 1,52 4.609}
{0 CHEMBL1306597,7 1,11 1,16 1,21 1,52 5.313}
{0 CHEMBL1308592,1 1,21 1,52 4.75}
{0 CHEMBL1308627,1 1,21 1,22 1,45 1,52 4.427}
{0 CHEMBL1309327,1 1,12 1,21 1,52 5.309}
{0 CHEMBL1309714,1 1,11 1,21 1,22 1,44 1,52 5.003}
{0 CHEMBL1309967,1 1,3 1,11 1,13 1,21 1,52 5.432}
{0 CHEMBL1310318,1 1,5 1,21 1,52 5.045}
{0 CHEMBL131037,1 1,21 1,52 5.144}
{0 CHEMBL1310492,1 1,7 1,11 1,12 1,21 1,52 5.668}
{0 CHEMBL1310749,1 1,10 1,21 1,30 1,52 4.386}
{0 CHEMBL1311130,1 1,21 1,28 1,52 5.087}
{0 CHEMBL1311243,2 1,3 1,5 1,7 1,8 1,10 1,11 1,12 1,16 1,17 1,21 1,38 1,44 1,52 5.638}
{0 CHEMBL1311546,1 1,13 1,16 1,21 1,52 4.876}
{0 CHEMBL1311634,1 1,11 1,12 1,21 1,43 1,52 4.893}
{0 CHEMBL1312519,1 1,21 1,22 1,38 1,52 5.429}
{0 CHEMBL1312653,1 1,13 1,19 1,21 1,22 1,52 5.084}
{0 CHEMBL1313780,1 1,8 1,21 1,35 1,44 1,52 4.686}
{0 CHEMBL1314231,1 1,11 1,21 1,44 1,52 5.498}
{0 CHEMBL1314602,1 1,5 1,21 1,52 4.967}
{0 CHEMBL1315536,1 1,21 1,52 4.592}
{0 CHEMBL1316602,1 1,21 1,52 4}
{0 CHEMBL1316903,1 1,11 1,16 1,21 1,52 5.266}
{0 CHEMBL1317842,1 1,21 1,44 1,52 5.419}
{0 CHEMBL1318277,1 1,11 1,16 1,19 1,21 1,22 1,27 1,38 1,52 4.321}
{0 CHEMBL1318817,21 1,27 1,46 1,52 5.054}
{0 CHEMBL1318903,1 1,7 1,11 1,16 1,21 1,52 5.316}
{0 CHEMBL1319001,1 1,7 1,21 1,22 1,52 4.285}
{0 CHEMBL1319005,1 1,20 1,21 1,52 4.259}
{0 CHEMBL1320153,1 1,19 1,21 1,22 1,38 1,52 5.081}
{0 CHEMBL1320180,1 1,19 1,20 1,21 1,52 4.287}
{0 CHEMBL1320432,10 1,11 1,12 1,21 1,52 4.79}
{0 CHEMBL1320566,12 1,13 1,21 1,52 4.004}
{0 CHEMBL1321637,21 1,27 1,40 1,46 1,52 5.143}
{0 CHEMBL1321755,2 1,3 1,5 1,7 1,8 1,10 1,11 1,12 1,14 1,21 1,38 1,52 5.407}
{0 CHEMBL1322457,1 1,12 1,21 1,27 1,52 5.063}
{0 CHEMBL1323320,1 1,21 1,22 1,35 1,52 4.432}
{0 CHEMBL1323464,2 1,3 1,5 1,7 1,8 1,10 1,11 1,12 1,17 1,21 1,24 1,38 1,52 5.39}
{0 CHEMBL1323484,1 1,19 1,20 1,21 1,44 1,45 1,52 4.288}
{0 CHEMBL1324472,1 1,4 1,6 1,11 1,16 1,21 1,52 5.588}
{0 CHEMBL1324634,1 1,3 1,13 1,21 1,52 5.503}
{0 CHEMBL1324890,1 1,3 1,21 1,46 1,52 5.218}
{0 CHEMBL1325204,1 1,18 1,21 1,52 5.304}
{0 CHEMBL1325404,1 1,21 1,52 5.487}
{0 CHEMBL1325780,1 1,10 1,21 1,24 1,52 5.595}
{0 CHEMBL1327723,1 1,11 1,17 1,19 1,21 1,22 1,52 5.491}
{0 CHEMBL1327882,2 1,3 1,5 1,7 1,8 1,10 1,11 1,12 1,14 1,21 1,38 1,52 5.311}
{0 CHEMBL1327997,1 1,21 1,52 4.259}
{0 CHEMBL1328041,1 1,13 1,21 1,52 5.695}
{0 CHEMBL1329322,10 1,11 1,24 1,52 5.396}
{0 CHEMBL1329979,1 1,21 1,52 5.014}
{0 CHEMBL1330039,1 1,16 1,21 1,52 4.565}
{0 CHEMBL1330464,1 1,5 1,11 1,19 1,21 1,27 1,46 1,52 4.845}
{0 CHEMBL1331808,1 1,11 1,21 1,52 5.524}
{0 CHEMBL1332044,2 1,3 1,5 1,7 1,8 1,10 1,11 1,12 1,14 1,17 1,21 1,24 1,38 1,52 5.606}
{0 CHEMBL1332718,8 1,10 1,11 1,12 1,18 1,21 1,52 5.389}
{0 CHEMBL1333250,1 1,5 1,21 1,35 1,52 5.039}
{0 CHEMBL1333775,1 1,7 1,11 1,13 1,21 1,52 5.353}
{0 CHEMBL1333873,21 1,52 5.558}
{0 CHEMBL1334080,1 1,21 1,52 5.335}
{0 CHEMBL1334108,1 1,7 1,11 1,21 1,52 5.425}
{0 CHEMBL1334156,1 1,19 1,21 1,22 1,52 5.176}
{0 CHEMBL1334528,10 1,11 1,21 1,24 1,52 5.914}
{0 CHEMBL1334853,21 1,22 1,27 1,46 1,52 5.131}
{0 CHEMBL1334983,10 1,11 1,12 1,18 1,19 1,21 1,52 5.231}
{0 CHEMBL1335071,4 1,6 1,11 1,16 1,21 1,52 5.2}
{0 CHEMBL1335431,1 1,10 1,11 1,12 1,18 1,21 1,22 1,26 1,38 1,52 5.246}
{0 CHEMBL1335844,1 1,16 1,21 1,24 1,52 5.5}
{0 CHEMBL1336510,21 1,27 1,46 1,52 5.002}
{0 CHEMBL1336882,1 1,7 1,21 1,22 1,52 4.177}
{0 CHEMBL1336959,1 1,5 1,21 1,52 4.74}
{0 CHEMBL1337734,1 1,21 1,52 4.896}
{0 CHEMBL1337782,1 1,21 1,52 5.096}
{0 CHEMBL1337904,1 1,11 1,12 1,21 1,52 5.208}
{0 CHEMBL1338153,1 1,21 1,38 1,52 5.658}
{0 CHEMBL1338197,1 1,11 1,16 1,21 1,44 1,52 5.149}
{0 CHEMBL1338474,1 1,11 1,21 1,52 4.426}
{0 CHEMBL1338730,1 1,21 1,47 1,52 4.547}
{0 CHEMBL1338788,1 1,21 1,22 1,52 4.257}
{0 CHEMBL1338994,1 1,7 1,11 1,19 1,20 1,21 1,52 4.33}
{0 CHEMBL1339149,1 1,5 1,21 1,22 1,52 5.04}
{0 CHEMBL1339349,1 1,7 1,16 1,21 1,52 4.735}
{0 CHEMBL1339438,11 1,13 1,21 1,44 1,52 5.493}
{0 CHEMBL1339460,2 1,3 1,5 1,7 1,8 1,10 1,11 1,12 1,17 1,21 1,24 1,38 1,40 1,44 1,52 5.602}
{0 CHEMBL1339576,1 1,21 1,41 1,52 5.033}
{0 CHEMBL1340045,13 1,16 1,21 1,52 5.264}
{0 CHEMBL1340117,1 1,5 1,11 1,19 1,21 1,27 1,46 1,52 5.218}
{0 CHEMBL1340231,1 1,4 1,6 1,11 1,16 1,21 1,52 5.616}
{0 CHEMBL1340417,11 1,16 1,52 5.026}
{0 CHEMBL1341547,1 1,3 1,11 1,13 1,21 1,52 5.848}
{0 CHEMBL1342158,1 1,2 1,13 1,21 1,52 5.889}
{0 CHEMBL1342423,1 1,21 1,52 4.181}
{0 CHEMBL1342570,1 1,19 1,21 1,44 1,52 4.445}
{0 CHEMBL1342790,6 1,7 1,11 1,16 1,21 1,52 5.34}
{0 CHEMBL1343630,1 1,11 1,21 1,30 1,52 4.587}
{0 CHEMBL1344136,10 1,11 1,12 1,18 1,21 1,52 5.364}
{0 CHEMBL1344163,11 1,12 1,21 1,52 4}
{0 CHEMBL1344441,1 1,4 1,6 1,8 1,11 1,16 1,21 1,52 5.381}
{0 CHEMBL1345181,1 1,4 1,6 1,11 1,16 1,21 1,52 5.587}
{0 CHEMBL1345195,1 1,21 1,52 4.326}
{0 CHEMBL1345308,1 1,8 1,21 1,22 1,52 5.072}
{0 CHEMBL1345318,1 1,4 1,6 1,11 1,16 1,21 1,34 1,44 1,52 5.446}
{0 CHEMBL1345580,1 1,21 1,35 1,43 1,44 1,47 1,52 5.304}
{0 CHEMBL1345650,1 1,10 1,11 1,12 1,21 1,35 1,52 5.041}
{0 CHEMBL1346526,1 1,3 1,11 1,21 1,52 4.305}
{0 CHEMBL1346579,2 1,3 1,5 1,7 1,8 1,10 1,11 1,12 1,14 1,17 1,21 1,24 1,38 1,44 1,50 1,52 5.6}
{0 CHEMBL1347373,1 1,11 1,17 1,19 1,21 1,52 4.533}
{0 CHEMBL1347674,1 1,20 1,21 1,22 1,27 1,52 4.407}
{0 CHEMBL1349996,1 1,21 1,45 1,52 5.539}
{0 CHEMBL1350178,1 1,21 1,52 4.092}
{0 CHEMBL1350257,1 1,21 1,52 4.351}
{0 CHEMBL1350308,1 1,19 1,20 1,21 1,44 1,46 1,52 4.418}
{0 CHEMBL1350393,1 1,5 1,11 1,17 1,19 1,21 1,27 1,46 1,52 5.087}
{0 CHEMBL1350881,2 1,3 1,5 1,7 1,8 1,10 1,11 1,12 1,16 1,17 1,21 1,36 1,38 1,52 5.32}
{0 CHEMBL1351706,1 1,11 1,21 1,44 1,52 4.793}
{0 CHEMBL1352266,10 1,11 1,52 5.154}
{0 CHEMBL1352631,2 1,3 1,5 1,7 1,8 1,10 1,11 1,12 1,14 1,21 1,24 1,38 1,52 5.247}
{0 CHEMBL1353003,2 1,3 1,5 1,8 1,11 1,12 1,17 1,18 1,21 1,38 1,52 5.616}
{0 CHEMBL1353473,1 1,14 1,21 1,22 1,47 1,52 5.551}
{0 CHEMBL1353825,1 1,21 1,52 5.015}
{0 CHEMBL1354431,1 1,5 1,21 1,35 1,52 5.314}
{0 CHEMBL1355123,1 1,13 1,21 1,52 5.638}
{0 CHEMBL1355368,1 1,7 1,11 1,19 1,20 1,21 1,22 1,38 1,52 4.479}
{0 CHEMBL1355614,1 1,11 1,19 1,21 1,22 1,38 1,52 5.141}
{0 CHEMBL1355983,1 1,21 1,40 1,44 1,52 4.347}
{0 CHEMBL1358136,1 1,11 1,16 1,21 1,22 1,38 1,52 4.28}
{0 CHEMBL1359205,1 1,21 1,22 1,26 1,52 5.079}
{0 CHEMBL1359410,1 1,21 1,27 1,43 1,52 5.529}
{0 CHEMBL1360140,1 1,7 1,11 1,12 1,13 1,21 1,52 5.569}
{0 CHEMBL1360902,1 1,11 1,16 1,21 1,24 1,38 1,52 4.827}
{0 CHEMBL1361245,1 1,4 1,6 1,11 1,16 1,21 1,52 5.68}
{0 CHEMBL1361455,1 1,11 1,21 1,52 5.326}
{0 CHEMBL1362088,6 1,11 1,16 1,21 1,52 5.65}
{0 CHEMBL1362177,2 1,3 1,5 1,7 1,8 1,10 1,11 1,12 1,17 1,21 1,38 1,52 5.5}
{0 CHEMBL1362345,2 1,3 1,5 1,8 1,11 1,12 1,17 1,21 1,38 1,44 1,52 5.66}
{0 CHEMBL1362702,1 1,4 1,6 1,11 1,16 1,21 1,52 5.951}
{0 CHEMBL1363072,1 1,11 1,21 1,23 1,52 5.07}
{0 CHEMBL1363129,1 1,19 1,21 1,52 4.216}
{0 CHEMBL1363389,11 1,31 1,52 5.532}
{0 CHEMBL1364546,3 1,5 1,8 1,11 1,17 1,21 1,38 1,52 5.321}
{0 CHEMBL1364567,1 1,21 1,52 4.461}
{0 CHEMBL1364756,2 1,3 1,5 1,7 1,8 1,10 1,11 1,12 1,14 1,21 1,38 1,52 5.484}
{0 CHEMBL1365373,1 1,21 1,52 4.914}
{0 CHEMBL1366077,2 1,3 1,5 1,7 1,8 1,10 1,11 1,12 1,17 1,21 1,24 1,38 1,44 1,52 5.285}
{0 CHEMBL1366107,1 1,3 1,5 1,8 1,11 1,17 1,21 1,35 1,38 1,44 1,52 5.478}
{0 CHEMBL1367364,10 1,11 1,12 1,16 1,18 1,21 1,52 5.26}
{0 CHEMBL1367484,1 1,11 1,21 1,22 1,52 5.333}
{0 CHEMBL1368027,1 1,21 1,52 5.211}
{0 CHEMBL1368108,1 1,5 1,11 1,19 1,21 1,27 1,46 1,52 5.226}
{0 CHEMBL1368619,9 1,11 1,12 1,21 1,52 5.583}
{0 CHEMBL1369063,1 1,9 1,21 1,46 1,52 4.588}
{0 CHEMBL1369152,1 1,3 1,21 1,22 1,52 5.24}
{0 CHEMBL1369302,1 1,21 1,52 4.177}
{0 CHEMBL1369573,1 1,11 1,16 1,21 1,52 5.29}
{0 CHEMBL1369880,13 1,21 1,52 5.385}
{0 CHEMBL1369977,2 1,3 1,5 1,7 1,8 1,10 1,11 1,12 1,16 1,17 1,21 1,38 1,52 5.724}
{0 CHEMBL1370221,1 1,11 1,13 1,21 1,27 1,43 1,52 5.267}
{0 CHEMBL1370381,1 1,7 1,11 1,19 1,20 1,21 1,52 4.431}
{0 CHEMBL1370415,1 1,21 1,52 5.388}
{0 CHEMBL1370704,1 1,21 1,27 1,43 1,52 5.475}
{0 CHEMBL1370718,1 1,7 1,11 1,21 1,52 4.177}
{0 CHEMBL1371049,10 1,11 1,12 1,18 1,21 1,52 5.265}
{0 CHEMBL1371679,11 1,12 1,18 1,21 1,52 5.411}
{0 CHEMBL1371792,1 1,5 1,21 1,22 1,38 1,52 4.854}
{0 CHEMBL1373318,1 1,11 1,21 1,27 1,52 5.444}
{0 CHEMBL1374283,11 1,16 1,21 1,24 1,52 5.363}
{0 CHEMBL1374507,1 1,12 1,21 1,52 5.291}
{0 CHEMBL1375102,1 1,4 1,6 1,16 1,21 1,52 5.724}
{0 CHEMBL1375245,1 1,11 1,21 1,52 4.66}
{0 CHEMBL1376373,2 1,3 1,5 1,7 1,8 1,10 1,11 1,12 1,14 1,17 1,21 1,24 1,38 1,52 5.462}
{0 CHEMBL1376754,1 1,11 1,17 1,21 1,44 1,52 5.46}
{0 CHEMBL1377153,1 1,3 1,21 1,52 5.783}
{0 CHEMBL1377903,1 1,16 1,21 1,27 1,52 5.381}
{0 CHEMBL1378582,1 1,11 1,21 1,52 4.492}
{0 CHEMBL1378605,1 1,21 1,35 1,52 4.59}
{0 CHEMBL1378796,10 1,11 1,12 1,18 1,21 1,52 5.735}
{0 CHEMBL1378958,1 1,13 1,21 1,52 5.53}
{0 CHEMBL1379279,1 1,13 1,21 1,24 1,52 5.883}
{0 CHEMBL1380802,1 1,21 1,52 5.339}
{0 CHEMBL1381306,1 1,11 1,21 1,30 1,52 4}
{0 CHEMBL1382116,1 1,11 1,16 1,21 1,22 1,25 1,30 1,46 1,52 5.329}
{0 CHEMBL1383031,1 1,21 1,52 4.248}
{0 CHEMBL1383109,1 1,15 1,21 1,52 5.156}
{0 CHEMBL1383495,1 1,8 1,16 1,21 1,44 1,52 5.113}
{0 CHEMBL1383752,1 1,11 1,12 1,21 1,52 5.31}
{0 CHEMBL1383779,1 1,4 1,6 1,11 1,16 1,21 1,43 1,52 5.457}
{0 CHEMBL1383835,1 1,16 1,21 1,52 4.321}
{0 CHEMBL1384015,13 1,16 1,21 1,22 1,26 1,52 5.495}
{0 CHEMBL1385198,1 1,8 1,16 1,21 1,52 4.4}
{0 CHEMBL1385372,2 1,3 1,5 1,7 1,8 1,10 1,11 1,12 1,14 1,17 1,21 1,24 1,38 1,44 1,52 5.442}
{0 CHEMBL1385524,1 1,11 1,21 1,35 1,52 4.359}
{0 CHEMBL1385655,11 1,12 1,21 1,43 1,52 5.124}
{0 CHEMBL1385736,1 1,7 1,8 1,11 1,21 1,44 1,52 5.215}
{0 CHEMBL1385743,1 1,3 1,21 1,22 1,52 4.544}
{0 CHEMBL1386034,2 1,3 1,5 1,7 1,8 1,10 1,11 1,12 1,17 1,21 1,24 1,38 1,52 5.41}
{0 CHEMBL1386120,1 1,11 1,19 1,21 1,27 1,46 1,52 4.963}
{0 CHEMBL1386397,1 1,3 1,11 1,16 1,21 1,22 1,38 1,52 4.44}
{0 CHEMBL1386461,11 1,12 1,21 1,52 5.149}
{0 CHEMBL1386524,1 1,8 1,10 1,11 1,12 1,21 1,22 1,26 1,38 1,52 4.004}
{0 CHEMBL1386555,2 1,3 1,5 1,7 1,8 1,10 1,11 1,12 1,17 1,21 1,38 1,44 1,52 5.033}
{0 CHEMBL1386731,1 1,11 1,21 1,46 1,52 4.004}
{0 CHEMBL1386764,1 1,11 1,21 1,22 1,38 1,52 4.857}
{0 CHEMBL1387248,1 1,21 1,25 1,52 4.357}
{0 CHEMBL1387495,11 1,21 1,22 1,36 1,52 5.656}
{0 CHEMBL1387510,12 1,13 1,21 1,52 5.65}
{0 CHEMBL1387791,9 1,11 1,12 1,21 1,52 4}
{0 CHEMBL1387863,1 1,11 1,12 1,21 1,52 5.01}
{0 CHEMBL1387957,1 1,12 1,21 1,52 5.218}
{0 CHEMBL1388407,10 1,21 1,52 4.432}
{0 CHEMBL1388703,1 1,21 1,52 4.323}
{0 CHEMBL1388851,10 1,11 1,12 1,18 1,21 1,52 5.123}
{0 CHEMBL1389035,6 1,11 1,16 1,21 1,38 1,52 5.879}
{0 CHEMBL1389217,2 1,3 1,5 1,7 1,8 1,10 1,11 1,12 1,17 1,21 1,38 1,44 1,52 5.695}
{0 CHEMBL1389374,2 1,3 1,5 1,7 1,10 1,11 1,12 1,15 1,21 1,52 5.573}
{0 CHEMBL1389793,1 1,4 1,6 1,11 1,16 1,21 1,52 5.701}
{0 CHEMBL1389969,10 1,11 1,12 1,18 1,21 1,52 5.539}
{0 CHEMBL1390206,1 1,7 1,11 1,13 1,21 1,52 5.527}
{0 CHEMBL1390568,1 1,11 1,21 1,52 4.293}
{0 CHEMBL1390684,1 1,11 1,21 1,52 4.384}
{0 CHEMBL1390840,1 1,21 1,52 5.161}
{0 CHEMBL1392987,1 1,10 1,12 1,21 1,52 5.174}
{0 CHEMBL1393565,1 1,21 1,52 4.004}
{0 CHEMBL1393775,10 1,11 1,12 1,18 1,19 1,21 1,52 5.229}
{0 CHEMBL1394863,1 1,10 1,12 1,21 1,52 4.876}
{0 CHEMBL1395554,1 1,9 1,12 1,21 1,52 4.121}
{0 CHEMBL1395977,21 1,46 1,52 4.767}
{0 CHEMBL1396239,1 1,11 1,12 1,21 1,52 4.004}
{0 CHEMBL1396545,1 1,21 1,26 1,52 4.967}
{0 CHEMBL1396733,1 1,21 1,52 5.38}
{0 CHEMBL1397143,1 1,11 1,21 1,22 1,38 1,52 4.9}
{0 CHEMBL1398584,1 1,11 1,19 1,21 1,27 1,34 1,52 5.157}
{0 CHEMBL1398855,1 1,19 1,21 1,46 1,52 4.467}
{0 CHEMBL1399191,1 1,11 1,21 1,41 1,52 5.083}
{0 CHEMBL1400127,1 1,12 1,21 1,22 1,52 4.541}
{0 CHEMBL1400512,1 1,21 1,52 4.738}
{0 CHEMBL1401536,1 1,13 1,21 1,22 1,52 5.599}
{0 CHEMBL1401621,1 1,21 1,22 1,38 1,44 1,52 5.061}
{0 CHEMBL1401938,1 1,12 1,21 1,52 4.544}
{0 CHEMBL1402702,1 1,21 1,52 4.928}
{0 CHEMBL1403277,1 1,21 1,52 5.361}
{0 CHEMBL1403357,1 1,7 1,11 1,19 1,20 1,21 1,46 1,52 4.14}
{0 CHEMBL1403440,1 1,3 1,11 1,21 1,52 5.301}
{0 CHEMBL1403561,3 1,5 1,8 1,11 1,17 1,21 1,38 1,44 1,52 5.229}
{0 CHEMBL1403816,1 1,11 1,21 1,22 1,38 1,44 1,51 1,52 5.307}
{0 CHEMBL1404277,12 1,21 1,27 1,46 1,52 5.337}
{0 CHEMBL1405185,4 1,6 1,11 1,16 1,21 1,52 5.253}
{0 CHEMBL1405482,1 1,11 1,12 1,19 1,21 1,52 4.346}
{0 CHEMBL1405682,1 1,21 1,52 5.011}
{0 CHEMBL1405869,1 1,11 1,19 1,21 1,22 1,38 1,44 1,52 4.879}
{0 CHEMBL1406130,1 1,5 1,21 1,52 5.055}
{0 CHEMBL1406283,11 1,12 1,18 1,21 1,52 5.362}
{0 CHEMBL1406324,1 1,11 1,21 1,51 1,52 5.139}
{0 CHEMBL1406465,1 1,21 1,52 5.33}
{0 CHEMBL1407424,2 1,3 1,5 1,7 1,10 1,11 1,12 1,14 1,15 1,21 1,24 1,47 1,52 5.64}
{0 CHEMBL1408132,1 1,13 1,21 1,52 5.68}
{0 CHEMBL1408163,4 1,10 1,11 1,21 1,22 1,52 5.565}
{0 CHEMBL1408293,1 1,5 1,11 1,16 1,19 1,21 1,27 1,46 1,52 4.854}
{0 CHEMBL1410056,1 1,7 1,11 1,21 1,52 4.801}
{0 CHEMBL1410244,1 1,21 1,22 1,26 1,52 5.296}
{0 CHEMBL1410573,1 1,21 1,52 4}
{0 CHEMBL1411577,1 1,11 1,21 1,27 1,52 5.382}
{0 CHEMBL1412247,2 1,3 1,5 1,7 1,8 1,10 1,11 1,12 1,14 1,21 1,38 1,52 5.747}
{0 CHEMBL1412731,1 1,5 1,21 1,30 1,52 4.9}
{0 CHEMBL1412746,1 1,7 1,11 1,12 1,21 1,52 5.833}
{0 CHEMBL1412917,2 1,3 1,5 1,7 1,8 1,10 1,11 1,12 1,17 1,21 1,36 1,38 1,44 1,52 5.582}
{0 CHEMBL1413595,1 1,21 1,22 1,52 5.45}
{0 CHEMBL1414222,1 1,11 1,21 1,35 1,39 1,44 1,52 4.79}
{0 CHEMBL1414263,1 1,11 1,21 1,22 1,52 5.353}
{0 CHEMBL1414727,2 1,3 1,5 1,7 1,8 1,10 1,11 1,12 1,14 1,16 1,17 1,21 1,24 1,38 1,50 1,52 5.207}
{0 CHEMBL1414888,11 1,12 1,21 1,52 4.754}
{0 CHEMBL1415221,10 1,11 1,12 1,18 1,21 1,52 5.553}
{0 CHEMBL1415236,16 1,21 1,52 5.495}
{0 CHEMBL1415426,1 1,21 1,52 4.597}
{0 CHEMBL1415432,1 1,21 1,24 1,52 5.244}
{0 CHEMBL1415644,1 1,5 1,21 1,30 1,52 5.167}
{0 CHEMBL1415903,8 1,10 1,11 1,12 1,18 1,21 1,52 5.27}
{0 CHEMBL1417203,1 1,21 1,35 1,52 4.527}
{0 CHEMBL1417267,10 1,11 1,12 1,18 1,21 1,52 4.924}
{0 CHEMBL1417312,1 1,11 1,12 1,18 1,21 1,52 5.08}
{0 CHEMBL1418473,2 1,3 1,5 1,7 1,8 1,10 1,11 1,12 1,17 1,21 1,38 1,44 1,52 4}
{0 CHEMBL1418689,1 1,11 1,12 1,21 1,52 5.429}
{0 CHEMBL1419388,1 1,13 1,21 1,52 5.407}
{0 CHEMBL1419432,13 1,21 1,52 5.618}
{0 CHEMBL1419630,1 1,11 1,21 1,22 1,38 1,52 5.211}
{0 CHEMBL1419659,12 1,13 1,21 1,52 4.91}
{0 CHEMBL1420025,11 1,21 1,31 1,52 5.703}
{0 CHEMBL1421070,1 1,2 1,21 1,22 1,47 1,50 1,52 5.353}
{0 CHEMBL1421488,1 1,3 1,12 1,21 1,51 1,52 5.257}
{0 CHEMBL1421887,1 1,11 1,21 1,22 1,38 1,52 4.472}
{0 CHEMBL1422657,1 1,7 1,11 1,21 1,52 4.587}
{0 CHEMBL1422691,1 1,19 1,21 1,52 4.496}
{0 CHEMBL1423215,2 1,3 1,5 1,7 1,10 1,11 1,12 1,14 1,15 1,21 1,24 1,47 1,52 5.607}
{0 CHEMBL1423236,4 1,6 1,11 1,16 1,21 1,52 5.371}
{0 CHEMBL1423563,1 1,11 1,13 1,21 1,31 1,52 5.618}
{0 CHEMBL1424233,1 1,11 1,12 1,21 1,52 5.342}
{0 CHEMBL1424332,1 1,11 1,12 1,21 1,52 5.613}
{0 CHEMBL1424756,1 1,11 1,13 1,19 1,21 1,22 1,52 5.282}
{0 CHEMBL1424949,2 1,3 1,5 1,8 1,11 1,12 1,17 1,21 1,38 1,44 1,52 5.138}
{0 CHEMBL1425497,1 1,11 1,21 1,22 1,52 5.662}
{0 CHEMBL1425837,1 1,19 1,21 1,27 1,43 1,52 5.248}
{0 CHEMBL1426029,1 1,11 1,21 1,30 1,52 5.156}
{0 CHEMBL1426134,1 1,7 1,11 1,16 1,21 1,22 1,52 5.198}
{0 CHEMBL1426449,11 1,12 1,18 1,21 1,51 1,52 5.264}
{0 CHEMBL1426913,2 1,3 1,5 1,7 1,8 1,10 1,11 1,12 1,16 1,17 1,21 1,38 1,52 5.511}
{0 CHEMBL1426940,10 1,11 1,12 1,18 1,21 1,52 5.31}
{0 CHEMBL1427447,1 1,11 1,21 1,22 1,52 5.252}
{0 CHEMBL1427844,11 1,12 1,21 1,43 1,52 4.836}
{0 CHEMBL1428459,1 1,10 1,13 1,21 1,52 5.446}
{0 CHEMBL1428519,10 1,12 1,21 1,22 1,52 4.15}
{0 CHEMBL1428643,16 1,21 1,52 4.108}
{0 CHEMBL1429327,1 1,21 1,52 5.22}
{0 CHEMBL1429980,1 1,21 1,52 4.205}
{0 CHEMBL1430606,1 1,11 1,12 1,21 1,22 1,52 4.65}
{0 CHEMBL1430796,1 1,3 1,21 1,52 4.262}
{0 CHEMBL1431954,10 1,21 1,42 1,52 4.712}
{0 CHEMBL1432423,4 1,6 1,11 1,16 1,21 1,52 5.378}
{0 CHEMBL1433041,1 1,11 1,16 1,21 1,24 1,38 1,52 4.254}
{0 CHEMBL1433646,1 1,21 1,52 4.821}
{0 CHEMBL1433732,1 1,7 1,11 1,21 1,47 1,52 4.445}
{0 CHEMBL1434341,1 1,21 1,52 5.247}
{0 CHEMBL1434941,1 1,21 1,52 5.185}
{0 CHEMBL1435090,1 1,11 1,21 1,40 1,52 4.854}
{0 CHEMBL1435407,1 1,21 1,52 5.32}
{0 CHEMBL1437928,11 1,12 1,16 1,21 1,52 4.305}
{0 CHEMBL1438060,1 1,21 1,40 1,52 4.857}
{0 CHEMBL1438329,16 1,21 1,44 1,52 5.463}
{0 CHEMBL1438370,1 1,8 1,21 1,27 1,52 5.031}
{0 CHEMBL1439031,11 1,12 1,18 1,21 1,52 5.137}
{0 CHEMBL1440161,1 1,11 1,12 1,21 1,44 1,52 4.77}
{0 CHEMBL1441534,1 1,11 1,17 1,21 1,30 1,46 1,49 1,50 1,52 4.458}
{0 CHEMBL1441693,11 1,12 1,21 1,43 1,52 5.42}
{0 CHEMBL1441819,16 1,21 1,52 4.644}
{0 CHEMBL1442086,1 1,11 1,21 1,52 5.249}
{0 CHEMBL1442565,21 1,51 1,52 5.18}
{0 CHEMBL1443044,10 1,11 1,12 1,18 1,21 1,52 5.299}
{0 CHEMBL1443664,1 1,4 1,6 1,11 1,16 1,21 1,52 5.64}
{0 CHEMBL1443989,4 1,8 1,16 1,21 1,52 5.328}
{0 CHEMBL1444730,1 1,21 1,27 1,43 1,52 5.312}
{0 CHEMBL1445359,1 1,13 1,21 1,22 1,52 5.376}
{0 CHEMBL1445612,1 1,11 1,19 1,21 1,22 1,38 1,52 5.191}
{0 CHEMBL1445897,1 1,16 1,21 1,24 1,35 1,52 4.714}
{0 CHEMBL1446088,1 1,21 1,52 4.458}
{0 CHEMBL1446658,1 1,8 1,13 1,21 1,44 1,52 5.046}
{0 CHEMBL1446720,11 1,12 1,18 1,21 1,52 5.483}
{0 CHEMBL1446929,1 1,11 1,21 1,37 1,52 5.573}
{0 CHEMBL1447034,1 1,11 1,19 1,21 1,39 1,52 4.519}
{0 CHEMBL1447350,1 1,21 1,25 1,52 4.424}
{0 CHEMBL1447470,11 1,16 1,24 1,52 5.577}
{0 CHEMBL1448063,11 1,16 1,24 1,52 5.509}
{0 CHEMBL1448202,1 1,11 1,19 1,21 1,22 1,38 1,52 4.177}
{0 CHEMBL1448381,1 1,11 1,21 1,22 1,52 5.087}
{0 CHEMBL1448452,1 1,7 1,11 1,21 1,22 1,26 1,38 1,43 1,52 5.652}
{0 CHEMBL1448942,1 1,21 1,35 1,46 1,52 4.58}
{0 CHEMBL1449939,1 1,21 1,52 4.369}
{0 CHEMBL1450031,1 1,11 1,19 1,21 1,27 1,44 1,52 5.228}
{0 CHEMBL1450054,2 1,3 1,5 1,7 1,10 1,11 1,12 1,15 1,21 1,36 1,47 1,52 5.595}
{0 CHEMBL1450151,1 1,12 1,21 1,52 5.237}
{0 CHEMBL1450899,1 1,21 1,52 5.365}
{0 CHEMBL1450901,1 1,11 1,21 1,52 4.996}
{0 CHEMBL1451147,1 1,11 1,12 1,19 1,21 1,52 5.434}
{0 CHEMBL1451561,1 1,11 1,16 1,21 1,44 1,52 5.613}
{0 CHEMBL1451783,1 1,11 1,16 1,21 1,52 5.297}
{0 CHEMBL1451864,1 1,11 1,21 1,22 1,25 1,38 1,44 1,52 5.398}
{0 CHEMBL1452833,13 1,21 1,36 1,52 5.597}
{0 CHEMBL1453822,1 1,11 1,21 1,27 1,43 1,52 4}
{0 CHEMBL1454157,1 1,21 1,44 1,52 5.255}
{0 CHEMBL1454914,2 1,3 1,5 1,7 1,10 1,11 1,12 1,15 1,21 1,36 1,52 5.559}
{0 CHEMBL1455989,1 1,11 1,12 1,21 1,52 5.331}
{0 CHEMBL1456449,2 1,3 1,5 1,7 1,8 1,10 1,11 1,12 1,14 1,21 1,38 1,52 5.04}
{0 CHEMBL1456627,1 1,4 1,6 1,11 1,16 1,21 1,52 5.476}
{0 CHEMBL1457083,1 1,11 1,21 1,22 1,44 1,52 5.158}
{0 CHEMBL1457528,2 1,3 1,5 1,8 1,11 1,12 1,17 1,21 1,38 1,44 1,45 1,52 5.175}
{0 CHEMBL1458018,1 1,19 1,21 1,51 1,52 4.004}
{0 CHEMBL1458077,1 1,3 1,21 1,52 5.297}
{0 CHEMBL1458611,1 1,13 1,21 1,52 4.757}
{0 CHEMBL1459508,1 1,11 1,16 1,21 1,44 1,52 4.708}
{0 CHEMBL1459617,11 1,21 1,22 1,52 5.222}
{0 CHEMBL1459627,11 1,12 1,21 1,52 5.479}
{0 CHEMBL1459828,1 1,7 1,11 1,14 1,21 1,27 1,47 1,52 4.425}
{0 CHEMBL1460199,11 1,12 1,21 1,52 5.604}
{0 CHEMBL1460460,10 1,11 1,12 1,21 1,52 5.386}
{0 CHEMBL1461121,1 1,11 1,12 1,21 1,45 1,52 5.321}
{0 CHEMBL1461540,1 1,8 1,11 1,12 1,21 1,27 1,43 1,52 5.3}
{0 CHEMBL1461587,2 1,3 1,5 1,7 1,8 1,10 1,11 1,12 1,16 1,17 1,21 1,38 1,52 5.372}
{0 CHEMBL1461897,1 1,21 1,52 5.013}
{0 CHEMBL1461986,2 1,3 1,5 1,7 1,10 1,11 1,12 1,14 1,15 1,21 1,47 1,52 5.714}
{0 CHEMBL1462310,10 1,11 1,12 1,21 1,52 5.093}
{0 CHEMBL1462629,2 1,3 1,5 1,7 1,8 1,10 1,11 1,12 1,14 1,21 1,36 1,38 1,52 5.184}
{0 CHEMBL1462665,1 1,7 1,11 1,12 1,17 1,21 1,22 1,52 5.297}
{0 CHEMBL1462800,1 1,21 1,35 1,52 4.368}
{0 CHEMBL1463421,2 1,3 1,5 1,8 1,11 1,12 1,14 1,21 1,38 1,52 5.399}
{0 CHEMBL1463657,2 1,3 1,5 1,7 1,8 1,10 1,11 1,12 1,17 1,21 1,38 1,52 5.564}
{0 CHEMBL1465029,4 1,6 1,11 1,16 1,21 1,52 5.66}
{0 CHEMBL1465047,1 1,6 1,11 1,16 1,21 1,52 5.646}
{0 CHEMBL1465117,1 1,11 1,21 1,22 1,52 4.851}
{0 CHEMBL1465837,11 1,21 1,22 1,52 5.013}
{0 CHEMBL1466065,1 1,9 1,11 1,21 1,22 1,52 5.742}
{0 CHEMBL1466739,1 1,11 1,21 1,25 1,30 1,52 5.234}
{0 CHEMBL1466798,10 1,11 1,12 1,18 1,21 1,52 6.029}
{0 CHEMBL1467393,2 1,3 1,5 1,7 1,8 1,10 1,11 1,12 1,14 1,21 1,24 1,38 1,50 1,52 5.538}
{0 CHEMBL1467678,1 1,11 1,12 1,13 1,21 1,52 5.575}
{0 CHEMBL1467732,1 1,11 1,16 1,21 1,24 1,38 1,52 5.003}
{0 CHEMBL1468584,2 1,3 1,5 1,7 1,8 1,10 1,11 1,12 1,17 1,21 1,38 1,44 1,52 5.478}
{0 CHEMBL1470414,1 1,2 1,21 1,22 1,38 1,44 1,52 5.028}
{0 CHEMBL1470485,1 1,5 1,21 1,25 1,52 4.943}
{0 CHEMBL1470685,2 1,3 1,5 1,8 1,11 1,12 1,17 1,21 1,38 1,52 5.398}
{0 CHEMBL1470814,2 1,3 1,5 1,8 1,11 1,12 1,14 1,18 1,21 1,38 1,52 5.159}
{0 CHEMBL1470939,21 1,51 1,52 5.098}
{0 CHEMBL1471136,1 1,21 1,52 4.028}
{0 CHEMBL1471189,1 1,10 1,19 1,21 1,27 1,52 5.012}
{0 CHEMBL1471220,1 1,2 1,11 1,21 1,52 4.461}
{0 CHEMBL1471640,1 1,11 1,12 1,21 1,52 4.801}
{0 CHEMBL1471698,1 1,11 1,21 1,27 1,43 1,52 5.159}
{0 CHEMBL1471821,2 1,3 1,5 1,7 1,8 1,10 1,11 1,12 1,17 1,21 1,38 1,52 5.629}
{0 CHEMBL1471841,1 1,11 1,21 1,22 1,27 1,43 1,52 5.007}
{0 CHEMBL1471924,11 1,52 5.438}
{0 CHEMBL1472120,2 1,3 1,5 1,7 1,8 1,10 1,11 1,12 1,14 1,21 1,24 1,38 1,50 1,52 5.613}
{0 CHEMBL1472602,1 1,21 1,52 4.688}
{0 CHEMBL1473000,12 1,13 1,21 1,52 5.2}
{0 CHEMBL1473924,1 1,21 1,44 1,47 1,51 1,52 5.046}
{0 CHEMBL1475603,1 1,11 1,19 1,21 1,22 1,38 1,52 5.135}
{0 CHEMBL1475697,1 1,2 1,11 1,21 1,22 1,38 1,52 4.857}
{0 CHEMBL1476337,21 1,22 1,40 1,52 5.143}
{0 CHEMBL1476418,1 1,11 1,21 1,44 1,52 5.173}
{0 CHEMBL1476441,1 1,21 1,52 5.086}
{0 CHEMBL1476481,1 1,19 1,21 1,22 1,28 1,52 5.385}
{0 CHEMBL1477133,1 1,4 1,6 1,11 1,16 1,21 1,52 5.447}
{0 CHEMBL1477374,2 1,3 1,5 1,7 1,10 1,11 1,12 1,15 1,21 1,36 1,52 5.656}
{0 CHEMBL1477757,2 1,3 1,5 1,7 1,10 1,11 1,12 1,14 1,15 1,21 1,24 1,50 1,52 5.629}
{0 CHEMBL1477787,1 1,11 1,21 1,52 4.225}
{0 CHEMBL1477963,1 1,21 1,52 5.322}
{0 CHEMBL1478395,1 1,11 1,17 1,21 1,52 5.131}
{0 CHEMBL1478489,1 1,11 1,12 1,21 1,22 1,52 5.583}
{0 CHEMBL1479132,1 1,11 1,12 1,21 1,52 5.259}
{0 CHEMBL1479190,1 1,5 1,11 1,21 1,30 1,52 4.479}
{0 CHEMBL1479917,1 1,10 1,21 1,52 5.305}
{0 CHEMBL1480181,4 1,6 1,11 1,16 1,21 1,52 5.554}
{0 CHEMBL1480280,1 1,13 1,21 1,52 5.654}
{0 CHEMBL1480634,1 1,21 1,27 1,52 4}
{0 CHEMBL1480663,1 1,3 1,11 1,21 1,43 1,52 4.507}
{0 CHEMBL1480992,1 1,3 1,11 1,13 1,21 1,52 5.413}
{0 CHEMBL1481364,1 1,7 1,11 1,19 1,20 1,21 1,52 4.845}
{0 CHEMBL1481410,11 1,21 1,46 1,52 5.348}
{0 CHEMBL1481550,1 1,4 1,11 1,16 1,21 1,52 5.498}
{0 CHEMBL1481678,10 1,11 1,12 1,18 1,21 1,52 5.085}
{0 CHEMBL1482029,6 1,16 1,21 1,46 1,52 4.55}
{0 CHEMBL1482621,11 1,12 1,52 4}
{0 CHEMBL1482944,10 1,11 1,12 1,18 1,21 1,41 1,46 1,52 5.484}
{0 CHEMBL1483521,1 1,12 1,21 1,52 5.349}
{0 CHEMBL1484275,2 1,3 1,5 1,8 1,11 1,12 1,17 1,21 1,38 1,44 1,52 5.678}
{0 CHEMBL1484880,3 1,5 1,8 1,11 1,17 1,21 1,38 1,44 1,52 5.533}
{0 CHEMBL1485648,1 1,7 1,10 1,11 1,12 1,18 1,21 1,52 5.212}
{0 CHEMBL1485688,2 1,3 1,5 1,8 1,11 1,12 1,14 1,21 1,38 1,52 5.652}
{0 CHEMBL1485727,16 1,21 1,52 5.636}
{0 CHEMBL1485767,21 1,52 5.12}
{0 CHEMBL1485836,11 1,12 1,18 1,21 1,52 4.588}
{0 CHEMBL1485902,10 1,11 1,12 1,18 1,19 1,21 1,52 5.02}
{0 CHEMBL1486752,11 1,12 1,46 1,52 4.625}
{0 CHEMBL1486842,1 1,19 1,21 1,52 4.532}
{0 CHEMBL1488095,1 1,21 1,25 1,52 4.86}
{0 CHEMBL1488474,1 1,17 1,21 1,22 1,52 5.419}
{0 CHEMBL1489482,2 1,3 1,5 1,7 1,10 1,11 1,12 1,14 1,15 1,21 1,47 1,52 5.582}
{0 CHEMBL1489693,1 1,21 1,35 1,50 1,52 4.426}
{0 CHEMBL1489863,10 1,11 1,12 1,18 1,21 1,52 5.055}
{0 CHEMBL1489910,1 1,11 1,19 1,21 1,35 1,52 4.375}
{0 CHEMBL1491177,1 1,4 1,6 1,11 1,16 1,21 1,52 5.409}
{0 CHEMBL1491351,8 1,11 1,21 1,52 5.262}
{0 CHEMBL1491764,1 1,21 1,52 4.967}
{0 CHEMBL1492004,1 1,8 1,11 1,13 1,21 1,52 5.484}
{0 CHEMBL1492428,10 1,36 1,52 4.349}
{0 CHEMBL1493133,1 1,21 1,52 4}
{0 CHEMBL1493377,1 1,3 1,13 1,21 1,52 5.297}
{0 CHEMBL1493891,1 1,11 1,16 1,21 1,52 4.796}
{0 CHEMBL1495250,1 1,11 1,19 1,21 1,22 1,38 1,52 5.254}
{0 CHEMBL1495785,10 1,11 1,12 1,18 1,21 1,23 1,52 5.32}
{0 CHEMBL1495812,3 1,5 1,7 1,10 1,11 1,12 1,14 1,21 1,24 1,52 4.633}
{0 CHEMBL1496262,2 1,3 1,5 1,8 1,11 1,12 1,17 1,21 1,38 1,44 1,52 5.159}
{0 CHEMBL1496326,11 1,21 1,24 1,52 5.213}
{0 CHEMBL1496555,1 1,21 1,52 4.896}
{0 CHEMBL1497027,1 1,8 1,10 1,21 1,52 4.406}
{0 CHEMBL1497168,2 1,3 1,5 1,7 1,8 1,10 1,11 1,12 1,14 1,21 1,38 1,52 5.544}
{0 CHEMBL1497457,1 1,17 1,18 1,21 1,44 1,52 5.075}
{0 CHEMBL1497990,1 1,10 1,11 1,12 1,18 1,21 1,22 1,26 1,38 1,52 5.369}
{0 CHEMBL1498247,10 1,11 1,12 1,21 1,52 5.197}
{0 CHEMBL1498363,10 1,11 1,12 1,52 6.264}
{0 CHEMBL1498441,1 1,13 1,21 1,52 5.351}
{0 CHEMBL1498859,1 1,3 1,7 1,11 1,21 1,22 1,52 5.255}
{0 CHEMBL1499138,1 1,10 1,11 1,12 1,18 1,21 1,52 5.34}
{0 CHEMBL1499401,10 1,11 1,12 1,16 1,18 1,21 1,52 5.059}
{0 CHEMBL1499464,2 1,3 1,5 1,7 1,10 1,11 1,12 1,15 1,21 1,52 5.633}
{0 CHEMBL1499471,16 1,21 1,52 5.369}
{0 CHEMBL1499690,11 1,13 1,21 1,52 5.638}
{0 CHEMBL1499937,11 1,12 1,21 1,52 5.532}
{0 CHEMBL1499970,2 1,3 1,5 1,7 1,8 1,10 1,11 1,12 1,14 1,17 1,21 1,24 1,38 1,44 1,52 6.114}
{0 CHEMBL1501000,1 1,4 1,8 1,21 1,44 1,52 4.394}
{0 CHEMBL1501432,6 1,7 1,11 1,16 1,21 1,52 5.833}
{0 CHEMBL1501518,10 1,11 1,12 1,18 1,21 1,52 5.216}
{0 CHEMBL1501539,1 1,21 1,27 1,46 1,52 5.129}
{0 CHEMBL1501635,1 1,11 1,21 1,38 1,52 4.513}
{0 CHEMBL1502278,13 1,21 1,52 5.471}
{0 CHEMBL1503011,1 1,5 1,11 1,19 1,21 1,27 1,46 1,52 4.714}
{0 CHEMBL1503015,1 1,11 1,13 1,19 1,21 1,22 1,52 5.561}
{0 CHEMBL1503187,1 1,10 1,11 1,12 1,21 1,52 5.547}
{0 CHEMBL1503275,10 1,11 1,12 1,18 1,21 1,52 4.83}
{0 CHEMBL1503803,10 1,11 1,12 1,18 1,21 1,52 5.514}
{0 CHEMBL1503899,1 1,21 1,52 5.008}
{0 CHEMBL1504008,1 1,3 1,21 1,52 5.187}
{0 CHEMBL1504229,1 1,5 1,21 1,27 1,52 4.335}
{0 CHEMBL1504286,1 1,21 1,27 1,43 1,52 5.166}
{0 CHEMBL1504634,1 1,7 1,11 1,21 1,27 1,43 1,52 5.21}
{0 CHEMBL1504638,1 1,4 1,6 1,16 1,21 1,25 1,30 1,52 5.616}
{0 CHEMBL1504939,1 1,21 1,22 1,26 1,52 5.292}
{0 CHEMBL1505105,21 1,52 5.173}
{0 CHEMBL1505246,1 1,21 1,22 1,26 1,52 4.914}
{0 CHEMBL1505527,2 1,3 1,5 1,7 1,8 1,10 1,11 1,12 1,17 1,21 1,38 1,44 1,52 5.592}
{0 CHEMBL1505531,11 1,21 1,52 5.575}
{0 CHEMBL1505843,1 1,21 1,52 4.354}
{0 CHEMBL1506213,2 1,3 1,5 1,7 1,8 1,10 1,11 1,12 1,17 1,21 1,38 1,52 5.384}
{0 CHEMBL1506382,2 1,3 1,5 1,8 1,11 1,12 1,17 1,21 1,38 1,52 5.431}
{0 CHEMBL1506548,1 1,19 1,21 1,52 4.807}
{0 CHEMBL1507696,2 1,3 1,5 1,8 1,11 1,12 1,17 1,21 1,38 1,44 1,52 5.565}
{0 CHEMBL1507883,2 1,11 1,21 1,22 1,44 1,52 5.287}
{0 CHEMBL1509082,1 1,21 1,27 1,43 1,52 5.362}
{0 CHEMBL1509207,11 1,21 1,22 1,52 5.28}
{0 CHEMBL1509377,1 1,5 1,11 1,19 1,21 1,27 1,46 1,52 5.142}
{0 CHEMBL1509500,1 1,11 1,12 1,21 1,44 1,52 4.411}
{0 CHEMBL1509975,1 1,11 1,21 1,38 1,43 1,52 4.224}
{0 CHEMBL1510349,1 1,5 1,11 1,19 1,21 1,27 1,46 1,52 5.212}
{0 CHEMBL1510509,10 1,11 1,12 1,21 1,52 5.302}
{0 CHEMBL1510673,2 1,3 1,5 1,7 1,10 1,11 1,12 1,15 1,17 1,21 1,36 1,52 5.633}
{0 CHEMBL1510800,1 1,21 1,52 5.742}
{0 CHEMBL1510832,1 1,3 1,21 1,47 1,52 4.524}
{0 CHEMBL1510837,1 1,21 1,52 4.004}
{0 CHEMBL1511078,9 1,11 1,12 1,21 1,41 1,52 4.004}
{0 CHEMBL1511316,1 1,11 1,21 1,52 4.274}
{0 CHEMBL1511489,1 1,21 1,22 1,38 1,52 4.295}
{0 CHEMBL1511826,1 1,12 1,21 1,46 1,52 5.494}
{0 CHEMBL1513113,1 1,3 1,11 1,21 1,52 5.539}
{0 CHEMBL1514758,5 1,21 1,46 1,52 4.799}
{0 CHEMBL1516970,8 1,10 1,11 1,12 1,18 1,21 1,52 5.338}
{0 CHEMBL1517167,1 1,21 1,22 1,38 1,52 4}
{0 CHEMBL1517220,1 1,19 1,20 1,21 1,45 1,52 4.16}
{0 CHEMBL1517613,2 1,3 1,5 1,8 1,11 1,12 1,16 1,17 1,21 1,38 1,44 1,52 5.259}
{0 CHEMBL1517674,1 1,7 1,11 1,21 1,22 1,43 1,52 5.339}
{0 CHEMBL1517799,1 1,5 1,11 1,19 1,21 1,27 1,43 1,46 1,52 5.55}
{0 CHEMBL1518604,1 1,5 1,11 1,19 1,21 1,27 1,46 1,52 4.815}
{0 CHEMBL1518655,1 1,21 1,52 4.455}
{0 CHEMBL1518799,1 1,16 1,21 1,52 4.959}
{0 CHEMBL1518805,1 1,21 1,40 1,52 5.507}
{0 CHEMBL1519071,21 1,27 1,46 1,52 4.991}
{0 CHEMBL1519228,1 1,21 1,44 1,52 5.71}
{0 CHEMBL1519252,4 1,6 1,11 1,16 1,21 1,52 5.47}
{0 CHEMBL1519790,1 1,10 1,19 1,21 1,52 4.678}
{0 CHEMBL1520143,1 1,5 1,21 1,52 4.907}
{0 CHEMBL1521383,2 1,3 1,5 1,7 1,8 1,10 1,11 1,12 1,14 1,21 1,36 1,38 1,52 5.611}
{0 CHEMBL1521469,1 1,4 1,6 1,11 1,16 1,21 1,52 5.437}
{0 CHEMBL1521841,1 1,4 1,6 1,11 1,16 1,21 1,44 1,52 5.541}
{0 CHEMBL1522027,1 1,11 1,16 1,21 1,24 1,38 1,52 4.854}
{0 CHEMBL1522129,1 1,11 1,21 1,22 1,52 5.14}
{0 CHEMBL1522153,10 1,11 1,12 1,17 1,21 1,22 1,52 4.71}
{0 CHEMBL1522413,1 1,14 1,21 1,47 1,52 4.688}
{0 CHEMBL1522846,1 1,7 1,11 1,21 1,52 5.089}
{0 CHEMBL1523040,1 1,12 1,17 1,21 1,22 1,52 5.578}
{0 CHEMBL1523731,1 1,11 1,21 1,22 1,52 4.848}
{0 CHEMBL1524102,1 1,16 1,21 1,24 1,36 1,52 5.037}
{0 CHEMBL1524353,11 1,16 1,21 1,24 1,52 5.047}
{0 CHEMBL1524614,2 1,3 1,5 1,7 1,8 1,10 1,11 1,12 1,16 1,17 1,21 1,38 1,44 1,52 5.633}
{0 CHEMBL1525928,1 1,11 1,13 1,21 1,52 5.427}
{0 CHEMBL1526855,1 1,11 1,21 1,52 5.115}
{0 CHEMBL1526949,1 1,11 1,21 1,22 1,26 1,52 4.996}
{0 CHEMBL1527035,10 1,11 1,12 1,21 1,52 5.34}
{0 CHEMBL1527258,10 1,11 1,12 1,18 1,21 1,52 5.215}
{0 CHEMBL1527523,1 1,21 1,52 5.346}
{0 CHEMBL1527869,1 1,21 1,52 4.389}
{0 CHEMBL1528584,1 1,11 1,21 1,52 4.785}
{0 CHEMBL1528727,1 1,7 1,11 1,21 1,52 5.304}
{0 CHEMBL1529598,1 1,21 1,22 1,38 1,44 1,52 5.419}
{0 CHEMBL1530086,10 1,11 1,12 1,18 1,21 1,52 5.363}
{0 CHEMBL1530439,1 1,5 1,11 1,21 1,22 1,38 1,52 4.712}
{0 CHEMBL1531249,10 1,11 1,12 1,18 1,21 1,52 5.207}
{0 CHEMBL1531298,9 1,11 1,12 1,21 1,52 4.77}
{0 CHEMBL1532151,1 1,19 1,21 1,22 1,38 1,52 5.257}
{0 CHEMBL1533454,1 1,12 1,21 1,52 5.264}
{0 CHEMBL1533940,10 1,21 1,52 4}
{0 CHEMBL1534370,4 1,6 1,16 1,21 1,52 5.604}
{0 CHEMBL1534898,2 1,3 1,5 1,7 1,8 1,10 1,11 1,12 1,14 1,17 1,21 1,24 1,38 1,52 5.541}
{0 CHEMBL1534979,1 1,5 1,9 1,11 1,12 1,21 1,41 1,42 1,52 5.42}
{0 CHEMBL1536556,1 1,21 1,22 1,30 1,52 4.427}
{0 CHEMBL1536626,1 1,12 1,13 1,21 1,52 5.678}
{0 CHEMBL1536723,2 1,3 1,5 1,7 1,8 1,10 1,11 1,12 1,14 1,21 1,24 1,38 1,50 1,52 5.642}
{0 CHEMBL1536777,2 1,3 1,5 1,7 1,8 1,10 1,11 1,12 1,14 1,17 1,21 1,24 1,38 1,44 1,52 5.604}
{0 CHEMBL1536979,2 1,3 1,5 1,7 1,8 1,10 1,11 1,12 1,17 1,21 1,36 1,38 1,44 1,52 5.599}
{0 CHEMBL1537130,1 1,11 1,12 1,21 1,30 1,52 5.924}
{0 CHEMBL1538929,11 1,16 1,24 1,52 4.921}
{0 CHEMBL1539778,1 1,21 1,22 1,46 1,52 4.463}
{0 CHEMBL1540026,1 1,11 1,19 1,21 1,22 1,38 1,52 5.281}
{0 CHEMBL1540295,1 1,11 1,12 1,21 1,44 1,52 4.824}
{0 CHEMBL1540472,1 1,7 1,10 1,11 1,12 1,21 1,36 1,43 1,52 5.475}
{0 CHEMBL1540610,1 1,21 1,52 4.169}
{0 CHEMBL1540631,1 1,21 1,52 4.562}
{0 CHEMBL1540656,10 1,11 1,12 1,18 1,21 1,52 5.268}
{0 CHEMBL1540685,1 1,3 1,11 1,21 1,43 1,52 4.418}
{0 CHEMBL1540989,1 1,11 1,21 1,28 1,52 4.674}
{0 CHEMBL1540993,1 1,19 1,21 1,22 1,52 4.36}
{0 CHEMBL1541667,1 1,10 1,13 1,21 1,52 5.389}
{0 CHEMBL1541731,2 1,3 1,5 1,7 1,10 1,11 1,12 1,14 1,15 1,21 1,36 1,47 1,52 5.567}
{0 CHEMBL1541864,7 1,11 1,16 1,18 1,21 1,52 6.089}
{0 CHEMBL1541917,2 1,3 1,5 1,7 1,8 1,10 1,11 1,12 1,17 1,21 1,24 1,38 1,44 1,52 5.081}
{0 CHEMBL1543030,1 1,10 1,11 1,12 1,18 1,21 1,22 1,26 1,38 1,52 5.306}
{0 CHEMBL1543542,21 1,46 1,52 5.356}
{0 CHEMBL1543727,1 1,4 1,6 1,11 1,16 1,21 1,52 5.69}
{0 CHEMBL1544084,4 1,6 1,10 1,11 1,16 1,21 1,31 1,52 5.57}
{0 CHEMBL1544859,1 1,21 1,25 1,44 1,52 4.611}
{0 CHEMBL1545741,1 1,11 1,21 1,30 1,52 4.836}
{0 CHEMBL1545769,2 1,3 1,5 1,7 1,8 1,10 1,11 1,12 1,14 1,21 1,38 1,52 5.75}
{0 CHEMBL1546503,1 1,19 1,20 1,21 1,45 1,52 4.523}
{0 CHEMBL1546605,16 1,21 1,52 5.13}
{0 CHEMBL1547022,1 1,4 1,6 1,16 1,21 1,52 5.46}
{0 CHEMBL1547131,2 1,3 1,5 1,7 1,8 1,10 1,11 1,12 1,14 1,21 1,36 1,38 1,52 5.664}
{0 CHEMBL1547409,1 1,21 1,46 1,52 5.093}
{0 CHEMBL1547657,10 1,11 1,12 1,18 1,19 1,21 1,52 5.548}
{0 CHEMBL1547804,1 1,11 1,12 1,21 1,52 5.223}
{0 CHEMBL1547939,1 1,2 1,11 1,21 1,30 1,44 1,52 5.183}
{0 CHEMBL1548024,1 1,11 1,21 1,52 4.189}
{0 CHEMBL1548470,1 1,12 1,21 1,35 1,52 5.026}
{0 CHEMBL1548507,21 1,52 5.292}
{0 CHEMBL1549278,11 1,12 1,18 1,21 1,52 4.724}
{0 CHEMBL1549332,1 1,6 1,7 1,11 1,16 1,21 1,52 5.165}
{0 CHEMBL1549534,4 1,6 1,16 1,21 1,52 5.577}
{0 CHEMBL1549607,1 1,11 1,21 1,22 1,52 5.285}
{0 CHEMBL1550651,2 1,3 1,5 1,8 1,11 1,12 1,17 1,21 1,38 1,44 1,52 5.506}
{0 CHEMBL1550776,1 1,21 1,39 1,52 5.199}
{0 CHEMBL1551307,1 1,13 1,21 1,52 5.764}
{0 CHEMBL1552246,1 1,21 1,27 1,52 5.196}
{0 CHEMBL1552516,1 1,17 1,18 1,21 1,47 1,52 5.12}
{0 CHEMBL1553099,1 1,21 1,22 1,38 1,44 1,52 4.717}
{0 CHEMBL1553163,1 1,5 1,21 1,52 4.81}
{0 CHEMBL1553245,1 1,11 1,21 1,52 5.365}
{0 CHEMBL1553409,21 1,52 4.91}
{0 CHEMBL1553733,1 1,5 1,21 1,52 4.648}
{0 CHEMBL1554345,1 1,19 1,21 1,22 1,38 1,52 4.833}
{0 CHEMBL1555928,1 1,19 1,21 1,22 1,52 5.132}
{0 CHEMBL1555995,1 1,19 1,21 1,22 1,52 4.547}
{0 CHEMBL1556201,1 1,4 1,6 1,16 1,21 1,22 1,52 5.564}
{0 CHEMBL1556308,1 1,3 1,21 1,52 4}
{0 CHEMBL1556354,1 1,10 1,21 1,52 5.323}
{0 CHEMBL1556561,1 1,21 1,44 1,52 4.421}
{0 CHEMBL1556666,1 1,10 1,12 1,21 1,52 5.276}
{0 CHEMBL1556853,2 1,3 1,5 1,7 1,8 1,10 1,11 1,12 1,17 1,21 1,38 1,44 1,52 5.606}
{0 CHEMBL1558250,10 1,11 1,12 1,18 1,21 1,52 4.903}
{0 CHEMBL1558595,1 1,17 1,21 1,22 1,35 1,52 5.627}
{0 CHEMBL1558656,10 1,11 1,12 1,16 1,18 1,21 1,52 5.01}
{0 CHEMBL1559194,1 1,4 1,6 1,11 1,16 1,21 1,52 5.45}
{0 CHEMBL1559314,1 1,19 1,21 1,24 1,35 1,52 4.815}
{0 CHEMBL1559351,1 1,7 1,21 1,52 5.59}
{0 CHEMBL1560104,1 1,4 1,6 1,11 1,16 1,21 1,52 5.62}
{0 CHEMBL1560210,10 1,11 1,12 1,18 1,21 1,52 5.514}
{0 CHEMBL1560961,1 1,3 1,21 1,46 1,52 4.162}
{0 CHEMBL1561393,10 1,11 1,12 1,52 5.371}
{0 CHEMBL1561849,1 1,21 1,27 1,52 5.369}
{0 CHEMBL1561952,10 1,11 1,12 1,18 1,19 1,21 1,52 5.268}
{0 CHEMBL1562170,21 1,51 1,52 5.114}
{0 CHEMBL1563439,2 1,3 1,5 1,7 1,8 1,10 1,11 1,12 1,14 1,21 1,38 1,52 5.561}
{0 CHEMBL1563637,1 1,11 1,13 1,21 1,22 1,52 5.421}
{0 CHEMBL1563641,1 1,10 1,12 1,21 1,52 5.472}
{0 CHEMBL1564114,1 1,21 1,52 4.338}
{0 CHEMBL1564199,1 1,21 1,22 1,38 1,44 1,52 5.246}
{0 CHEMBL1564526,1 1,21 1,52 4.44}
{0 CHEMBL1564678,1 1,5 1,6 1,11 1,21 1,52 5.539}
{0 CHEMBL1565057,1 1,2 1,11 1,21 1,52 4.292}
{0 CHEMBL1565298,2 1,3 1,5 1,7 1,8 1,10 1,11 1,12 1,14 1,21 1,38 1,52 5.699}
{0 CHEMBL1566241,1 1,4 1,6 1,11 1,16 1,21 1,52 5.565}
{0 CHEMBL1566720,1 1,11 1,19 1,20 1,21 1,22 1,38 1,52 4.133}
{0 CHEMBL1566805,1 1,21 1,52 4.592}
{0 CHEMBL1566857,1 1,21 1,52 4.004}
{0 CHEMBL1566909,1 1,16 1,21 1,52 4.278}
{0 CHEMBL1567396,1 1,11 1,19 1,21 1,39 1,44 1,52 5.298}
{0 CHEMBL1567470,2 1,3 1,5 1,7 1,8 1,10 1,11 1,12 1,17 1,21 1,38 1,44 1,52 5.52}
{0 CHEMBL1567561,1 1,21 1,52 5.222}
{0 CHEMBL1567848,1 1,11 1,21 1,22 1,52 5.309}
{0 CHEMBL1567975,10 1,21 1,52 5.324}
{0 CHEMBL1568506,10 1,11 1,12 1,16 1,18 1,21 1,52 5.346}
{0 CHEMBL1568720,1 1,7 1,11 1,21 1,22 1,52 5.253}
{0 CHEMBL1570378,10 1,11 1,12 1,18 1,21 1,52 5.079}
{0 CHEMBL1570909,1 1,7 1,21 1,22 1,38 1,52 5.225}
{0 CHEMBL1571309,11 1,12 1,21 1,52 5.444}
{0 CHEMBL1571594,1 1,3 1,11 1,13 1,21 1,52 5.406}
{0 CHEMBL1571642,1 1,7 1,21 1,22 1,52 5.11}
{0 CHEMBL1571835,1 1,7 1,11 1,21 1,25 1,52 5.147}
{0 CHEMBL1572009,1 1,21 1,45 1,52 5.382}
{0 CHEMBL1572059,1 1,11 1,21 1,22 1,52 5.452}
{0 CHEMBL1573256,2 1,3 1,5 1,7 1,8 1,10 1,11 1,12 1,17 1,21 1,36 1,38 1,52 5.561}
{0 CHEMBL1573412,8 1,21 1,52 5.273}
{0 CHEMBL1573865,1 1,11 1,19 1,21 1,22 1,52 4.932}
{0 CHEMBL1574141,10 1,12 1,21 1,52 5.447}
{0 CHEMBL1575099,1 1,2 1,10 1,11 1,12 1,19 1,21 1,52 5.214}
{0 CHEMBL1575454,1 1,5 1,21 1,46 1,52 4.341}
{0 CHEMBL1575698,4 1,6 1,16 1,21 1,52 5.697}
{0 CHEMBL1575781,11 1,52 4.775}
{0 CHEMBL1576073,1 1,10 1,11 1,12 1,18 1,21 1,52 4.86}
{0 CHEMBL1576151,1 1,21 1,52 5.357}
{0 CHEMBL1576239,1 1,21 1,42 1,52 4.363}
{0 CHEMBL1576905,10 1,13 1,21 1,52 4.788}
{0 CHEMBL1577109,2 1,3 1,5 1,8 1,11 1,12 1,14 1,21 1,38 1,52 5.471}
{0 CHEMBL1577127,7 1,11 1,21 1,52 5.717}
{0 CHEMBL1577416,2 1,3 1,5 1,7 1,8 1,10 1,11 1,12 1,17 1,21 1,38 1,52 5.331}
{0 CHEMBL1578442,2 1,3 1,5 1,7 1,8 1,10 1,11 1,12 1,14 1,21 1,24 1,38 1,50 1,52 4.848}
{0 CHEMBL1578716,2 1,3 1,5 1,7 1,8 1,10 1,11 1,12 1,14 1,21 1,38 1,52 5.742}
{0 CHEMBL1579020,1 1,9 1,11 1,21 1,22 1,29 1,38 1,52 5.635}
{0 CHEMBL1579066,19 1,52 4.772}
{0 CHEMBL1579104,1 1,21 1,35 1,52 5.188}
{0 CHEMBL1579143,1 1,21 1,22 1,23 1,26 1,44 1,52 4.873}
{0 CHEMBL1579506,1 1,21 1,52 4.386}
{0 CHEMBL1580093,1 1,7 1,11 1,12 1,21 1,52 4.648}
{0 CHEMBL1580244,4 1,6 1,11 1,16 1,21 1,52 5.481}
{0 CHEMBL1580263,1 1,11 1,19 1,21 1,52 4.388}
{0 CHEMBL1580467,1 1,10 1,21 1,52 5.577}
{0 CHEMBL1580846,10 1,11 1,21 1,52 5.618}
{0 CHEMBL1581450,10 1,11 1,12 1,21 1,40 1,52 5.471}
{0 CHEMBL1581721,1 1,11 1,12 1,21 1,52 5.42}
{0 CHEMBL1582492,1 1,21 1,52 4.002}
{0 CHEMBL1583212,11 1,12 1,21 1,52 5.234}
{0 CHEMBL1583246,2 1,3 1,5 1,7 1,8 1,10 1,11 1,12 1,14 1,17 1,21 1,24 1,38 1,44 1,52 5.742}
{0 CHEMBL1584921,10 1,11 1,12 1,18 1,21 1,52 5.662}
{0 CHEMBL1585158,1 1,21 1,52 5.613}
{0 CHEMBL1586116,1 1,21 1,44 1,52 4.334}
{0 CHEMBL1586182,1 1,7 1,10 1,11 1,12 1,21 1,46 1,52 5.561}
{0 CHEMBL1586442,10 1,21 1,52 4.277}
{0 CHEMBL1586607,13 1,21 1,52 5.717}
{0 CHEMBL1586803,1 1,21 1,52 4.018}
{0 CHEMBL1587532,7 1,10 1,11 1,12 1,21 1,52 4.287}
{0 CHEMBL1587867,2 1,3 1,5 1,7 1,8 1,10 1,11 1,12 1,14 1,21 1,26 1,38 1,52 5.678}
{0 CHEMBL1587881,11 1,12 1,18 1,21 1,52 5.428}
{0 CHEMBL1587985,9 1,11 1,12 1,21 1,52 5.664}
{0 CHEMBL1588608,1 1,21 1,24 1,52 4.728}
{0 CHEMBL1588784,1 1,21 1,52 4.597}
{0 CHEMBL1590623,1 1,11 1,19 1,21 1,52 4.609}
{0 CHEMBL1590970,1 1,21 1,22 1,52 5.371}
{0 CHEMBL1591536,1 1,21 1,52 5.284}
{0 CHEMBL1592491,1 1,11 1,21 1,27 1,52 5.416}
{0 CHEMBL1593625,1 1,7 1,11 1,21 1,52 5.038}
{0 CHEMBL1594235,1 1,4 1,6 1,11 1,16 1,21 1,52 5.446}
{0 CHEMBL1595265,21 1,27 1,46 1,52 4.924}
{0 CHEMBL1595621,11 1,12 1,16 1,18 1,21 1,52 5.65}
{0 CHEMBL1596580,1 1,11 1,21 1,52 4.684}
{0 CHEMBL1598498,1 1,21 1,52 4.455}
{0 CHEMBL1598842,11 1,12 1,21 1,52 5.444}
{0 CHEMBL1598885,2 1,3 1,5 1,7 1,8 1,10 1,11 1,12 1,14 1,16 1,17 1,21 1,24 1,38 1,44 1,50 1,52 5.434}
{0 CHEMBL1598969,1 1,19 1,20 1,21 1,45 1,52 4.154}
{0 CHEMBL1599302,4 1,6 1,11 1,16 1,21 1,52 5.432}
{0 CHEMBL1599488,1 1,4 1,5 1,6 1,11 1,16 1,21 1,52 5.295}
{0 CHEMBL1599560,6 1,11 1,13 1,21 1,52 4}
{0 CHEMBL1599569,1 1,21 1,22 1,38 1,44 1,51 1,52 4.587}
{0 CHEMBL1599593,1 1,11 1,21 1,22 1,52 4.928}
{0 CHEMBL1601498,1 1,11 1,21 1,52 4.254}
{0 CHEMBL1601716,1 1,5 1,21 1,52 4.87}
{0 CHEMBL1602045,1 1,7 1,11 1,13 1,21 1,22 1,52 5.602}
{0 CHEMBL1602775,1 1,11 1,21 1,52 4.485}
{0 CHEMBL1602832,1 1,3 1,7 1,11 1,21 1,52 4.158}
{0 CHEMBL1604044,1 1,7 1,11 1,21 1,43 1,52 5.272}
{0 CHEMBL1604932,10 1,11 1,12 1,18 1,21 1,52 5.36}
{0 CHEMBL1605172,1 1,21 1,22 1,26 1,52 5.097}
{0 CHEMBL1605288,1 1,7 1,11 1,19 1,21 1,22 1,38 1,52 4.033}
{0 CHEMBL1605787,10 1,11 1,21 1,24 1,40 1,52 5.504}
{0 CHEMBL1606561,1 1,11 1,12 1,21 1,52 5.256}
{0 CHEMBL1607416,1 1,8 1,11 1,16 1,21 1,25 1,27 1,52 4.396}
{0 CHEMBL1608601,10 1,11 1,21 1,24 1,52 5.462}
{0 CHEMBL1609077,1 1,21 1,52 4.491}
{0 CHEMBL1609157,1 1,3 1,7 1,9 1,11 1,21 1,44 1,52 4.287}
{0 CHEMBL1609454,1 1,9 1,17 1,21 1,35 1,44 1,52 4.562}
{0 CHEMBL1609841,1 1,11 1,16 1,21 1,24 1,38 1,52 4.674}
{0 CHEMBL1610327,21 1,27 1,46 1,52 4.812}
{0 CHEMBL1610783,1 1,21 1,52 4.987}
{0 CHEMBL1610801,1 1,21 1,22 1,46 1,52 4.876}
{0 CHEMBL1610821,7 1,9 1,11 1,21 1,52 5.496}
{0 CHEMBL1611010,1 1,5 1,21 1,46 1,52 5.399}
{0 CHEMBL1611140,11 1,52 5.105}
{0 CHEMBL1611926,1 1,7 1,11 1,12 1,21 1,22 1,52 5.71}
{0 CHEMBL1611996,1 1,11 1,12 1,16 1,21 1,46 1,52 5.202}
{0 CHEMBL1613004,7 1,21 1,51 1,52 4.9}
{0 CHEMBL164,1 1,21 1,49 1,52 5.622}
{0 CHEMBL1697970,1 1,3 1,21 1,22 1,52 4.406}
{0 CHEMBL1698738,1 1,13 1,21 1,31 1,52 5.658}
{0 CHEMBL1699239,16 1,21 1,52 5.526}
{0 CHEMBL1699324,1 1,2 1,21 1,52 5.164}
{0 CHEMBL1700665,1 1,4 1,6 1,11 1,16 1,21 1,52 5.9}
{0 CHEMBL1701371,4 1,6 1,11 1,16 1,21 1,52 5.327}
{0 CHEMBL1701867,1 1,7 1,21 1,22 1,41 1,52 4.724}
{0 CHEMBL1702108,2 1,3 1,5 1,7 1,8 1,10 1,11 1,12 1,17 1,21 1,24 1,38 1,44 1,52 5.417}
{0 CHEMBL1702670,8 1,16 1,21 1,52 5.158}
{0 CHEMBL1703008,2 1,3 1,5 1,7 1,8 1,10 1,11 1,12 1,17 1,21 1,38 1,52 5.298}
{0 CHEMBL1703860,1 1,11 1,21 1,52 5.068}
{0 CHEMBL1703959,1 1,21 1,40 1,52 5.451}
{0 CHEMBL1704351,1 1,11 1,21 1,28 1,52 5.246}
{0 CHEMBL1704746,1 1,7 1,11 1,19 1,21 1,22 1,38 1,52 4.297}
{0 CHEMBL1704847,1 1,4 1,6 1,11 1,16 1,21 1,52 5.714}
{0 CHEMBL1705864,1 1,8 1,21 1,52 4.799}
{0 CHEMBL1706030,1 1,4 1,11 1,16 1,21 1,52 5.757}
{0 CHEMBL1706489,1 1,2 1,19 1,21 1,24 1,52 4.851}
{0 CHEMBL1706764,1 1,2 1,7 1,11 1,21 1,44 1,52 5.18}
{0 CHEMBL1707047,1 1,11 1,21 1,52 4.914}
{0 CHEMBL1707394,1 1,11 1,19 1,21 1,22 1,38 1,52 5.275}
{0 CHEMBL1707942,1 1,11 1,21 1,30 1,52 5.548}
{0 CHEMBL1708357,1 1,7 1,11 1,21 1,52 5.629}
{0 CHEMBL1708462,13 1,21 1,52 5.323}
{0 CHEMBL1709150,1 1,11 1,16 1,21 1,52 4.004}
{0 CHEMBL1709489,1 1,21 1,44 1,52 5.375}
{0 CHEMBL1710658,1 1,3 1,11 1,13 1,21 1,52 5.342}
{0 CHEMBL1710726,16 1,21 1,52 5.478}
{0 CHEMBL1711351,13 1,21 1,52 5.644}
{0 CHEMBL1711459,1 1,21 1,44 1,52 5.308}
{0 CHEMBL1711889,1 1,7 1,11 1,19 1,21 1,52 4.924}
{0 CHEMBL1714353,1 1,11 1,21 1,22 1,52 5.538}
{0 CHEMBL1714422,1 1,11 1,19 1,20 1,21 1,44 1,52 4.385}
{0 CHEMBL1714869,1 1,4 1,6 1,11 1,16 1,21 1,52 5.474}
{0 CHEMBL1715007,21 1,22 1,27 1,46 1,52 5.135}
{0 CHEMBL1715466,1 1,11 1,21 1,22 1,52 4.796}
{0 CHEMBL1715700,1 1,21 1,52 5.491}
{0 CHEMBL1715936,1 1,21 1,22 1,52 5.343}
{0 CHEMBL1716759,1 1,16 1,19 1,21 1,22 1,38 1,52 5.121}
{0 CHEMBL1716983,1 1,13 1,21 1,52 5.303}
{0 CHEMBL1717994,1 1,11 1,21 1,52 4.914}
{0 CHEMBL1720428,1 1,21 1,52 4.424}
{0 CHEMBL1720952,1 1,2 1,11 1,19 1,21 1,52 4.983}
{0 CHEMBL1721008,1 1,11 1,21 1,22 1,28 1,52 5.088}
{0 CHEMBL1721699,1 1,11 1,21 1,27 1,52 5.143}
{0 CHEMBL1722372,1 1,21 1,22 1,38 1,52 4.129}
{0 CHEMBL1722720,1 1,4 1,6 1,11 1,16 1,21 1,52 4.9}
{0 CHEMBL1722809,1 1,11 1,21 1,52 4.316}
{0 CHEMBL1723788,1 1,4 1,6 1,11 1,16 1,21 1,52 5.38}
{0 CHEMBL1724713,1 1,13 1,21 1,52 5.225}
{0 CHEMBL1725205,4 1,6 1,11 1,16 1,21 1,52 5.249}
{0 CHEMBL1725481,1 1,13 1,21 1,52 5.394}
{0 CHEMBL1725549,1 1,7 1,11 1,19 1,21 1,27 1,28 1,52 5.072}
{0 CHEMBL1725809,1 1,21 1,52 5.015}
{0 CHEMBL1726488,1 1,11 1,19 1,21 1,22 1,38 1,52 5.043}
{0 CHEMBL1727186,1 1,5 1,11 1,21 1,52 4.983}
{0 CHEMBL1727425,10 1,11 1,12 1,52 5.824}
{0 CHEMBL1727593,1 1,21 1,52 5.3}
{0 CHEMBL1728983,1 1,21 1,22 1,38 1,44 1,52 5.268}
{0 CHEMBL1730105,1 1,11 1,16 1,21 1,52 4.963}
{0 CHEMBL1730603,1 1,16 1,21 1,22 1,26 1,38 1,47 1,52 4.627}
{0 CHEMBL1731321,1 1,4 1,6 1,11 1,16 1,21 1,52 5.502}
{0 CHEMBL1731550,1 1,11 1,21 1,22 1,38 1,41 1,52 5.227}
{0 CHEMBL1731763,2 1,3 1,5 1,7 1,8 1,10 1,11 1,12 1,14 1,17 1,21 1,24 1,38 1,40 1,52 5.333}
{0 CHEMBL1732046,1 1,11 1,21 1,22 1,38 1,52 4.775}
{0 CHEMBL1732805,1 1,13 1,21 1,22 1,51 1,52 5.21}
{0 CHEMBL1732874,21 1,33 1,52 5.71}
{0 CHEMBL1733286,1 1,7 1,21 1,22 1,41 1,52 4.004}
{0 CHEMBL1733399,2 1,3 1,5 1,7 1,8 1,10 1,11 1,12 1,17 1,21 1,36 1,38 1,52 5.461}
{0 CHEMBL1733996,1 1,4 1,6 1,11 1,16 1,21 1,22 1,52 5.389}
{0 CHEMBL1734181,1 1,7 1,11 1,21 1,52 4.81}
{0 CHEMBL1734322,1 1,10 1,11 1,12 1,18 1,19 1,21 1,22 1,26 1,38 1,52 5.27}
{0 CHEMBL1734455,1 1,11 1,21 1,52 5.291}
{0 CHEMBL1734673,1 1,21 1,22 1,38 1,44 1,52 5.238}
{0 CHEMBL1734899,1 1,2 1,13 1,19 1,21 1,52 5.322}
{0 CHEMBL1735090,1 1,13 1,21 1,52 5.441}
{0 CHEMBL1735462,1 1,4 1,6 1,16 1,21 1,52 5.463}
{0 CHEMBL1741927,10 1,12 1,21 1,52 4.004}
{0 CHEMBL1964953,1 1,21 1,52 4.109}
{0 CHEMBL1965135,1 1,9 1,12 1,21 1,52 4.004}
{0 CHEMBL1965380,1 1,21 1,52 4.004}
{0 CHEMBL1966498,1 1,11 1,21 1,35 1,39 1,52 4.004}
{0 CHEMBL1967269,10 1,21 1,24 1,52 4.004}
{0 CHEMBL1970493,1 1,5 1,21 1,30 1,52 4.004}
{0 CHEMBL1970596,1 1,7 1,11 1,17 1,21 1,44 1,52 4.004}
{0 CHEMBL1973673,1 1,21 1,52 4.004}
{0 CHEMBL1973976,1 1,21 1,44 1,52 4.004}
{0 CHEMBL1974234,1 1,11 1,12 1,21 1,52 4.004}
{0 CHEMBL1974783,2 1,11 1,21 1,39 1,52 4.004}
{0 CHEMBL1974877,1 1,10 1,12 1,21 1,52 4.004}
{0 CHEMBL1975000,9 1,11 1,12 1,21 1,41 1,46 1,52 4.004}
{0 CHEMBL1975289,1 1,7 1,21 1,52 4.511}
{0 CHEMBL1975596,9 1,11 1,12 1,21 1,41 1,52 4.004}
{0 CHEMBL1975650,1 1,7 1,11 1,21 1,52 4.004}
{0 CHEMBL1976492,1 1,21 1,35 1,52 4.004}
{0 CHEMBL1976718,1 1,11 1,21 1,27 1,52 4.004}
{0 CHEMBL1976824,1 1,21 1,52 5.762}
{0 CHEMBL1976925,1 1,7 1,11 1,17 1,21 1,44 1,52 4.166}
{0 CHEMBL1977876,1 1,14 1,21 1,22 1,52 4.004}
{0 CHEMBL1978234,1 1,10 1,21 1,24 1,46 1,52 4.178}
{0 CHEMBL1978748,1 1,7 1,21 1,22 1,41 1,52 4.004}
{0 CHEMBL1979245,1 1,6 1,12 1,21 1,52 4.004}
{0 CHEMBL1980590,1 1,9 1,12 1,21 1,52 4.553}
{0 CHEMBL1980903,21 1,28 1,52 4.004}
{0 CHEMBL1981516,21 1,52 4.004}
{0 CHEMBL1982446,10 1,11 1,21 1,52 4.004}
{0 CHEMBL1983259,2 1,11 1,21 1,39 1,52 4.004}
{0 CHEMBL1983591,9 1,21 1,52 4.004}
{0 CHEMBL1984047,1 1,9 1,11 1,12 1,21 1,52 4.004}
{0 CHEMBL1984384,9 1,11 1,21 1,41 1,52 4.004}
{0 CHEMBL1984849,9 1,11 1,21 1,41 1,52 4.004}
{0 CHEMBL1984894,1 1,21 1,27 1,46 1,52 4.86}
{0 CHEMBL1985081,10 1,21 1,31 1,52 4.686}
{0 CHEMBL1985139,1 1,21 1,52 4.004}
{0 CHEMBL1985725,9 1,10 1,11 1,21 1,41 1,52 4.004}
{0 CHEMBL1986350,10 1,21 1,52 4.004}
{0 CHEMBL1986471,1 1,11 1,21 1,22 1,46 1,52 4.004}
{0 CHEMBL1987113,1 1,11 1,21 1,52 4.004}
{0 CHEMBL1987203,9 1,11 1,21 1,41 1,52 4.004}
{0 CHEMBL1987231,1 1,21 1,52 4.004}
{0 CHEMBL1988369,1 1,6 1,10 1,12 1,21 1,52 4.004}
{0 CHEMBL1989363,1 1,6 1,9 1,12 1,21 1,52 4.004}
{0 CHEMBL1989633,1 1,10 1,12 1,21 1,52 4.004}
{0 CHEMBL1990131,1 1,6 1,10 1,12 1,21 1,52 4.004}
{0 CHEMBL1990762,1 1,7 1,11 1,12 1,21 1,52 4.004}
{0 CHEMBL1990773,1 1,17 1,21 1,44 1,52 4.111}
{0 CHEMBL1990990,1 1,8 1,10 1,21 1,44 1,52 4.381}
{0 CHEMBL1991679,1 1,8 1,10 1,21 1,52 4}
{0 CHEMBL1991968,1 1,21 1,52 4.004}
{0 CHEMBL1992643,1 1,9 1,12 1,19 1,21 1,52 4.004}
{0 CHEMBL1993655,1 1,10 1,12 1,21 1,31 1,52 4.004}
{0 CHEMBL1993723,1 1,10 1,12 1,21 1,52 4.004}
{0 CHEMBL1993880,1 1,9 1,12 1,21 1,52 4.004}
{0 CHEMBL1994044,9 1,11 1,12 1,21 1,41 1,52 4.004}
{0 CHEMBL1994962,1 1,21 1,52 4.004}
{0 CHEMBL1994995,9 1,11 1,21 1,52 4.004}
{0 CHEMBL1995718,1 1,11 1,12 1,21 1,52 4.004}
{0 CHEMBL1995878,2 1,3 1,5 1,7 1,8 1,10 1,11 1,12 1,17 1,21 1,38 1,44 1,52 5.551}
{0 CHEMBL1996364,1 1,7 1,9 1,11 1,21 1,52 4.004}
{0 CHEMBL1997264,1 1,11 1,19 1,21 1,22 1,52 4.004}
{0 CHEMBL1998026,9 1,11 1,12 1,21 1,41 1,52 4.004}
{0 CHEMBL1998530,1 1,11 1,12 1,21 1,28 1,52 4.004}
{0 CHEMBL1999067,1 1,11 1,21 1,52 4.004}
{0 CHEMBL1999757,1 1,21 1,52 4.004}
{0 CHEMBL2000036,1 1,7 1,11 1,21 1,52 4.004}
{0 CHEMBL2000190,1 1,12 1,21 1,52 4.004}
{0 CHEMBL2000496,1 1,10 1,21 1,24 1,52 4.393}
{0 CHEMBL2000516,1 1,11 1,12 1,21 1,30 1,52 4.004}
{0 CHEMBL2001306,1 1,10 1,12 1,21 1,52 4.004}
{0 CHEMBL2001755,1 1,10 1,21 1,24 1,52 4.004}
{0 CHEMBL2002163,1 1,10 1,21 1,36 1,52 4.004}
{0 CHEMBL2003536,1 1,5 1,11 1,21 1,52 4.004}
{0 CHEMBL2004013,9 1,12 1,21 1,28 1,52 4.004}
{0 CHEMBL2004455,2 1,3 1,5 1,8 1,11 1,12 1,14 1,16 1,18 1,21 1,38 1,52 5.377}
{0 CHEMBL2005060,1 1,6 1,21 1,52 4.004}
{0 CHEMBL2005302,1 1,3 1,4 1,8 1,21 1,44 1,52 4.139}
{0 CHEMBL2005398,1 1,12 1,21 1,43 1,45 1,52 4.004}
{0 CHEMBL2006072,1 1,8 1,16 1,21 1,44 1,52 5.416}
{0 CHEMBL2007076,1 1,21 1,52 4.004}
{0 CHEMBL2007483,1 1,6 1,10 1,21 1,24 1,52 4.004}
{0 CHEMBL2028094,1 1,21 1,52 4.321}
{0 CHEMBL2028107,7 1,11 1,21 1,52 4.004}
{0 CHEMBL225852,4 1,6 1,16 1,21 1,52 5.78}
{0 CHEMBL243652,1 1,11 1,21 1,52 4.253}
{0 CHEMBL244965,11 1,12 1,21 1,52 4.75}
{0 CHEMBL255881,1 1,19 1,21 1,23 1,47 1,52 5.682}
{0 CHEMBL269928,1 1,20 1,21 1,52 4.783}
{0 CHEMBL289356,11 1,12 1,52 6.05}
{0 CHEMBL290545,11 1,12 1,21 1,52 6.118}
{0 CHEMBL355612,11 1,21 1,52 4.429}
{0 CHEMBL398233,1 1,11 1,21 1,52 4.209}
{0 CHEMBL408994,1 1,21 1,35 1,52 4.406}
{0 CHEMBL45152,1 1,5 1,21 1,52 5.194}
{0 CHEMBL46469,1 1,21 1,27 1,52 4}
{0 CHEMBL474579,1 1,19 1,21 1,52 4.159}
{0 CHEMBL47814,4 1,6 1,16 1,21 1,52 5.582}
{0 CHEMBL510505,9 1,11 1,12 1,21 1,41 1,52 6.159}
{0 CHEMBL548062,1 1,3 1,12 1,21 1,51 1,52 5.394}
{0 CHEMBL568739,11 1,12 1,21 1,52 5.107}
{0 CHEMBL582287,1 1,8 1,13 1,21 1,52 5.352}
{0 CHEMBL584514,13 1,21 1,52 5.363}
{0 CHEMBL585628,1 1,5 1,21 1,44 1,46 1,52 4}
{0 CHEMBL586670,1 1,3 1,21 1,52 4.785}
{0 CHEMBL589421,1 1,4 1,6 1,7 1,11 1,16 1,21 1,52 5.664}
{0 CHEMBL589711,13 1,21 1,52 5.597}
{0 CHEMBL590706,7 1,11 1,21 1,52 5.6}
{0 CHEMBL592314,10 1,13 1,21 1,52 5.437}
{0 CHEMBL600306,13 1,21 1,52 5.396}
{0 CHEMBL600692,11 1,13 1,21 1,52 4.714}
{0 CHEMBL601744,13 1,21 1,52 5.526}
{0 CHEMBL608699,1 1,5 1,21 1,52 4.812}
{0 CHEMBL69086,11 1,31 1,51 1,52 5.278}
{0 CHEMBL8320,1 1,21 1,52 4.442}
