{
  "data_features": {
    "feature": [
      {
        "data_type": "nominal",
        "index": "0",
        "is_ignore": "false",
        "is_row_identifier": "true",
        "is_target": "false",
        "name": "molecule_id",
        "nominal_value": [
          "CHEMBL1082723",
          "CHEMBL1089103",
          "CHEMBL1089104",
          "CHEMBL1089461",
          "CHEMBL1089483",
          "CHEMBL1089485",
          "CHEMBL1089797",
          "CHEMBL1089830",
          "CHEMBL1089984",
          "CHEMBL1090161",
          "CHEMBL1090484",
          "CHEMBL1090813",
          "CHEMBL1090885",
          "CHEMBL1091150",
          "CHEMBL1091631",
          "CHEMBL1092209",
          "CHEMBL1092548",
          "CHEMBL1092550",
          "CHEMBL1092571",
          "CHEMBL1092573",
          "CHEMBL1092860",
          "CHEMBL1093304",
          "CHEMBL1093858",
          "CHEMBL1159695",
          "CHEMBL1159696",
          "CHEMBL1159697",
          "CHEMBL1159699",
          "CHEMBL1159700",
          "CHEMBL1159701",
          "CHEMBL1159702",
          "CHEMBL1159704",
          "CHEMBL1159705",
          "CHEMBL1159706",
          "CHEMBL1159707",
          "CHEMBL1161312",
          "CHEMBL1161313",
          "CHEMBL1161316",
          "CHEMBL1161318",
          "CHEMBL1161319",
          "CHEMBL1161320",
          "CHEMBL1161321",
          "CHEMBL1161322",
          "CHEMBL1161323",
          "CHEMBL1161791",
          "CHEMBL1161792",
          "CHEMBL1161794",
          "CHEMBL1162077",
          "CHEMBL1204054",
          "CHEMBL1204056",
          "CHEMBL1204059",
          "CHEMBL1204061",
          "CHEMBL1204065",
          "CHEMBL1209252",
          "CHEMBL1209253",
          "CHEMBL1209318",
          "CHEMBL1209320",
          "CHEMBL1209321",
          "CHEMBL1209382",
          "CHEMBL1209788",
          "CHEMBL1221512",
          "CHEMBL122773",
          "CHEMBL123744",
          "CHEMBL123938",
          "CHEMBL124169",
          "CHEMBL125492",
          "CHEMBL125819",
          "CHEMBL127861",
          "CHEMBL13910",
          "CHEMBL140154",
          "CHEMBL141343",
          "CHEMBL1682208",
          "CHEMBL1682209",
          "CHEMBL1761870",
          "CHEMBL1761871",
          "CHEMBL1761872",
          "CHEMBL1761873",
          "CHEMBL1761874",
          "CHEMBL1762008",
          "CHEMBL1762009",
          "CHEMBL1775062",
          "CHEMBL1775066",
          "CHEMBL179836",
          "CHEMBL180892",
          "CHEMBL180937",
          "CHEMBL181161",
          "CHEMBL181162",
          "CHEMBL181494",
          "CHEMBL182277",
          "CHEMBL183315",
          "CHEMBL183434",
          "CHEMBL183476",
          "CHEMBL183733",
          "CHEMBL183799",
          "CHEMBL184275",
          "CHEMBL184326",
          "CHEMBL184432",
          "CHEMBL184466",
          "CHEMBL184644",
          "CHEMBL184870",
          "CHEMBL184895",
          "CHEMBL184968",
          "CHEMBL185035",
          "CHEMBL185195",
          "CHEMBL185455",
          "CHEMBL185469",
          "CHEMBL185862",
          "CHEMBL185868",
          "CHEMBL185869",
          "CHEMBL186074",
          "CHEMBL186083",
          "CHEMBL186289",
          "CHEMBL186339",
          "CHEMBL186439",
          "CHEMBL186687",
          "CHEMBL186970",
          "CHEMBL187125",
          "CHEMBL187167",
          "CHEMBL187659",
          "CHEMBL187774",
          "CHEMBL187990",
          "CHEMBL188459",
          "CHEMBL188651",
          "CHEMBL188738",
          "CHEMBL188966",
          "CHEMBL189991",
          "CHEMBL190080",
          "CHEMBL190203",
          "CHEMBL190234",
          "CHEMBL190427",
          "CHEMBL190551",
          "CHEMBL190601",
          "CHEMBL190732",
          "CHEMBL190953",
          "CHEMBL191063",
          "CHEMBL191120",
          "CHEMBL191701",
          "CHEMBL191794",
          "CHEMBL191857",
          "CHEMBL191975",
          "CHEMBL192090",
          "CHEMBL192450",
          "CHEMBL192464",
          "CHEMBL193409",
          "CHEMBL193715",
          "CHEMBL194011",
          "CHEMBL194393",
          "CHEMBL194987",
          "CHEMBL194990",
          "CHEMBL195071",
          "CHEMBL195110",
          "CHEMBL195308",
          "CHEMBL195638",
          "CHEMBL202699",
          "CHEMBL203170",
          "CHEMBL203252",
          "CHEMBL203602",
          "CHEMBL203760",
          "CHEMBL203911",
          "CHEMBL203975",
          "CHEMBL204078",
          "CHEMBL204263",
          "CHEMBL204308",
          "CHEMBL204310",
          "CHEMBL204864",
          "CHEMBL206018",
          "CHEMBL206033",
          "CHEMBL206840",
          "CHEMBL2069317",
          "CHEMBL2070241",
          "CHEMBL2070242",
          "CHEMBL2070243",
          "CHEMBL2070244",
          "CHEMBL2070245",
          "CHEMBL2070246",
          "CHEMBL2070247",
          "CHEMBL2070248",
          "CHEMBL2070249",
          "CHEMBL2070250",
          "CHEMBL2070251",
          "CHEMBL2070252",
          "CHEMBL2070253",
          "CHEMBL2070254",
          "CHEMBL2070373",
          "CHEMBL2070374",
          "CHEMBL2092821",
          "CHEMBL209587",
          "CHEMBL209622",
          "CHEMBL2096742",
          "CHEMBL2096759",
          "CHEMBL209789",
          "CHEMBL210008",
          "CHEMBL210009",
          "CHEMBL210011",
          "CHEMBL2111807",
          "CHEMBL2111808",
          "CHEMBL2112008",
          "CHEMBL2112603",
          "CHEMBL2112604",
          "CHEMBL2113031",
          "CHEMBL2113037",
          "CHEMBL2113039",
          "CHEMBL2113041",
          "CHEMBL2113043",
          "CHEMBL2113133",
          "CHEMBL2113139",
          "CHEMBL2113144",
          "CHEMBL2113149",
          "CHEMBL2113280",
          "CHEMBL2113315",
          "CHEMBL211419",
          "CHEMBL2114996",
          "CHEMBL2115441",
          "CHEMBL211564",
          "CHEMBL211699",
          "CHEMBL211702",
          "CHEMBL211798",
          "CHEMBL211975",
          "CHEMBL212332",
          "CHEMBL212614",
          "CHEMBL212766",
          "CHEMBL212855",
          "CHEMBL212976",
          "CHEMBL213026",
          "CHEMBL213122",
          "CHEMBL213284",
          "CHEMBL213380",
          "CHEMBL213566",
          "CHEMBL213747",
          "CHEMBL213751",
          "CHEMBL213752",
          "CHEMBL213956",
          "CHEMBL214332",
          "CHEMBL214347",
          "CHEMBL214410",
          "CHEMBL214477",
          "CHEMBL214770",
          "CHEMBL215576",
          "CHEMBL215659",
          "CHEMBL215833",
          "CHEMBL215895",
          "CHEMBL217165",
          "CHEMBL217305",
          "CHEMBL217584",
          "CHEMBL218361",
          "CHEMBL218558",
          "CHEMBL218748",
          "CHEMBL220018",
          "CHEMBL223394",
          "CHEMBL223427",
          "CHEMBL227178",
          "CHEMBL227239",
          "CHEMBL227587",
          "CHEMBL227709",
          "CHEMBL227833",
          "CHEMBL228194",
          "CHEMBL228216",
          "CHEMBL2304263",
          "CHEMBL2310901",
          "CHEMBL233135",
          "CHEMBL233372",
          "CHEMBL233758",
          "CHEMBL234456",
          "CHEMBL234629",
          "CHEMBL235136",
          "CHEMBL235137",
          "CHEMBL235138",
          "CHEMBL235139",
          "CHEMBL235140",
          "CHEMBL235147",
          "CHEMBL235162",
          "CHEMBL235176",
          "CHEMBL235356",
          "CHEMBL235358",
          "CHEMBL235359",
          "CHEMBL235382",
          "CHEMBL235556",
          "CHEMBL235582",
          "CHEMBL235589",
          "CHEMBL235616",
          "CHEMBL235617",
          "CHEMBL235627",
          "CHEMBL235798",
          "CHEMBL235802",
          "CHEMBL235815",
          "CHEMBL236002",
          "CHEMBL236003",
          "CHEMBL236014",
          "CHEMBL236020",
          "CHEMBL236226",
          "CHEMBL236442",
          "CHEMBL236443",
          "CHEMBL236447",
          "CHEMBL236450",
          "CHEMBL236521",
          "CHEMBL236626",
          "CHEMBL236630",
          "CHEMBL236638",
          "CHEMBL236640",
          "CHEMBL236645",
          "CHEMBL236649",
          "CHEMBL236650",
          "CHEMBL236803",
          "CHEMBL236840",
          "CHEMBL236841",
          "CHEMBL236842",
          "CHEMBL236847",
          "CHEMBL236861",
          "CHEMBL236940",
          "CHEMBL237051",
          "CHEMBL237052",
          "CHEMBL237069",
          "CHEMBL237070",
          "CHEMBL237079",
          "CHEMBL237094",
          "CHEMBL237291",
          "CHEMBL237299",
          "CHEMBL237314",
          "CHEMBL237315",
          "CHEMBL237483",
          "CHEMBL237502",
          "CHEMBL237528",
          "CHEMBL237530",
          "CHEMBL237687",
          "CHEMBL237689",
          "CHEMBL237692",
          "CHEMBL237693",
          "CHEMBL237694",
          "CHEMBL237698",
          "CHEMBL237702",
          "CHEMBL237714",
          "CHEMBL237719",
          "CHEMBL237743",
          "CHEMBL237910",
          "CHEMBL237911",
          "CHEMBL237912",
          "CHEMBL237919",
          "CHEMBL237920",
          "CHEMBL237930",
          "CHEMBL237935",
          "CHEMBL237937",
          "CHEMBL237976",
          "CHEMBL238134",
          "CHEMBL238135",
          "CHEMBL238144",
          "CHEMBL238149",
          "CHEMBL238153",
          "CHEMBL238154",
          "CHEMBL238158",
          "CHEMBL238159",
          "CHEMBL238341",
          "CHEMBL238342",
          "CHEMBL238345",
          "CHEMBL238353",
          "CHEMBL238367",
          "CHEMBL238368",
          "CHEMBL238369",
          "CHEMBL240364",
          "CHEMBL240571",
          "CHEMBL240780",
          "CHEMBL24892",
          "CHEMBL249277",
          "CHEMBL249321",
          "CHEMBL249322",
          "CHEMBL250508",
          "CHEMBL253364",
          "CHEMBL253574",
          "CHEMBL253788",
          "CHEMBL253789",
          "CHEMBL254589",
          "CHEMBL254757",
          "CHEMBL255286",
          "CHEMBL256286",
          "CHEMBL256630",
          "CHEMBL257040",
          "CHEMBL257759",
          "CHEMBL258295",
          "CHEMBL263047",
          "CHEMBL263182",
          "CHEMBL263234",
          "CHEMBL263585",
          "CHEMBL263822",
          "CHEMBL263878",
          "CHEMBL263948",
          "CHEMBL264132",
          "CHEMBL264190",
          "CHEMBL264306",
          "CHEMBL264352",
          "CHEMBL265985",
          "CHEMBL266235",
          "CHEMBL266305",
          "CHEMBL266417",
          "CHEMBL266647",
          "CHEMBL266665",
          "CHEMBL266879",
          "CHEMBL267020",
          "CHEMBL267265",
          "CHEMBL267360",
          "CHEMBL267900",
          "CHEMBL268094",
          "CHEMBL268395",
          "CHEMBL268851",
          "CHEMBL269653",
          "CHEMBL269689",
          "CHEMBL269776",
          "CHEMBL272099",
          "CHEMBL272538",
          "CHEMBL273475",
          "CHEMBL274352",
          "CHEMBL275067",
          "CHEMBL275999",
          "CHEMBL276012",
          "CHEMBL276301",
          "CHEMBL29582",
          "CHEMBL296419",
          "CHEMBL302703",
          "CHEMBL302782",
          "CHEMBL307857",
          "CHEMBL309807",
          "CHEMBL312998",
          "CHEMBL313279",
          "CHEMBL313377",
          "CHEMBL313379",
          "CHEMBL313690",
          "CHEMBL314401",
          "CHEMBL315258",
          "CHEMBL315356",
          "CHEMBL315397",
          "CHEMBL316038",
          "CHEMBL316259",
          "CHEMBL327450",
          "CHEMBL328117",
          "CHEMBL329586",
          "CHEMBL331259",
          "CHEMBL331728",
          "CHEMBL332442",
          "CHEMBL332443",
          "CHEMBL332762",
          "CHEMBL333178",
          "CHEMBL333262",
          "CHEMBL333263",
          "CHEMBL333283",
          "CHEMBL334309",
          "CHEMBL337940",
          "CHEMBL338594",
          "CHEMBL338747",
          "CHEMBL338766",
          "CHEMBL338768",
          "CHEMBL339053",
          "CHEMBL340355",
          "CHEMBL349850",
          "CHEMBL358015",
          "CHEMBL359701",
          "CHEMBL359702",
          "CHEMBL359765",
          "CHEMBL359927",
          "CHEMBL360598",
          "CHEMBL360716",
          "CHEMBL360818",
          "CHEMBL360819",
          "CHEMBL361052",
          "CHEMBL361252",
          "CHEMBL361253",
          "CHEMBL361578",
          "CHEMBL361579",
          "CHEMBL362010",
          "CHEMBL362523",
          "CHEMBL362670",
          "CHEMBL362879",
          "CHEMBL362964",
          "CHEMBL363019",
          "CHEMBL363061",
          "CHEMBL363190",
          "CHEMBL363271",
          "CHEMBL363272",
          "CHEMBL363576",
          "CHEMBL363641",
          "CHEMBL363730",
          "CHEMBL363740",
          "CHEMBL364119",
          "CHEMBL364215",
          "CHEMBL364346",
          "CHEMBL364359",
          "CHEMBL364463",
          "CHEMBL364519",
          "CHEMBL364560",
          "CHEMBL365005",
          "CHEMBL365019",
          "CHEMBL365039",
          "CHEMBL365044",
          "CHEMBL365237",
          "CHEMBL365262",
          "CHEMBL365278",
          "CHEMBL365385",
          "CHEMBL365401",
          "CHEMBL365465",
          "CHEMBL365597",
          "CHEMBL365794",
          "CHEMBL365825",
          "CHEMBL365913",
          "CHEMBL366040",
          "CHEMBL366042",
          "CHEMBL366706",
          "CHEMBL368008",
          "CHEMBL368876",
          "CHEMBL369770",
          "CHEMBL370321",
          "CHEMBL371365",
          "CHEMBL371366",
          "CHEMBL372237",
          "CHEMBL372965",
          "CHEMBL372966",
          "CHEMBL373099",
          "CHEMBL373344",
          "CHEMBL373444",
          "CHEMBL373726",
          "CHEMBL373727",
          "CHEMBL373821",
          "CHEMBL373946",
          "CHEMBL374379",
          "CHEMBL375440",
          "CHEMBL375559",
          "CHEMBL375775",
          "CHEMBL375947",
          "CHEMBL376158",
          "CHEMBL376339",
          "CHEMBL376614",
          "CHEMBL377210",
          "CHEMBL377231",
          "CHEMBL377465",
          "CHEMBL377620",
          "CHEMBL377778",
          "CHEMBL377779",
          "CHEMBL377961",
          "CHEMBL378046",
          "CHEMBL378293",
          "CHEMBL378446",
          "CHEMBL378571",
          "CHEMBL378837",
          "CHEMBL379054",
          "CHEMBL379168",
          "CHEMBL379490",
          "CHEMBL379508",
          "CHEMBL379879",
          "CHEMBL380051",
          "CHEMBL380120",
          "CHEMBL380365",
          "CHEMBL380437",
          "CHEMBL380540",
          "CHEMBL380635",
          "CHEMBL380638",
          "CHEMBL380727",
          "CHEMBL380855",
          "CHEMBL380858",
          "CHEMBL381125",
          "CHEMBL381357",
          "CHEMBL381501",
          "CHEMBL381503",
          "CHEMBL381739",
          "CHEMBL382369",
          "CHEMBL383250",
          "CHEMBL383256",
          "CHEMBL383719",
          "CHEMBL384166",
          "CHEMBL384176",
          "CHEMBL384720",
          "CHEMBL384774",
          "CHEMBL384955",
          "CHEMBL385000",
          "CHEMBL385465",
          "CHEMBL385556",
          "CHEMBL385561",
          "CHEMBL386604",
          "CHEMBL387169",
          "CHEMBL387246",
          "CHEMBL387883",
          "CHEMBL387985",
          "CHEMBL388409",
          "CHEMBL389626",
          "CHEMBL389674",
          "CHEMBL390130",
          "CHEMBL390358",
          "CHEMBL390816",
          "CHEMBL391704",
          "CHEMBL391705",
          "CHEMBL391706",
          "CHEMBL391707",
          "CHEMBL391796",
          "CHEMBL391823",
          "CHEMBL391902",
          "CHEMBL392092",
          "CHEMBL392094",
          "CHEMBL392096",
          "CHEMBL392223",
          "CHEMBL392315",
          "CHEMBL392316",
          "CHEMBL392521",
          "CHEMBL393075",
          "CHEMBL393125",
          "CHEMBL393350",
          "CHEMBL393359",
          "CHEMBL393383",
          "CHEMBL393552",
          "CHEMBL393553",
          "CHEMBL393557",
          "CHEMBL393558",
          "CHEMBL393576",
          "CHEMBL393584",
          "CHEMBL393753",
          "CHEMBL393755",
          "CHEMBL393918",
          "CHEMBL393919",
          "CHEMBL393994",
          "CHEMBL394073",
          "CHEMBL394074",
          "CHEMBL394075",
          "CHEMBL394394",
          "CHEMBL394646",
          "CHEMBL394647",
          "CHEMBL394669",
          "CHEMBL396111",
          "CHEMBL396303",
          "CHEMBL396341",
          "CHEMBL396598",
          "CHEMBL396638",
          "CHEMBL397324",
          "CHEMBL397550",
          "CHEMBL397580",
          "CHEMBL398487",
          "CHEMBL398635",
          "CHEMBL398664",
          "CHEMBL398665",
          "CHEMBL398777",
          "CHEMBL398816",
          "CHEMBL398929",
          "CHEMBL398980",
          "CHEMBL399624",
          "CHEMBL399714",
          "CHEMBL399715",
          "CHEMBL399810",
          "CHEMBL399811",
          "CHEMBL400456",
          "CHEMBL400866",
          "CHEMBL402692",
          "CHEMBL402769",
          "CHEMBL403420",
          "CHEMBL403722",
          "CHEMBL403806",
          "CHEMBL405150",
          "CHEMBL405282",
          "CHEMBL406276",
          "CHEMBL407213",
          "CHEMBL407680",
          "CHEMBL407809",
          "CHEMBL407825",
          "CHEMBL407870",
          "CHEMBL408257",
          "CHEMBL408336",
          "CHEMBL408509",
          "CHEMBL408843",
          "CHEMBL409049",
          "CHEMBL409144",
          "CHEMBL409574",
          "CHEMBL409636",
          "CHEMBL409982",
          "CHEMBL410168",
          "CHEMBL410179",
          "CHEMBL410217",
          "CHEMBL410672",
          "CHEMBL410795",
          "CHEMBL410949",
          "CHEMBL411359",
          "CHEMBL411391",
          "CHEMBL411564",
          "CHEMBL412494",
          "CHEMBL412495",
          "CHEMBL412523",
          "CHEMBL412536",
          "CHEMBL412563",
          "CHEMBL412970",
          "CHEMBL413043",
          "CHEMBL413212",
          "CHEMBL413260",
          "CHEMBL413437",
          "CHEMBL413439",
          "CHEMBL413565",
          "CHEMBL413573",
          "CHEMBL413912",
          "CHEMBL413982",
          "CHEMBL414475",
          "CHEMBL414528",
          "CHEMBL414718",
          "CHEMBL414778",
          "CHEMBL415165",
          "CHEMBL415333",
          "CHEMBL415661",
          "CHEMBL415831",
          "CHEMBL417853",
          "CHEMBL419307",
          "CHEMBL419625",
          "CHEMBL420167",
          "CHEMBL420727",
          "CHEMBL423101",
          "CHEMBL425348",
          "CHEMBL425442",
          "CHEMBL425591",
          "CHEMBL426755",
          "CHEMBL426756",
          "CHEMBL426904",
          "CHEMBL427205",
          "CHEMBL427629",
          "CHEMBL427666",
          "CHEMBL427860",
          "CHEMBL428022",
          "CHEMBL428326",
          "CHEMBL428615",
          "CHEMBL428801",
          "CHEMBL428903",
          "CHEMBL429269",
          "CHEMBL429387",
          "CHEMBL429451",
          "CHEMBL429742",
          "CHEMBL429854",
          "CHEMBL429983",
          "CHEMBL430239",
          "CHEMBL431801",
          "CHEMBL432377",
          "CHEMBL432407",
          "CHEMBL432565",
          "CHEMBL432895",
          "CHEMBL433296",
          "CHEMBL433413",
          "CHEMBL433645",
          "CHEMBL433750",
          "CHEMBL433764",
          "CHEMBL434329",
          "CHEMBL434357",
          "CHEMBL434372",
          "CHEMBL434544",
          "CHEMBL434985",
          "CHEMBL435923",
          "CHEMBL436122",
          "CHEMBL436169",
          "CHEMBL436903",
          "CHEMBL437050",
          "CHEMBL437086",
          "CHEMBL437132",
          "CHEMBL437899",
          "CHEMBL438030",
          "CHEMBL438118",
          "CHEMBL438235",
          "CHEMBL438259",
          "CHEMBL438294",
          "CHEMBL438334",
          "CHEMBL438432",
          "CHEMBL438672",
          "CHEMBL438744",
          "CHEMBL438920",
          "CHEMBL439128",
          "CHEMBL439188",
          "CHEMBL439490",
          "CHEMBL439560",
          "CHEMBL439691",
          "CHEMBL440801",
          "CHEMBL441760",
          "CHEMBL441938",
          "CHEMBL442504",
          "CHEMBL442829",
          "CHEMBL443071",
          "CHEMBL443396",
          "CHEMBL443590",
          "CHEMBL444883",
          "CHEMBL445009",
          "CHEMBL445669",
          "CHEMBL446185",
          "CHEMBL446757",
          "CHEMBL446941",
          "CHEMBL447117",
          "CHEMBL448081",
          "CHEMBL448337",
          "CHEMBL448410",
          "CHEMBL449050",
          "CHEMBL449124",
          "CHEMBL449131",
          "CHEMBL450236",
          "CHEMBL451535",
          "CHEMBL451694",
          "CHEMBL452710",
          "CHEMBL453300",
          "CHEMBL453734",
          "CHEMBL454900",
          "CHEMBL454916",
          "CHEMBL460138",
          "CHEMBL460142",
          "CHEMBL460349",
          "CHEMBL460942",
          "CHEMBL462044",
          "CHEMBL463047",
          "CHEMBL466380",
          "CHEMBL467586",
          "CHEMBL467587",
          "CHEMBL467588",
          "CHEMBL467771",
          "CHEMBL467772",
          "CHEMBL468252",
          "CHEMBL471340",
          "CHEMBL497746",
          "CHEMBL498150",
          "CHEMBL50056",
          "CHEMBL500743",
          "CHEMBL501158",
          "CHEMBL501592",
          "CHEMBL502300",
          "CHEMBL503229",
          "CHEMBL504349",
          "CHEMBL504964",
          "CHEMBL504986",
          "CHEMBL505536",
          "CHEMBL506272",
          "CHEMBL506274",
          "CHEMBL506762",
          "CHEMBL507876",
          "CHEMBL508816",
          "CHEMBL509582",
          "CHEMBL510234",
          "CHEMBL511826",
          "CHEMBL513404",
          "CHEMBL517108",
          "CHEMBL524861",
          "CHEMBL525177",
          "CHEMBL538567",
          "CHEMBL539306",
          "CHEMBL552520",
          "CHEMBL558814",
          "CHEMBL606990",
          "CHEMBL633",
          "CHEMBL65339",
          "CHEMBL66066",
          "CHEMBL66464",
          "CHEMBL66866",
          "CHEMBL69175",
          "CHEMBL71",
          "CHEMBL75185",
          "CHEMBL75475",
          "CHEMBL8045",
          "CHEMBL808",
          "CHEMBL8201",
          "CHEMBL83",
          "CHEMBL85918",
          "CHEMBL86573",
          "CHEMBL8730",
          "CHEMBL8742",
          "CHEMBL88185",
          "CHEMBL8825",
          "CHEMBL88537",
          "CHEMBL88630",
          "CHEMBL89004",
          "CHEMBL89270",
          "CHEMBL8929",
          "CHEMBL9075",
          "CHEMBL91",
          "CHEMBL91041",
          "CHEMBL9138",
          "CHEMBL91957",
          "CHEMBL92481",
          "CHEMBL9257",
          "CHEMBL9274"
        ],
        "number_of_missing_values": "0"
      },
      {
        "data_type": "numeric",
        "index": "1",
        "is_ignore": "false",
        "is_row_identifier": "false",
        "is_target": "false",
        "name": "JGI5",
        "number_of_missing_values": "0"
      },
      {
        "data_type": "numeric",
        "index": "2",
        "is_ignore": "false",
        "is_row_identifier": "false",
        "is_target": "false",
        "name": "Eig05_EA.dm.",
        "number_of_missing_values": "0"
      },
      {
        "data_type": "numeric",
        "index": "3",
        "is_ignore": "false",
        "is_row_identifier": "false",
        "is_target": "false",
        "name": "HNar",
        "number_of_missing_values": "0"
      },
      {
        "data_type": "numeric",
        "index": "4",
        "is_ignore": "false",
        "is_row_identifier": "false",
        "is_target": "false",
        "name": "Eig04_AEA.dm.",
        "number_of_missing_values": "0"
      },
      {
        "data_type": "numeric",
        "index": "5",
        "is_ignore": "false",
        "is_row_identifier": "false",
        "is_target": "false",
        "name": "Eig04_EA.dm.",
        "number_of_missing_values": "0"
      },
      {
        "data_type": "numeric",
        "index": "6",
        "is_ignore": "false",
        "is_row_identifier": "false",
        "is_target": "false",
        "name": "X0A",
        "number_of_missing_values": "0"
      },
      {
        "data_type": "numeric",
        "index": "7",
        "is_ignore": "false",
        "is_row_identifier": "false",
        "is_target": "false",
        "name": "GGI6",
        "number_of_missing_values": "0"
      },
      {
        "data_type": "numeric",
        "index": "8",
        "is_ignore": "false",
        "is_row_identifier": "false",
        "is_target": "false",
        "name": "Eig05_AEA.dm.",
        "number_of_missing_values": "0"
      },
      {
        "data_type": "numeric",
        "index": "9",
        "is_ignore": "false",
        "is_row_identifier": "false",
        "is_target": "false",
        "name": "Eig06_EA.dm.",
        "number_of_missing_values": "0"
      },
      {
        "data_type": "numeric",
        "index": "10",
        "is_ignore": "false",
        "is_row_identifier": "false",
        "is_target": "false",
        "name": "SM05_EA.dm.",
        "number_of_missing_values": "0"
      },
      {
        "data_type": "numeric",
        "index": "11",
        "is_ignore": "false",
        "is_row_identifier": "false",
        "is_target": "false",
        "name": "NdO",
        "number_of_missing_values": "0"
      },
      {
        "data_type": "numeric",
        "index": "12",
        "is_ignore": "false",
        "is_row_identifier": "false",
        "is_target": "false",
        "name": "O.058",
        "number_of_missing_values": "0"
      },
      {
        "data_type": "numeric",
        "index": "13",
        "is_ignore": "false",
        "is_row_identifier": "false",
        "is_target": "false",
        "name": "ON0",
        "number_of_missing_values": "0"
      },
      {
        "data_type": "numeric",
        "index": "14",
        "is_ignore": "false",
        "is_row_identifier": "false",
        "is_target": "false",
        "name": "Psi_i_s",
        "number_of_missing_values": "0"
      },
      {
        "data_type": "numeric",
        "index": "15",
        "is_ignore": "false",
        "is_row_identifier": "false",
        "is_target": "false",
        "name": "SM04_EA.dm.",
        "number_of_missing_values": "0"
      },
      {
        "data_type": "numeric",
        "index": "16",
        "is_ignore": "false",
        "is_row_identifier": "false",
        "is_target": "false",
        "name": "SM02_EA.dm.",
        "number_of_missing_values": "0"
      },
      {
        "data_type": "numeric",
        "index": "17",
        "is_ignore": "false",
        "is_row_identifier": "false",
        "is_target": "false",
        "name": "SM06_EA.dm.",
        "number_of_missing_values": "0"
      },
      {
        "data_type": "numeric",
        "index": "18",
        "is_ignore": "false",
        "is_row_identifier": "false",
        "is_target": "false",
        "name": "ZM2MulPer",
        "number_of_missing_values": "0"
      },
      {
        "data_type": "numeric",
        "index": "19",
        "is_ignore": "false",
        "is_row_identifier": "false",
        "is_target": "false",
        "name": "ZM2Per",
        "number_of_missing_values": "0"
      },
      {
        "data_type": "numeric",
        "index": "20",
        "is_ignore": "false",
        "is_row_identifier": "false",
        "is_target": "false",
        "name": "PCR",
        "number_of_missing_values": "0"
      },
      {
        "data_type": "numeric",
        "index": "21",
        "is_ignore": "false",
        "is_row_identifier": "false",
        "is_target": "false",
        "name": "GATS2s",
        "number_of_missing_values": "0"
      },
      {
        "data_type": "numeric",
        "index": "22",
        "is_ignore": "false",
        "is_row_identifier": "false",
        "is_target": "false",
        "name": "ZM2V",
        "number_of_missing_values": "0"
      },
      {
        "data_type": "numeric",
        "index": "23",
        "is_ignore": "false",
        "is_row_identifier": "false",
        "is_target": "false",
        "name": "DELS",
        "number_of_missing_values": "0"
      },
      {
        "data_type": "numeric",
        "index": "24",
        "is_ignore": "false",
        "is_row_identifier": "false",
        "is_target": "false",
        "name": "SM11_EA.ed.",
        "number_of_missing_values": "0"
      },
      {
        "data_type": "numeric",
        "index": "25",
        "is_ignore": "false",
        "is_row_identifier": "false",
        "is_target": "false",
        "name": "SM13_EA.ed.",
        "number_of_missing_values": "0"
      },
      {
        "data_type": "numeric",
        "index": "26",
        "is_ignore": "false",
        "is_row_identifier": "false",
        "is_target": "false",
        "name": "CATS2D_05_AL",
        "number_of_missing_values": "0"
      },
      {
        "data_type": "numeric",
        "index": "27",
        "is_ignore": "false",
        "is_row_identifier": "false",
        "is_target": "false",
        "name": "ZM1Kup",
        "number_of_missing_values": "0"
      },
      {
        "data_type": "numeric",
        "index": "28",
        "is_ignore": "false",
        "is_row_identifier": "false",
        "is_target": "false",
        "name": "Eta_B",
        "number_of_missing_values": "0"
      },
      {
        "data_type": "numeric",
        "index": "29",
        "is_ignore": "false",
        "is_row_identifier": "false",
        "is_target": "false",
        "name": "JGI10",
        "number_of_missing_values": "0"
      },
      {
        "data_type": "numeric",
        "index": "30",
        "is_ignore": "false",
        "is_row_identifier": "false",
        "is_target": "false",
        "name": "SpMAD_EA.dm.",
        "number_of_missing_values": "0"
      },
      {
        "data_type": "numeric",
        "index": "31",
        "is_ignore": "false",
        "is_row_identifier": "false",
        "is_target": "false",
        "name": "CATS2D_08_DD",
        "number_of_missing_values": "0"
      },
      {
        "data_type": "numeric",
        "index": "32",
        "is_ignore": "false",
        "is_row_identifier": "false",
        "is_target": "false",
        "name": "SpMax6_Bh.m.",
        "number_of_missing_values": "0"
      },
      {
        "data_type": "numeric",
        "index": "33",
        "is_ignore": "false",
        "is_row_identifier": "false",
        "is_target": "false",
        "name": "MATS5s",
        "number_of_missing_values": "0"
      },
      {
        "data_type": "numeric",
        "index": "34",
        "is_ignore": "false",
        "is_row_identifier": "false",
        "is_target": "false",
        "name": "ATS2s",
        "number_of_missing_values": "0"
      },
      {
        "data_type": "numeric",
        "index": "35",
        "is_ignore": "false",
        "is_row_identifier": "false",
        "is_target": "false",
        "name": "AAC",
        "number_of_missing_values": "0"
      },
      {
        "data_type": "numeric",
        "index": "36",
        "is_ignore": "false",
        "is_row_identifier": "false",
        "is_target": "false",
        "name": "IC0",
        "number_of_missing_values": "0"
      },
      {
        "data_type": "numeric",
        "index": "37",
        "is_ignore": "false",
        "is_row_identifier": "false",
        "is_target": "false",
        "name": "Me",
        "number_of_missing_values": "0"
      },
      {
        "data_type": "numeric",
        "index": "38",
        "is_ignore": "false",
        "is_row_identifier": "false",
        "is_target": "false",
        "name": "Eig11_EA.dm.",
        "number_of_missing_values": "0"
      },
      {
        "data_type": "numeric",
        "index": "39",
        "is_ignore": "false",
        "is_row_identifier": "false",
        "is_target": "false",
        "name": "Eig06_AEA.ri.",
        "number_of_missing_values": "0"
      },
      {
        "data_type": "numeric",
        "index": "40",
        "is_ignore": "false",
        "is_row_identifier": "false",
        "is_target": "false",
        "name": "CMC.80",
        "number_of_missing_values": "0"
      },
      {
        "data_type": "numeric",
        "index": "41",
        "is_ignore": "false",
        "is_row_identifier": "false",
        "is_target": "false",
        "name": "Eta_epsi",
        "number_of_missing_values": "0"
      },
      {
        "data_type": "numeric",
        "index": "42",
        "is_ignore": "false",
        "is_row_identifier": "false",
        "is_target": "false",
        "name": "ATS1s",
        "number_of_missing_values": "0"
      },
      {
        "data_type": "numeric",
        "index": "43",
        "is_ignore": "false",
        "is_row_identifier": "false",
        "is_target": "false",
        "name": "ATSC6m",
        "number_of_missing_values": "0"
      },
      {
        "data_type": "numeric",
        "index": "44",
        "is_ignore": "false",
        "is_row_identifier": "false",
        "is_target": "false",
        "name": "SpMax7_Bh.m.",
        "number_of_missing_values": "0"
      },
      {
        "data_type": "numeric",
        "index": "45",
        "is_ignore": "false",
        "is_row_identifier": "false",
        "is_target": "false",
        "name": "PDI",
        "number_of_missing_values": "0"
      },
      {
        "data_type": "numeric",
        "index": "46",
        "is_ignore": "false",
        "is_row_identifier": "false",
        "is_target": "false",
        "name": "CATS2D_03_DL",
        "number_of_missing_values": "0"
      },
      {
        "data_type": "numeric",
        "index": "47",
        "is_ignore": "false",
        "is_row_identifier": "false",
        "is_target": "false",
        "name": "Infective.80",
        "number_of_missing_values": "0"
      },
      {
        "data_type": "numeric",
        "index": "48",
        "is_ignore": "false",
        "is_row_identifier": "false",
        "is_target": "false",
        "name": "CATS2D_09_DL",
        "number_of_missing_values": "0"
      },
      {
        "data_type": "numeric",
        "index": "49",
        "is_ignore": "false",
        "is_row_identifier": "false",
        "is_target": "false",
        "name": "MATS3i",
        "number_of_missing_values": "0"
      },
      {
        "data_type": "numeric",
        "index": "50",
        "is_ignore": "false",
        "is_row_identifier": "false",
        "is_target": "false",
        "name": "Eig05_EA.bo.",
        "number_of_missing_values": "0"
      },
      {
        "data_type": "numeric",
        "index": "51",
        "is_ignore": "false",
        "is_row_identifier": "false",
        "is_target": "false",
        "name": "SM15_AEA.ri.",
        "number_of_missing_values": "0"
      },
      {
        "data_type": "numeric",
        "index": "52",
        "is_ignore": "false",
        "is_row_identifier": "false",
        "is_target": "false",
        "name": "ECC",
        "number_of_missing_values": "0"
      },
      {
        "data_type": "numeric",
        "index": "53",
        "is_ignore": "false",
        "is_row_identifier": "false",
        "is_target": "false",
        "name": "ATSC5m",
        "number_of_missing_values": "0"
      },
      {
        "data_type": "numeric",
        "index": "54",
        "is_ignore": "false",
        "is_row_identifier": "false",
        "is_target": "false",
        "name": "Eig07_EA.dm.",
        "number_of_missing_values": "0"
      },
      {
        "data_type": "numeric",
        "index": "55",
        "is_ignore": "false",
        "is_row_identifier": "false",
        "is_target": "false",
        "name": "GNar",
        "number_of_missing_values": "0"
      },
      {
        "data_type": "numeric",
        "index": "56",
        "is_ignore": "false",
        "is_row_identifier": "false",
        "is_target": "false",
        "name": "Eig12_EA.dm.",
        "number_of_missing_values": "0"
      },
      {
        "data_type": "numeric",
        "index": "57",
        "is_ignore": "false",
        "is_row_identifier": "false",
        "is_target": "false",
        "name": "SpAD_EA.dm.",
        "number_of_missing_values": "0"
      },
      {
        "data_type": "numeric",
        "index": "58",
        "is_ignore": "false",
        "is_row_identifier": "false",
        "is_target": "false",
        "name": "ATS5e",
        "number_of_missing_values": "0"
      },
      {
        "data_type": "numeric",
        "index": "59",
        "is_ignore": "false",
        "is_row_identifier": "false",
        "is_target": "false",
        "name": "Eig04_EA",
        "number_of_missing_values": "0"
      },
      {
        "data_type": "numeric",
        "index": "60",
        "is_ignore": "false",
        "is_row_identifier": "false",
        "is_target": "false",
        "name": "SM12_AEA.bo.",
        "number_of_missing_values": "0"
      },
      {
        "data_type": "numeric",
        "index": "61",
        "is_ignore": "false",
        "is_row_identifier": "false",
        "is_target": "false",
        "name": "Psychotic.80",
        "number_of_missing_values": "0"
      },
      {
        "data_type": "numeric",
        "index": "62",
        "is_ignore": "false",
        "is_row_identifier": "false",
        "is_target": "false",
        "name": "Eig04_AEA.ri.",
        "number_of_missing_values": "0"
      },
      {
        "data_type": "numeric",
        "index": "63",
        "is_ignore": "false",
        "is_row_identifier": "false",
        "is_target": "false",
        "name": "SM07_EA",
        "number_of_missing_values": "0"
      },
      {
        "data_type": "numeric",
        "index": "64",
        "is_ignore": "false",
        "is_row_identifier": "false",
        "is_target": "false",
        "name": "DLS_01",
        "number_of_missing_values": "0"
      },
      {
        "data_type": "numeric",
        "index": "65",
        "is_ignore": "false",
        "is_row_identifier": "false",
        "is_target": "false",
        "name": "SpMax6_Bh.v.",
        "number_of_missing_values": "0"
      },
      {
        "data_type": "numeric",
        "index": "66",
        "is_ignore": "false",
        "is_row_identifier": "false",
        "is_target": "false",
        "name": "ATS5i",
        "number_of_missing_values": "0"
      },
      {
        "data_type": "numeric",
        "index": "67",
        "is_ignore": "false",
        "is_row_identifier": "false",
        "is_target": "false",
        "name": "SM09_AEA.ed.",
        "number_of_missing_values": "0"
      },
      {
        "data_type": "numeric",
        "index": "68",
        "is_ignore": "false",
        "is_row_identifier": "false",
        "is_target": "false",
        "name": "IDDE",
        "number_of_missing_values": "0"
      },
      {
        "data_type": "numeric",
        "index": "69",
        "is_ignore": "false",
        "is_row_identifier": "false",
        "is_target": "true",
        "name": "pXC50",
        "number_of_missing_values": "0"
      }
    ]
  }
}