"molecule_id","AMW","C.","H.","Me","Mi","Mp","Mv","MW","N.","nAB","nAT","nB","nBM","nBO","nBR","nBT","nC","nCL","nCsp","nCsp2","nCsp3","nDB","nF","nH","nHet","nHM","nI","nN","nO","nP","nS","nSK","nTB","nX","O.","RBF","RBN","SCBO","Se","Si","Sp","Sv","X.","pXC50"
{1 8.778,2 48.8,3 37.2,4 1.009,5 1.113,6 0.73,7 0.699,8 377.47,9 7,10 23,11 43,13 24,14 30,16 46,17 21,20 20,21 1,22 1,23 1,24 16,25 6,26 1,28 3,29 1,31 1,32 27,34 1,35 2.3,36 0.087,37 4,38 42.5,39 43.407,40 47.87,41 31.387,42 30.037,43 2.3,44 5}
{0 CHEMBL101253,1 8.671,2 50,3 37.5,4 1.001,5 1.111,6 0.736,7 0.702,8 346.84,9 10,10 23,11 40,13 23,14 28,16 43,17 20,18 1,20 19,21 1,24 15,25 5,26 1,28 4,32 25,34 1,36 0.093,37 4,38 39.5,39 40.033,40 44.428,41 29.449,42 28.074,43 2.5,44 5}
{0 CHEMBL103667,1 6.944,2 40.8,3 48.7,4 0.995,5 1.128,6 0.652,7 0.614,8 527.73,9 6.6,10 22,11 76,13 23,14 43,16 80,17 31,20 20,21 11,22 1,24 37,25 8,28 5,29 3,32 39,35 3.9,36 0.1,37 8,38 55,39 75.629,40 85.763,41 49.574,42 46.68,44 4.523}
{0 CHEMBL105442,1 12.274,2 43.6,3 35.9,4 1.034,5 1.13,6 0.754,7 0.708,8 478.68,9 5.1,10 12,11 39,13 13,14 27,16 41,17 17,18 1,20 13,21 4,22 1,23 2,24 14,25 8,26 2,27 1,28 2,29 2,32 25,34 4,35 5.1,36 0.146,37 6,38 34,39 40.345,40 44.081,41 29.404,42 27.598,43 10.3,44 5}
{0 CHEMBL1094135,1 7.964,2 40.9,3 40.9,4 1.013,5 1.134,6 0.671,7 0.653,8 350.42,9 13.6,10 17,11 44,13 18,14 29,16 47,17 18,20 14,21 4,22 1,24 18,25 8,28 6,29 2,32 26,35 4.5,36 0.085,37 4,38 38.5,39 44.567,40 49.9,41 29.512,42 28.719,44 7.62}
{0 CHEMBL1094408,1 7.354,2 37.7,3 45.9,4 1.005,5 1.14,6 0.649,7 0.621,8 448.59,9 13.1,10 17,11 61,13 18,14 37,16 65,17 23,20 14,21 9,22 1,24 28,25 10,28 8,29 2,32 33,35 3.3,36 0.077,37 5,38 46.5,39 61.305,40 69.557,41 39.569,42 37.869,44 6.623}
{0 CHEMBL1094477,1 7.777,2 41.9,3 41.9,4 1.006,5 1.132,6 0.676,7 0.651,8 334.42,9 14,10 17,11 43,13 18,14 28,16 46,17 18,20 14,21 4,22 1,24 18,25 7,28 6,29 1,32 25,35 2.3,36 0.065,37 3,38 37.5,39 43.24,40 48.69,41 29.057,42 28.004,44 8.699}
{0 CHEMBL1094478,1 8.329,2 40.9,3 40.9,4 1.007,5 1.128,6 0.698,7 0.663,8 366.49,9 13.6,10 17,11 44,13 18,14 29,16 47,17 18,20 14,21 4,22 1,24 18,25 8,26 1,28 6,29 1,31 1,32 26,35 2.3,36 0.085,37 4,38 38.5,39 44.316,40 49.61,41 30.705,42 29.191,44 7.854}
{0 CHEMBL1095457,1 7.765,2 40,3 42.2,4 1.008,5 1.138,6 0.668,7 0.645,8 349.44,9 15.6,10 17,11 45,13 18,14 29,16 48,17 18,20 14,21 4,22 1,24 19,25 8,28 7,29 1,32 26,35 2.2,36 0.083,37 4,38 38.5,39 45.342,40 51.189,41 30.063,42 29.025,44 7.921}
{0 CHEMBL1095716,1 7.429,2 38.7,3 45.2,4 1.005,5 1.138,6 0.654,7 0.627,8 460.6,9 12.9,10 17,11 62,13 19,14 38,16 66,17 24,20 15,21 9,22 2,24 28,25 10,28 8,29 2,32 34,35 3.2,36 0.076,37 5,38 48.5,39 62.305,40 70.557,41 40.569,42 38.869,44 5}
{0 CHEMBL1095717,1 7.354,2 37.7,3 45.9,4 1.005,5 1.14,6 0.649,7 0.621,8 448.59,9 13.1,10 17,11 61,13 18,14 37,16 65,17 23,20 14,21 9,22 1,24 28,25 10,28 8,29 2,32 33,35 3.3,36 0.077,37 5,38 46.5,39 61.305,40 69.557,41 39.569,42 37.869,44 7.086}
{0 CHEMBL1095771,1 8.459,2 42.5,3 37.5,4 1.022,5 1.14,6 0.681,7 0.672,8 338.38,9 15,10 17,11 40,13 18,14 28,16 43,17 17,20 14,21 3,22 1,23 1,24 15,25 8,28 6,29 1,32 25,34 1,35 2.5,36 0.07,37 3,38 37.5,39 40.869,40 45.615,41 27.233,42 26.861,43 2.5,44 7.569}
{0 CHEMBL1095772,1 7.398,2 40.8,3 44.9,4 1,5 1.133,6 0.665,7 0.634,8 362.48,9 12.2,10 17,11 49,13 18,14 30,16 52,17 20,20 14,21 6,22 1,24 22,25 7,28 6,29 1,32 27,35 2,36 0.077,37 4,38 39.5,39 49.007,40 55.521,41 32.58,42 31.058,44 6.293}
{0 CHEMBL1096028,1 7.429,2 38.7,3 45.2,4 1.005,5 1.138,6 0.654,7 0.627,8 460.6,9 12.9,10 17,11 62,13 19,14 38,16 66,17 24,20 15,21 9,22 2,24 28,25 10,28 8,29 2,32 34,35 3.2,36 0.076,37 5,38 48.5,39 62.305,40 70.557,41 40.569,42 38.869,44 5}
{0 CHEMBL1096095,1 8.088,2 45.1,3 39.2,4 1.009,5 1.124,6 0.692,7 0.671,8 412.49,9 11.8,10 23,11 51,13 24,14 35,16 55,17 23,20 20,21 3,22 1,24 20,25 8,28 6,29 2,32 31,35 3.9,36 0.091,37 5,38 47.5,39 51.451,40 57.315,41 35.273,42 34.246,44 5.574}
{0 CHEMBL1097022,1 7.986,2 40.5,3 40.5,4 1.011,5 1.137,6 0.674,7 0.655,8 335.41,9 16.7,10 17,11 42,13 18,14 28,16 45,17 17,20 14,21 3,22 1,24 17,25 8,28 7,29 1,32 25,35 2.4,36 0.067,37 3,38 37.5,39 42.458,40 47.774,41 28.301,42 27.499,44 7.921}
{0 CHEMBL1097071,1 9.032,2 41.9,3 34.9,4 1.041,5 1.156,6 0.671,7 0.678,8 388.39,9 14,10 17,11 43,13 18,14 31,16 46,17 18,20 14,21 4,22 1,23 3,24 15,25 10,28 6,29 1,32 28,34 3,35 2.3,36 0.065,37 3,38 40.5,39 44.778,40 49.71,41 28.87,42 29.154,43 7,44 6.963}
{0 CHEMBL1097373,1 8.031,2 40.4,3 40.4,4 1.014,5 1.136,6 0.671,7 0.654,8 377.45,9 14.9,10 17,11 47,13 19,14 31,16 50,17 19,20 15,21 4,22 2,24 19,25 9,28 7,29 2,32 28,35 4.3,36 0.08,37 4,38 41.5,39 47.669,40 53.398,41 31.517,42 30.74,44 5.677}
{0 CHEMBL1097374,1 7.429,2 38.7,3 45.2,4 1.005,5 1.138,6 0.654,7 0.627,8 460.6,9 12.9,10 17,11 62,13 19,14 38,16 66,17 24,20 15,21 9,22 2,24 28,25 10,28 8,29 2,32 34,35 3.2,36 0.076,37 5,38 48.5,39 62.305,40 70.557,41 40.569,42 38.869,44 5}
{0 CHEMBL1099104,1 8.054,2 42.2,3 40,4 1.013,5 1.131,6 0.678,7 0.66,8 362.43,9 13.3,10 17,11 45,13 19,14 30,16 48,17 19,20 15,21 4,22 2,24 18,25 8,28 6,29 2,32 27,35 4.4,36 0.083,37 4,38 40.5,39 45.567,40 50.9,41 30.512,42 29.719,44 6.583}
{0 CHEMBL1173655,1 8.237,2 40.7,3 42.4,4 1.018,5 1.135,6 0.671,7 0.648,8 485.99,9 8.5,10 17,11 59,13 19,14 37,16 62,17 24,18 1,20 17,21 7,22 2,23 1,24 25,25 10,26 1,28 5,29 3,32 34,34 2,35 5.1,36 0.129,37 8,38 47.5,39 60.047,40 66.971,41 39.563,42 38.257,43 3.4,44 5}
{0 CHEMBL119385,1 11.791,2 51.4,3 24.3,4 1.049,5 1.115,6 0.798,7 0.784,8 436.28,9 8.1,10 12,11 37,13 17,14 31,16 40,17 19,18 2,20 19,22 5,23 2,24 9,25 9,26 3,28 3,29 1,31 1,32 28,34 4,35 2.7,36 0.075,37 3,38 42,39 38.8,40 41.268,41 29.517,42 29.022,43 10.8,44 5}
{0 CHEMBL1230020,1 10.094,2 41.5,3 34.1,4 1.046,5 1.136,6 0.71,7 0.699,8 413.86,9 7.3,10 16,11 41,13 19,14 29,16 43,17 17,18 1,20 14,21 3,22 3,23 2,24 14,25 10,26 2,28 3,29 3,31 1,32 27,34 3,35 7.3,36 0.14,37 6,38 40,39 42.898,40 46.573,41 29.091,42 28.677,43 7.3,44 5}
{0 CHEMBL1230607,1 6.343,2 33.3,3 54.4,4 0.994,5 1.146,6 0.611,7 0.568,8 361.55,9 8.8,10 5,11 57,13 7,14 28,16 59,17 19,20 5,21 14,22 2,24 31,25 7,28 5,29 2,32 26,35 3.5,36 0.068,37 4,38 32.5,39 56.65,40 65.308,41 34.836,42 32.385,44 5}
{0 CHEMBL1236107,1 9.217,2 46.2,3 33.3,4 1.011,5 1.119,6 0.743,7 0.716,8 359.45,9 17.9,10 26,11 39,13 26,14 30,16 43,17 18,20 17,21 1,24 13,25 8,26 1,28 7,31 1,32 26,36 0.07,37 3,38 43,39 39.44,40 43.654,41 28.972,42 27.917,44 5}
{0 CHEMBL1240703,1 7.928,2 47.3,3 40.5,4 1.007,5 1.114,6 0.692,7 0.669,8 586.69,9 5.4,10 30,11 74,13 32,14 52,16 82,17 35,20 26,21 9,22 2,24 30,25 9,28 4,29 5,32 44,35 6.8,36 0.037,37 3,38 69,39 74.531,40 82.438,41 51.193,42 49.508,44 5.699}
{0 CHEMBL1241674,1 7.907,2 41,3 41,4 1.009,5 1.135,6 0.674,7 0.653,8 308.38,9 15.4,10 20,11 39,13 20,14 26,16 42,17 16,20 13,21 3,24 16,25 7,28 6,29 1,32 23,35 2.6,36 0.048,37 2,38 36,39 39.356,40 44.275,41 26.296,42 25.477,44 5.854}
{0 CHEMBL124660,1 6.781,2 37.3,3 50.6,4 0.998,5 1.136,6 0.633,7 0.596,8 562.79,9 7.2,10 17,11 83,13 18,14 45,16 87,17 31,20 15,21 16,22 1,24 42,25 10,28 6,29 4,32 41,35 4.8,36 0.115,37 10,38 54.5,39 82.825,40 94.301,41 52.557,42 49.47,44 5}
{0 CHEMBL1269042,1 9.118,2 39.1,3 34.8,4 1.048,5 1.161,6 0.659,7 0.672,8 419.41,9 15.2,10 17,11 46,13 18,14 33,16 49,17 18,20 14,21 4,22 1,23 3,24 16,25 12,28 7,29 2,32 30,34 3,35 4.3,36 0.082,37 4,38 42.5,39 48.207,40 53.417,41 30.33,42 30.89,43 6.5,44 5.893}
{0 CHEMBL1269487,1 8.064,2 37,3 42.5,4 1.029,5 1.154,6 0.638,7 0.631,8 588.66,9 11,10 17,11 73,13 19,14 46,16 77,17 27,20 15,21 12,22 2,23 3,24 31,25 15,28 8,29 4,32 42,34 3,35 5.5,36 0.091,37 7,38 56.5,39 75.149,40 84.241,41 46.574,42 46.029,43 4.1,44 6.115}
{0 CHEMBL1269488,1 8.117,2 36.5,3 41.9,4 1.029,5 1.157,6 0.64,7 0.633,8 600.68,9 13.5,10 17,11 74,13 19,14 48,16 79,17 27,20 15,21 12,22 2,23 3,24 31,25 16,28 10,29 3,32 43,34 3,35 4.1,36 0.063,37 5,38 58.5,39 76.141,40 85.613,41 47.37,42 46.83,43 4.1,44 6.721}
{0 CHEMBL1271482,1 7.536,2 36.8,3 46.1,4 1.017,5 1.153,6 0.634,7 0.614,8 572.71,9 10.5,10 17,11 76,13 18,14 45,16 80,17 28,20 14,21 14,22 1,23 3,24 35,25 13,28 8,29 2,32 41,34 3,35 2.6,36 0.075,37 6,38 54.5,39 77.261,40 87.652,41 48.188,42 46.653,43 3.9,44 5}
{0 CHEMBL1271535,1 7.92,2 37.3,3 43.3,4 1.024,5 1.155,6 0.64,7 0.628,8 530.62,9 11.9,10 17,11 67,13 18,14 42,16 71,17 25,20 14,21 11,22 1,23 3,24 29,25 13,28 8,29 2,32 38,34 3,35 3,36 0.113,37 8,38 51.5,39 68.61,40 77.407,41 42.904,42 42.072,43 4.5,44 6.368}
{0 CHEMBL1271590,1 8.072,2 37.5,3 42.2,4 1.027,5 1.156,6 0.643,7 0.634,8 516.59,9 12.5,10 17,11 64,13 18,14 41,16 68,17 24,20 14,21 10,22 1,23 3,24 27,25 13,28 8,29 2,32 37,34 3,35 3.1,36 0.088,37 6,38 50.5,39 65.727,40 73.992,41 41.142,42 40.545,43 4.7,44 5.47}
{0 CHEMBL1271591,1 8.423,2 37.9,3 39.7,4 1.034,5 1.158,6 0.649,7 0.646,8 488.53,9 13.8,10 17,11 58,13 18,14 39,16 62,17 22,20 14,21 8,22 1,23 3,24 23,25 13,28 8,29 2,32 35,34 3,35 3.4,36 0.097,37 6,38 48.5,39 59.96,40 67.161,41 37.62,42 37.492,43 5.2,44 6.118}
{0 CHEMBL1271644,1 8.423,2 37.9,3 39.7,4 1.034,5 1.158,6 0.649,7 0.646,8 488.53,9 13.8,10 17,11 58,13 18,14 39,16 62,17 22,20 14,21 8,22 1,23 3,24 23,25 13,28 8,29 2,32 35,34 3,35 3.4,36 0.081,37 5,38 48.5,39 59.96,40 67.161,41 37.62,42 37.492,43 5.2,44 5}
{0 CHEMBL1271645,1 8.364,2 37.1,3 40.3,4 1.035,5 1.158,6 0.643,7 0.641,8 518.56,9 12.9,10 17,11 62,13 18,14 41,16 66,17 23,20 14,21 9,22 1,23 3,24 25,25 14,28 8,29 3,32 37,34 3,35 4.8,36 0.076,37 5,38 50.5,39 64.17,40 71.786,41 39.836,42 39.733,43 4.8,44 5}
{0 CHEMBL1271694,1 8.485,2 36.5,3 39.7,4 1.04,5 1.159,6 0.64,7 0.642,8 534.56,9 12.7,10 17,11 63,13 18,14 42,16 67,17 23,20 14,21 9,22 1,23 3,24 25,25 15,28 8,29 4,32 38,34 3,35 6.3,36 0.075,37 5,38 51.5,39 65.498,40 72.995,41 40.29,42 40.448,43 4.8,44 5}
{0 CHEMBL1272089,1 9.191,2 40.9,3 34.1,4 1.048,5 1.157,6 0.666,7 0.679,8 404.39,9 13.6,10 17,11 44,13 18,14 32,16 47,17 18,20 14,21 4,22 1,23 3,24 15,25 11,28 6,29 2,32 29,34 3,35 4.5,36 0.085,37 4,38 41.5,39 46.105,40 50.919,41 29.324,42 29.869,43 6.8,44 6.686}
{0 CHEMBL1272140,1 8.239,2 37.7,3 41,4 1.03,5 1.157,6 0.646,7 0.64,8 502.56,9 13.1,10 17,11 61,13 18,14 40,16 65,17 23,20 14,21 9,22 1,23 3,24 25,25 13,28 8,29 2,32 36,34 3,35 3.3,36 0.077,37 5,38 49.5,39 62.843,40 70.576,41 39.381,42 39.019,43 4.9,44 5.454}
{0 CHEMBL1272195,1 8.072,2 37.5,3 42.2,4 1.027,5 1.156,6 0.643,7 0.634,8 516.59,9 12.5,10 17,11 64,13 18,14 41,16 68,17 24,20 14,21 10,22 1,23 3,24 27,25 13,28 8,29 2,32 37,34 3,35 3.1,36 0.074,37 5,38 50.5,39 65.727,40 73.992,41 41.142,42 40.545,43 4.7,44 5}
{0 CHEMBL1272250,1 7.84,2 38,3 43.7,4 1.021,5 1.152,6 0.643,7 0.628,8 556.66,9 11.3,10 17,11 71,13 18,14 45,16 76,17 27,20 14,21 13,22 1,23 3,24 31,25 13,28 8,29 2,32 40,34 3,35 2.8,36 0.079,37 6,38 54.5,39 72.494,40 81.822,41 45.665,42 44.599,43 4.2,44 5}
{0 CHEMBL1272300,1 8.072,2 37.5,3 42.2,4 1.027,5 1.156,6 0.643,7 0.634,8 516.59,9 12.5,10 17,11 64,13 18,14 41,16 68,17 24,20 14,21 10,22 1,23 3,24 27,25 13,28 8,29 2,32 37,34 3,35 3.1,36 0.088,37 6,38 50.5,39 65.727,40 73.992,41 41.142,42 40.545,43 4.7,44 5.467}
{0 CHEMBL1287853,1 7.188,2 37,3 49.3,4 0.999,5 1.134,6 0.65,7 0.608,8 524.76,9 8.2,10 18,11 73,13 20,14 40,16 76,17 27,20 16,21 11,22 2,24 36,25 10,26 1,28 6,29 3,31 1,32 37,35 4.1,36 0.145,37 11,38 51,39 72.923,40 82.766,41 47.466,42 44.362,44 5.62}
{0 CHEMBL1289926,1 8.402,2 47.8,3 39.1,4 1,5 1.109,6 0.727,7 0.689,8 386.51,9 8.7,10 22,11 46,13 24,14 31,16 49,17 22,20 21,21 1,22 2,24 18,25 6,26 1,28 4,29 1,31 1,32 28,35 2.2,36 0.102,37 5,38 44,39 45.996,40 51.029,41 33.455,42 31.675,44 5}
{0 CHEMBL1336,1 9.685,2 43.8,3 33.3,4 1.048,5 1.144,6 0.691,7 0.696,8 464.86,9 8.3,10 18,11 48,13 20,14 34,16 50,17 21,18 1,20 19,21 2,22 2,23 3,24 16,25 11,26 1,28 4,29 3,32 32,34 4,35 6.3,36 0.1,37 5,38 45,39 50.32,40 54.906,41 33.148,42 33.422,43 8.3,44 5}
{0 CHEMBL1421,1 8.272,2 37.3,3 44.1,4 1.01,5 1.134,6 0.679,7 0.642,8 488.07,9 11.9,10 17,11 59,13 18,14 36,16 62,17 22,18 1,20 14,21 8,22 1,24 26,25 11,26 2,28 7,29 2,31 1,32 33,34 1,35 3.4,36 0.113,37 7,38 45.5,39 59.603,40 66.923,41 40.068,42 37.862,43 1.7,44 5}
{0 CHEMBL1614701,1 10.898,2 40.5,3 35.7,4 1.039,5 1.135,6 0.711,7 0.694,8 457.71,9 9.5,10 16,11 42,13 17,14 29,15 1,16 44,17 17,18 1,20 14,21 3,22 1,23 1,24 15,25 10,26 2,28 4,29 3,32 27,34 3,35 7.1,36 0.136,37 6,38 38,39 43.64,40 47.653,41 29.864,42 29.154,43 7.1,44 5}
{0 CHEMBL162,1 7.649,2 45.9,3 42.6,4 1.002,5 1.118,6 0.685,7 0.656,8 466.58,9 6.6,10 24,11 61,13 25,14 42,16 68,17 28,20 19,21 9,22 1,24 26,25 7,28 4,29 3,32 35,35 4.9,36 0.029,37 2,38 55,39 61.109,40 68.189,41 41.762,42 40.025,44 6.703}
{0 CHEMBL1721885,1 7.501,2 39,3 45.8,4 1.014,5 1.138,6 0.643,7 0.621,8 442.54,9 6.8,10 11,11 59,13 14,14 35,16 62,17 23,20 14,21 9,22 3,23 1,24 27,25 9,28 4,29 4,32 32,34 1,35 6.8,36 0.097,37 6,38 43.5,39 59.832,40 67.153,41 37.915,42 36.65,43 1.7,44 5}
{0 CHEMBL1738758,1 8.194,2 36.9,3 41.5,4 1.032,5 1.157,6 0.64,7 0.635,8 532.59,9 12.3,10 17,11 65,13 18,14 42,16 69,17 24,20 14,21 10,22 1,23 3,24 27,25 14,28 8,29 3,32 38,34 3,35 4.6,36 0.101,37 7,38 51.5,39 67.054,40 75.201,41 41.597,42 41.26,43 4.6,44 5}
{0 CHEMBL1774327,1 8.326,2 40,3 40,4 1.029,5 1.151,6 0.656,7 0.65,8 499.55,9 11.7,10 17,11 60,13 19,14 40,16 64,17 24,20 16,21 8,22 2,23 3,24 24,25 12,28 7,29 2,32 36,34 3,35 3.3,36 0.078,37 5,38 50.5,39 61.741,40 69.078,41 39.375,42 38.997,43 5,44 5.647}
{0 CHEMBL1774328,1 7.946,2 39.7,3 42.9,4 1.022,5 1.149,6 0.649,7 0.635,8 500.58,9 9.5,10 17,11 63,13 18,14 40,16 67,17 25,20 15,21 10,22 1,23 3,24 27,25 11,28 6,29 2,32 36,34 3,35 3.2,36 0.075,37 5,38 49.5,39 64.407,40 72.41,41 40.892,42 40.029,43 4.8,44 5}
{0 CHEMBL1774329,1 7.536,2 36.8,3 46.1,4 1.017,5 1.153,6 0.634,7 0.614,8 572.71,9 10.5,10 17,11 76,13 18,14 45,16 80,17 28,20 14,21 14,22 1,23 3,24 35,25 13,28 8,29 2,32 41,34 3,35 2.6,36 0.113,37 9,38 54.5,39 77.261,40 87.652,41 48.188,42 46.653,43 3.9,44 5.414}
{0 CHEMBL1774330,1 8.609,2 38.3,3 38.3,4 1.038,5 1.156,6 0.651,7 0.653,8 516.54,9 13.3,10 17,11 60,13 19,14 41,16 64,17 23,20 15,21 8,22 2,23 3,24 23,25 14,28 8,29 3,32 37,34 3,35 5,36 0.094,37 6,38 51.5,39 62.287,40 69.371,41 39.074,42 39.207,43 5,44 5.838}
{0 CHEMBL1774331,1 7.719,2 36.2,3 44.9,4 1.022,5 1.157,6 0.633,7 0.617,8 532.64,9 11.6,10 17,11 69,13 18,14 41,16 72,17 25,20 14,21 11,22 1,23 3,24 31,25 13,28 8,29 2,32 38,34 3,35 2.9,36 0.139,37 10,38 50.5,39 70.494,40 79.822,41 43.665,42 42.599,43 4.3,44 5}
{0 CHEMBL1774332,1 8.423,2 37.9,3 39.7,4 1.034,5 1.158,6 0.649,7 0.646,8 488.53,9 13.8,10 17,11 58,13 18,14 39,16 62,17 22,20 14,21 8,22 1,23 3,24 23,25 13,28 8,29 2,32 35,34 3,35 3.4,36 0.097,37 6,38 48.5,39 59.96,40 67.161,41 37.62,42 37.492,43 5.2,44 6.118}
{0 CHEMBL1774333,1 7.773,2 36.1,3 44.4,4 1.022,5 1.157,6 0.634,7 0.62,8 559.67,9 12.5,10 17,11 72,13 18,14 44,16 76,17 26,20 14,21 12,22 1,23 3,24 32,25 14,28 9,29 2,32 40,34 3,35 2.8,36 0.118,37 9,38 53.5,39 73.596,40 83.32,41 45.671,42 44.62,43 4.2,44 5.865}
{0 CHEMBL1774334,1 8.194,2 36.9,3 41.5,4 1.032,5 1.157,6 0.64,7 0.635,8 532.59,9 12.3,10 17,11 65,13 18,14 42,16 69,17 24,20 14,21 10,22 1,23 3,24 27,25 14,28 8,29 3,32 38,34 3,35 4.6,36 0.087,37 6,38 51.5,39 67.054,40 75.201,41 41.597,42 41.26,43 4.6,44 5}
{0 CHEMBL1774335,1 8.194,2 36.9,3 41.5,4 1.032,5 1.157,6 0.64,7 0.635,8 532.59,9 12.3,10 17,11 65,13 18,14 42,16 69,17 24,20 14,21 10,22 1,23 3,24 27,25 14,28 8,29 3,32 38,34 3,35 4.6,36 0.087,37 6,38 51.5,39 67.054,40 75.201,41 41.597,42 41.26,43 4.6,44 5.826}
{0 CHEMBL1774336,1 8.252,2 37.9,3 40.9,4 1.031,5 1.155,6 0.645,7 0.64,8 544.6,9 12.1,10 17,11 66,13 19,14 43,16 70,17 25,20 15,21 10,22 2,23 3,24 27,25 14,28 8,29 3,32 39,34 3,35 4.5,36 0.086,37 6,38 53.5,39 68.054,40 76.201,41 42.597,42 42.26,43 4.5,44 5.824}
{0 CHEMBL1774337,1 8.055,2 36.4,3 42.4,4 1.028,5 1.159,6 0.639,7 0.63,8 531.61,9 13.6,10 17,11 66,13 18,14 42,16 70,17 24,20 14,21 10,22 1,23 3,24 28,25 14,28 9,29 2,32 38,34 3,35 3,36 0.1,37 7,38 51.5,39 67.829,40 76.49,41 42.148,42 41.567,43 4.5,44 5}
{0 CHEMBL1774338,1 7.807,2 36.7,3 44.3,4 1.024,5 1.153,6 0.634,7 0.621,8 616.72,9 10.1,10 17,11 79,13 18,14 49,16 84,17 29,20 14,21 15,22 1,23 3,24 35,25 15,28 8,29 4,32 44,34 3,35 5.1,36 0.107,37 9,38 58.5,39 80.916,40 91.071,41 50.097,42 49.082,43 3.8,44 5}
{0 CHEMBL1774339,1 7.908,2 36.2,3 43.5,4 1.025,5 1.158,6 0.636,7 0.625,8 545.64,9 13,10 17,11 69,13 18,14 43,16 73,17 25,20 14,21 11,22 1,23 3,24 30,25 14,28 9,29 2,32 39,34 3,35 2.9,36 0.11,37 8,38 52.5,39 70.712,40 79.905,41 43.91,42 43.094,43 4.3,44 5}
{0 CHEMBL1774340,1 7.649,2 36,3 45.3,4 1.02,5 1.156,6 0.632,7 0.615,8 573.7,9 12,10 17,11 75,13 18,14 45,16 79,17 27,20 14,21 13,22 1,23 3,24 34,25 14,28 9,29 2,32 41,34 3,35 2.7,36 0.114,37 9,38 54.5,39 76.479,40 86.735,41 47.432,42 46.147,43 4,44 5}
{0 CHEMBL1789941,1 7.473,2 41.5,3 43.9,4 0.998,5 1.134,6 0.673,7 0.641,8 306.41,9 14.6,10 15,11 41,13 16,14 26,16 44,17 17,19 1,20 9,21 7,24 18,25 6,28 6,32 23,33 1,36 0.091,37 4,38 35.5,39 40.912,40 46.481,41 27.603,42 26.289,44 5.824}
{0 CHEMBL1793891,1 8.423,2 37.9,3 39.7,4 1.034,5 1.158,6 0.649,7 0.646,8 488.53,9 13.8,10 17,11 58,13 18,14 39,16 62,17 22,20 14,21 8,22 1,23 3,24 23,25 13,28 8,29 2,32 35,34 3,35 3.4,36 0.081,37 5,38 48.5,39 59.96,40 67.161,41 37.62,42 37.492,43 5.2,44 5}
{0 CHEMBL1793892,1 8.353,2 37.5,3 40.6,4 1.035,5 1.161,6 0.642,7 0.64,8 534.58,9 12.5,10 17,11 64,13 18,14 42,16 68,17 24,20 14,21 10,22 1,23 4,24 26,25 14,28 8,29 2,32 38,34 4,35 3.1,36 0.088,37 6,38 51.5,39 66.239,40 74.331,41 41.08,42 40.929,43 6.3,44 5}
{0 CHEMBL1793893,1 8.072,2 37.5,3 42.2,4 1.027,5 1.156,6 0.643,7 0.634,8 516.59,9 12.5,10 17,11 64,13 18,14 41,16 68,17 24,20 14,21 10,22 1,23 3,24 27,25 13,28 8,29 2,32 37,34 3,35 3.1,36 0.088,37 6,38 50.5,39 65.727,40 73.992,41 41.142,42 40.545,43 4.7,44 5}
{0 CHEMBL1793894,1 8.039,2 36.8,3 42.6,4 1.028,5 1.156,6 0.638,7 0.629,8 546.62,9 11.8,10 17,11 68,13 18,14 43,16 72,17 25,20 14,21 11,22 1,23 3,24 29,25 14,28 8,29 3,32 39,34 3,35 4.4,36 0.111,37 8,38 52.5,39 69.938,40 78.616,41 43.358,42 42.787,43 4.4,44 5}
{0 CHEMBL1793895,1 8.61,2 37.5,3 40.6,4 1.032,5 1.155,6 0.656,7 0.646,8 551.03,9 12.5,10 17,11 64,13 18,14 42,16 68,17 24,18 1,20 14,21 10,22 1,23 3,24 26,25 14,26 1,28 8,29 2,32 38,34 4,35 3.1,36 0.088,37 6,38 51.5,39 66.05,40 73.936,41 42,42 41.373,43 6.3,44 5}
{0 CHEMBL1793896,1 8.3,2 38.7,3 40.3,4 1.03,5 1.154,6 0.651,7 0.645,8 514.57,9 12.9,10 17,11 62,13 19,14 41,16 66,17 24,20 16,21 8,22 2,23 3,24 25,25 13,28 8,29 2,32 37,34 3,35 3.2,36 0.091,37 6,38 51.5,39 63.843,40 71.576,41 40.381,42 40.019,43 4.8,44 6.475}
{0 CHEMBL180022,1 8.074,2 43.5,3 42,4 1.008,5 1.124,6 0.687,7 0.658,8 557.1,9 8.7,10 23,11 69,13 26,14 43,16 72,17 30,18 1,19 1,20 23,21 6,22 2,24 29,25 10,26 1,28 6,29 3,32 40,33 1,34 1,35 4.3,36 0.153,37 11,38 58.5,39 69.52,40 77.544,41 47.392,42 45.422,43 1.4,44 5}
{0 CHEMBL1908391,1 7.556,2 42.4,3 45.5,4 0.994,5 1.123,6 0.686,7 0.642,8 498.71,9 9.1,10 23,11 66,13 24,14 40,16 70,17 28,20 21,21 7,22 1,24 30,25 8,26 1,28 6,29 1,31 1,32 36,35 1.5,36 0.1,37 7,38 52.5,39 65.618,40 74.102,41 45.273,42 42.352,44 5}
{0 CHEMBL1908392,1 7.189,2 43.3,3 46.3,4 0.995,5 1.124,6 0.669,7 0.633,8 481.65,9 7.5,10 22,11 67,13 24,14 40,16 71,17 29,20 22,21 7,22 2,24 31,25 7,28 5,29 2,32 36,35 3,36 0.085,37 6,38 53,39 66.65,40 75.308,41 44.836,42 42.385,44 5}
{0 CHEMBL1908393,1 7.741,2 41.5,3 43.9,4 1.017,5 1.134,6 0.653,7 0.635,8 634.74,9 4.9,10 17,11 82,13 21,14 51,16 87,17 34,20 21,21 13,22 4,23 2,24 36,25 12,28 4,29 6,32 46,34 2,35 7.3,36 0.138,37 12,38 63.5,39 83.418,40 92.987,41 53.569,42 52.097,43 2.4,44 5}
{0 CHEMBL1908394,1 8.237,2 40.9,3 42.4,4 1.019,5 1.14,6 0.671,7 0.647,8 543.67,9 7.6,10 21,11 66,13 22,14 42,16 70,17 27,20 18,21 9,22 1,23 3,24 28,25 11,26 1,28 5,29 2,31 1,32 38,34 3,35 3,36 0.1,37 7,38 53.5,39 67.265,40 75.247,41 44.296,42 42.722,43 4.5,44 6.301}
{0 CHEMBL1908395,1 6.979,2 39.4,3 48.5,4 0.996,5 1.133,6 0.649,7 0.612,8 460.64,9 9.1,10 11,11 66,13 15,14 37,16 69,17 26,19 1,20 13,21 12,22 3,24 32,25 8,28 6,29 2,32 34,33 1,35 3,36 0.087,37 6,38 47.5,39 65.752,40 74.806,41 42.841,42 40.406,44 5}
{0 CHEMBL1908396,1 8.286,2 41.4,3 41.4,4 1.016,5 1.123,6 0.682,7 0.657,8 480.59,9 6.9,10 22,11 58,13 23,14 37,16 61,17 24,20 19,21 5,22 1,24 24,25 10,26 1,28 4,29 5,31 1,32 34,35 8.6,36 0.131,37 8,38 49,39 58.956,40 65.112,41 39.557,42 38.115,44 5}
{0 CHEMBL1908397,1 7.388,2 44.4,3 44.4,4 0.996,5 1.123,6 0.679,7 0.645,8 332.44,9 8.9,10 16,11 45,13 18,14 28,16 48,17 20,20 16,21 4,22 2,24 20,25 5,28 4,29 1,32 25,35 2.2,36 0.063,37 3,38 38,39 44.803,40 50.524,41 30.569,42 29.015,44 5}
{0 CHEMBL1929238,1 8.038,2 36.2,3 47.8,4 1.007,5 1.133,6 0.669,7 0.623,8 554.6,9 7.2,10 11,11 69,13 14,14 38,16 71,17 25,18 2,20 13,21 12,22 3,24 33,25 11,26 3,28 5,29 3,31 1,32 36,34 2,35 4.3,36 0.099,37 7,38 46.5,39 69.469,40 78.156,41 46.176,42 42.995,43 2.9,44 4.523}
{0 CHEMBL1933576,1 8.199,2 37.9,3 41.4,4 1.03,5 1.157,6 0.644,7 0.638,8 475.53,9 12.1,10 17,11 58,13 18,14 37,16 61,17 22,20 15,21 7,22 1,23 3,24 24,25 12,28 7,29 2,32 34,34 3,35 3.4,36 0.098,37 6,38 46.5,39 59.741,40 67.078,41 37.375,42 36.997,43 5.2,44 5}
{0 CHEMBL1933577,1 8.91,2 37.7,3 37.7,4 1.052,5 1.172,6 0.639,7 0.65,8 543.53,9 11.5,10 17,11 61,13 18,14 41,16 64,17 23,20 15,21 8,22 1,23 6,24 23,25 15,28 7,29 2,32 38,34 6,35 3.3,36 0.109,37 7,38 50.5,39 64.163,40 71.512,41 38.949,42 39.674,43 9.8,44 5}
{0 CHEMBL1933578,1 8.391,2 38.2,3 40,4 1.034,5 1.158,6 0.648,7 0.645,8 461.5,9 12.7,10 17,11 55,13 18,14 36,16 58,17 21,20 15,21 6,22 1,23 3,24 22,25 12,28 7,29 2,32 33,34 3,35 3.6,36 0.103,37 6,38 45.5,39 56.858,40 63.663,41 35.614,42 35.47,43 5.5,44 5}
{0 CHEMBL1933579,1 8.154,2 37.1,3 41.9,4 1.031,5 1.156,6 0.639,7 0.633,8 505.56,9 11.3,10 17,11 62,13 18,14 39,16 65,17 23,20 15,21 8,22 1,23 3,24 26,25 13,28 7,29 3,32 36,34 3,35 4.8,36 0.123,37 8,38 48.5,39 63.952,40 71.703,41 39.591,42 39.239,43 4.8,44 5}
{0 CHEMBL1933580,1 7.759,2 36.8,3 44.7,4 1.024,5 1.152,6 0.633,7 0.619,8 589.69,9 9.2,10 17,11 76,13 18,14 46,16 80,17 28,20 15,21 13,22 1,23 3,24 34,25 14,28 7,29 4,32 42,34 3,35 5.3,36 0.125,37 10,38 55.5,39 77.814,40 87.573,41 48.091,42 47.061,43 3.9,44 5}
{0 CHEMBL1933581,1 8.023,2 37.1,3 42.9,4 1.029,5 1.153,6 0.637,7 0.629,8 561.63,9 10,10 17,11 70,13 19,14 43,16 73,17 26,20 16,21 10,22 2,23 3,24 30,25 14,28 7,29 4,32 40,34 3,35 5.7,36 0.11,37 8,38 53.5,39 72.047,40 80.742,41 44.569,42 44.007,43 4.3,44 5}
{0 CHEMBL1933582,1 8.09,2 38.7,3 41.9,4 1.026,5 1.153,6 0.647,7 0.637,8 501.57,9 11.3,10 17,11 62,13 18,14 40,16 66,17 24,20 15,21 9,22 1,23 3,24 26,25 12,28 7,29 2,32 36,34 3,35 3.2,36 0.076,37 5,38 49.5,39 63.625,40 71.493,41 40.137,42 39.524,43 4.8,44 5}
{0 CHEMBL1933583,1 8.763,2 38.5,3 38.5,4 1.047,5 1.168,6 0.642,7 0.649,8 569.57,9 10.8,10 17,11 65,13 18,14 44,16 69,17 25,20 15,21 10,22 1,23 6,24 25,25 15,28 7,29 2,32 40,34 6,35 3.1,36 0.087,37 6,38 53.5,39 68.047,40 75.928,41 41.711,42 42.201,43 9.2,44 5}
{0 CHEMBL1933584,1 8.055,2 37.9,3 42.4,4 1.028,5 1.153,6 0.642,7 0.633,8 531.6,9 10.6,10 17,11 66,13 18,14 42,16 70,17 25,20 15,21 10,22 1,23 3,24 28,25 13,28 7,29 3,32 38,34 3,35 4.5,36 0.1,37 7,38 51.5,39 67.836,40 76.118,41 42.353,42 41.766,43 4.5,44 5}
{0 CHEMBL1933585,1 7.814,2 37.7,3 44.2,4 1.024,5 1.15,6 0.638,7 0.624,8 601.7,9 9.1,10 17,11 77,13 19,14 47,16 81,17 29,20 16,21 13,22 2,23 3,24 34,25 14,28 7,29 4,32 43,34 3,35 5.2,36 0.086,37 7,38 57.5,39 78.814,40 88.573,41 49.091,42 48.061,43 3.9,44 5}
{0 CHEMBL215152,1 7.577,2 38.8,3 44.8,4 1.012,5 1.141,6 0.649,7 0.627,8 507.63,9 10.4,10 22,11 67,13 23,14 40,16 70,17 26,20 18,21 8,22 1,23 1,24 30,25 11,28 7,29 3,32 37,34 1,35 4.5,36 0.186,37 13,38 52,39 67.81,40 76.438,41 43.478,42 41.999,43 1.5,44 5}
{0 CHEMBL2205426,1 7.821,2 43.4,3 41.5,4 1.006,5 1.127,6 0.68,7 0.656,8 414.51,9 11.3,10 18,11 53,13 21,14 34,16 56,17 23,20 19,21 4,22 3,24 22,25 8,28 6,29 2,32 31,35 3.8,36 0.089,37 5,38 46,39 53.334,40 59.73,41 36.034,42 34.772,44 8.699}
{0 CHEMBL221959,1 7.266,2 37.2,3 46.5,4 1.003,5 1.142,6 0.647,7 0.617,8 312.42,9 14,10 10,11 43,13 12,14 25,16 45,17 16,19 1,20 7,21 8,22 1,24 20,25 7,28 6,29 1,32 23,33 1,35 2.3,36 0.067,37 3,38 33,39 43.123,40 49.106,41 27.819,42 26.531,44 5}
{0 CHEMBL223360,1 8.162,2 45.7,3 39.1,4 1.012,5 1.129,6 0.69,7 0.672,8 375.44,9 10.9,10 22,11 46,13 23,14 31,16 49,17 21,20 20,21 1,22 1,23 1,24 18,25 7,28 5,29 1,32 28,34 1,35 2.2,36 0.061,37 3,38 43,39 46.534,40 51.947,41 31.75,42 30.893,43 2.2,44 5}
{0 CHEMBL230011,1 8.659,2 45,3 35,4 1.02,5 1.127,6 0.7,7 0.692,8 346.38,9 15,10 23,11 40,13 23,14 29,16 43,17 18,20 18,24 14,25 8,28 6,29 2,32 26,35 5,36 0.047,37 2,38 40.5,39 40.8,40 45.069,41 27.989,42 27.665,44 5}
{0 CHEMBL2309006,1 8.139,2 48.1,3 38.9,4 1.011,5 1.112,6 0.698,7 0.679,8 439.5,9 5.6,10 24,11 54,13 25,14 40,16 61,17 26,20 19,21 7,22 1,24 21,25 7,28 3,29 4,32 33,35 7.4,36 0.016,37 1,38 53,39 54.567,40 60.069,41 37.688,42 36.665,44 6.481}
{0 CHEMBL2309609,1 7.818,2 47.9,3 41.1,4 1.003,5 1.113,6 0.695,7 0.668,8 570.69,9 5.5,10 30,11 73,13 32,14 51,16 81,17 35,20 26,21 9,22 2,24 30,25 8,28 4,29 4,32 43,35 5.5,36 0.037,37 3,38 68,39 73.203,40 81.228,41 50.739,42 48.793,44 5}
{0 CHEMBL24828,1 8.804,2 40.7,3 44.4,4 1.01,5 1.133,6 0.678,7 0.643,8 475.4,9 7.4,10 17,11 54,13 17,14 33,15 1,16 57,17 22,20 14,21 8,23 1,24 24,25 8,26 1,28 4,29 2,32 30,34 2,35 3.7,36 0.105,37 6,38 41.5,39 54.523,40 61.161,41 36.597,42 34.718,43 3.7,44 5}
{0 CHEMBL249697,1 7.093,2 38.9,3 47.2,4 0.995,5 1.138,6 0.655,7 0.619,8 255.36,9 13.9,10 15,11 36,13 15,14 21,16 38,17 14,20 10,21 4,24 17,25 5,28 5,32 19,36 0.079,37 3,38 28.5,39 35.811,40 40.983,41 23.597,42 22.268,44 5}
{0 CHEMBL255863,1 8.681,2 45.9,3 36.1,4 1.025,5 1.139,6 0.691,7 0.685,8 529.57,9 11.5,10 29,11 61,13 30,14 43,16 65,17 28,20 25,21 3,22 1,23 3,24 22,25 11,28 7,29 1,32 39,34 3,35 1.6,36 0.092,37 6,38 58.5,39 62.53,40 69.453,41 42.159,42 41.756,43 4.9,44 5}
{0 CHEMBL259084,1 9.732,2 51,3 30.6,4 1.033,5 1.121,6 0.735,7 0.731,8 476.89,9 8.2,10 24,11 49,13 26,14 38,16 53,17 25,18 1,20 24,21 1,22 2,23 2,24 15,25 9,26 1,28 4,29 2,32 34,34 3,35 4.1,36 0.075,37 4,38 52,39 50.596,40 54.942,41 35.995,42 35.797,43 6.1,44 5}
{0 CHEMBL261849,1 7.479,2 40.8,3 44.9,4 1.007,5 1.13,6 0.658,7 0.632,8 366.46,9 8.2,10 18,11 49,13 18,14 29,16 51,17 20,20 16,21 4,24 22,25 7,28 4,29 3,32 27,35 6.1,36 0.137,37 7,38 38,39 49.342,40 55.358,41 32.239,42 30.971,44 5}
{0 CHEMBL288441,1 8.162,2 40,3 44.6,4 1.01,5 1.129,6 0.677,7 0.642,8 530.5,9 7.7,10 17,11 65,13 18,14 39,16 68,17 26,18 2,19 1,20 15,21 10,24 29,25 10,26 2,28 5,29 3,32 36,33 1,34 2,35 4.6,36 0.132,37 9,38 49.5,39 65.625,40 73.405,41 44.006,42 41.755,43 3.1,44 6.018}
{0 CHEMBL296468,1 7.767,2 34.7,3 49,4 1.001,5 1.131,6 0.67,7 0.615,8 380.59,9 8.2,10 10,11 49,13 11,14 27,16 51,17 17,20 7,21 10,22 1,24 24,25 8,26 2,28 4,29 2,31 2,32 25,35 4.1,36 0.118,37 6,38 33,39 49.051,40 55.404,41 32.841,42 30.157,44 5}
{0 CHEMBL300138,1 7.583,2 47.1,3 42.6,4 0.997,5 1.116,6 0.692,7 0.66,8 515.66,9 7.4,10 26,11 68,13 29,14 45,16 74,17 32,20 25,21 7,22 3,24 29,25 7,28 5,29 2,32 39,35 2.9,36 0.068,37 5,38 61,39 67.767,40 75.893,41 47.074,42 44.858,44 5}
{0 CHEMBL31965,1 8.237,2 40.7,3 42.4,4 1.018,5 1.135,6 0.671,7 0.648,8 485.99,9 8.5,10 17,11 59,13 19,14 37,16 62,17 24,18 1,20 17,21 7,22 2,23 1,24 25,25 10,26 1,28 5,29 3,32 34,34 2,35 5.1,36 0.145,37 9,38 47.5,39 60.047,40 66.971,41 39.563,42 38.257,43 3.4,44 5}
{0 CHEMBL377300,1 8.053,2 41.3,3 41.3,4 1.021,5 1.137,6 0.661,7 0.648,8 370.42,9 8.7,10 20,11 46,13 20,14 30,16 49,17 19,20 14,21 5,23 1,24 19,25 8,28 4,29 3,32 27,34 1,35 6.5,36 0.102,37 5,38 40,39 46.971,40 52.283,41 30.415,42 29.828,43 2.2,44 5}
{0 CHEMBL379218,1 7.316,2 44.9,3 44.9,4 0.994,5 1.121,6 0.68,7 0.644,8 358.48,9 8.2,10 22,11 49,13 22,14 30,16 52,17 22,20 18,21 4,24 22,25 5,28 4,29 1,32 27,35 2,36 0.115,37 6,38 41,39 48.687,40 54.939,41 33.33,42 31.542,44 5}
{0 CHEMBL384304,1 8.657,2 35.3,3 41.2,4 1.037,5 1.15,6 0.651,7 0.64,8 441.51,9 9.8,10 12,11 51,13 15,14 32,16 53,17 18,20 11,21 7,22 3,23 2,24 21,25 12,26 1,28 5,29 4,31 1,32 30,34 2,35 7.8,36 0.113,37 6,38 41,39 52.872,40 58.665,41 33.222,42 32.661,43 3.9,44 5}
{0 CHEMBL386051,1 9.853,2 46.7,3 35.6,4 1.014,5 1.109,6 0.759,7 0.718,8 443.38,9 8.9,10 18,11 45,13 20,14 32,16 48,17 21,18 2,20 19,21 2,22 2,24 16,25 8,26 3,28 4,29 1,31 1,32 29,34 2,35 2.2,36 0.083,37 4,38 43,39 45.644,40 49.917,41 34.171,42 32.33,43 4.4,44 5}
{0 CHEMBL428690,1 8.372,2 43.8,3 41.7,4 1.019,5 1.118,6 0.682,7 0.66,8 401.87,9 2.1,10 12,11 48,13 14,14 31,16 51,17 21,18 1,20 15,21 6,22 2,24 20,25 7,26 1,28 1,29 5,32 28,34 1,35 10.4,36 0.039,37 2,38 39,39 48.898,40 53.641,41 32.75,42 31.691,43 2.1,44 5}
{0 CHEMBL445813,1 9.102,2 38.1,3 40.5,4 1.024,5 1.136,6 0.69,7 0.664,8 382.28,9 11.9,10 11,11 42,13 13,14 27,16 44,17 16,18 2,20 11,21 5,22 2,24 17,25 9,26 2,28 5,29 2,32 25,34 2,35 4.8,36 0.091,37 4,38 34.5,39 42.996,40 47.705,41 28.983,42 27.879,43 4.8,44 5}
{0 CHEMBL450786,1 8.333,2 41.6,3 44.2,4 1.008,5 1.121,6 0.693,7 0.652,8 641.67,9 5.2,10 17,11 77,13 22,14 48,16 82,17 32,18 2,20 20,21 12,22 5,24 34,25 11,26 3,28 4,29 4,31 1,32 43,34 2,35 5.2,36 0.085,37 7,38 61.5,39 77.578,40 86.282,41 53.387,42 50.216,43 2.6,44 5.081}
{0 CHEMBL464552,1 7.833,2 39.7,3 42.6,4 1.015,5 1.14,6 0.658,7 0.64,8 532.64,9 11.8,10 22,11 68,13 24,14 43,16 72,17 27,20 20,21 7,22 2,23 1,24 29,25 12,28 8,29 3,32 39,34 1,35 4.4,36 0.111,37 8,38 56,39 69.029,40 77.522,41 44.722,42 43.494,43 1.5,44 5}
{0 CHEMBL475251,1 8.255,2 38.6,3 40.4,4 1.03,5 1.142,6 0.651,7 0.646,8 470.51,9 10.5,10 18,11 57,13 19,14 37,16 60,17 22,20 16,21 6,22 1,23 1,24 23,25 12,28 6,29 5,32 34,34 1,35 8.8,36 0.117,37 7,38 47,39 58.712,40 65.113,41 37.097,42 36.827,43 1.8,44 7.469}
{0 CHEMBL477772,1 8.103,2 38.9,3 42.6,4 1.009,5 1.132,6 0.679,7 0.648,8 437.58,9 13,10 22,11 54,13 24,14 34,16 57,17 21,20 17,21 4,22 2,24 23,25 10,26 1,28 7,29 2,31 1,32 31,35 3.7,36 0.088,37 5,38 47,39 54.512,40 61.149,41 36.688,42 34.981,44 5}
{0 CHEMBL489992,1 7.487,2 47.7,3 43.2,4 0.993,5 1.114,6 0.695,7 0.659,8 329.43,9 6.8,10 22,11 44,13 22,14 28,16 47,17 21,20 18,21 3,24 19,25 4,28 3,29 1,32 25,35 2.3,36 0.085,37 4,38 39,39 43.702,40 49.026,41 30.563,42 28.993,44 5.839}
{0 CHEMBL491021,1 8.254,2 45.1,3 41.2,4 1.007,5 1.119,6 0.699,7 0.668,8 420.93,9 7.8,10 22,11 51,13 23,14 33,16 54,17 23,18 1,20 19,21 4,22 1,24 21,25 7,26 1,28 4,29 2,32 30,34 1,35 3.9,36 0.13,37 7,38 45,39 51.338,40 57.093,41 35.642,42 34.084,43 2,44 6.764}
{0 CHEMBL491473,1 7.509,2 41.7,3 45,4 1.008,5 1.132,6 0.658,7 0.632,8 450.56,9 6.7,10 21,11 60,13 21,14 37,16 64,17 25,20 16,21 9,23 1,24 27,25 8,28 4,29 3,32 33,34 1,35 5,36 0.125,37 8,38 47.5,39 60.505,40 67.944,41 39.461,42 37.935,43 1.7,44 5}
{0 CHEMBL494089,1 7.337,2 36.2,3 46.6,4 1.009,5 1.143,6 0.638,7 0.613,8 425.55,9 12.1,10 15,11 58,13 16,14 34,16 61,17 21,19 2,20 8,21 11,24 27,25 10,28 7,29 3,32 31,33 1,35 5.2,36 0.082,37 5,38 43.5,39 58.531,40 66.268,41 37.017,42 35.562,44 5}
{0 CHEMBL504574,1 8.822,2 43.2,3 37.8,4 1.015,5 1.119,6 0.713,7 0.685,8 326.41,9 10.8,10 16,11 37,13 18,14 25,16 39,17 16,20 15,21 1,22 2,24 14,25 7,26 1,28 4,29 2,31 1,32 23,35 5.4,36 0.103,37 4,38 35,39 37.556,40 41.408,41 26.387,42 25.336,44 4.301}
{0 CHEMBL509032,1 7.491,2 36.6,3 48.8,4 1.001,5 1.135,6 0.657,7 0.613,8 614.29,9 8.5,10 18,11 82,13 20,14 46,16 86,17 30,18 1,20 16,21 14,22 2,24 40,25 12,26 2,28 7,29 3,31 1,32 42,34 1,35 3.7,36 0.105,37 9,38 57,39 82.116,40 93.039,41 53.853,42 50.264,43 1.2,44 5.921}
{0 CHEMBL513909,1 6.776,2 36.4,3 50.6,4 0.998,5 1.14,6 0.631,7 0.594,8 521.74,9 9.1,10 12,11 77,13 14,14 42,16 81,17 28,20 12,21 16,22 2,24 39,25 10,28 7,29 3,32 38,35 3.9,36 0.086,37 7,38 50,39 76.832,40 87.76,41 48.586,42 45.723,44 9.092}
{0 CHEMBL521851,1 8.286,2 37.1,3 43.5,4 1.011,5 1.131,6 0.682,7 0.644,8 513.71,9 11.3,10 20,11 62,13 22,14 40,16 67,17 23,20 13,21 10,22 2,24 27,25 12,26 2,28 7,29 3,31 2,32 35,35 4.8,36 0.075,37 5,38 52,39 62.683,40 70.108,41 42.313,42 39.936,44 5}
{0 CHEMBL522618,1 8.168,2 47.7,3 38.6,4 1.011,5 1.114,6 0.698,7 0.679,8 359.41,9 6.8,10 22,11 44,13 22,14 31,16 48,17 21,20 18,21 3,24 17,25 6,28 3,29 3,32 27,35 6.8,36 0.083,37 4,38 42,39 44.473,40 49.03,41 30.71,42 29.896,44 8.398}
{0 CHEMBL522892,1 7.85,2 42,3 42,4 1.01,5 1.137,6 0.67,7 0.649,8 392.48,9 12,10 16,11 50,13 18,14 33,16 54,17 21,20 16,21 5,22 2,23 1,24 21,25 8,28 6,29 1,32 29,34 1,35 2,36 0.037,37 2,38 43,39 50.52,40 56.861,41 33.517,42 32.441,43 2,44 6.244}
{0 CHEMBL525191,1 7.777,2 44.2,3 41.9,4 1.006,5 1.124,6 0.681,7 0.656,8 334.41,9 9.3,10 17,11 43,13 18,14 28,16 46,17 19,20 15,21 4,22 1,24 18,25 6,28 4,29 2,32 25,35 4.7,36 0.087,37 4,38 37.5,39 43.247,40 48.318,41 29.262,42 28.203,44 5}
{0 CHEMBL535,1 7.117,2 39.3,3 48.2,4 1.003,5 1.138,6 0.643,7 0.611,8 398.53,9 7.1,10 11,11 56,13 14,14 31,16 58,17 22,20 14,21 8,22 3,23 1,24 27,25 7,28 4,29 2,32 29,34 1,35 3.6,36 0.121,37 7,38 39.5,39 56.178,40 63.734,41 36.006,42 34.22,43 1.8,44 5.328}
{0 CHEMBL551079,1 8.041,2 40.6,3 43.8,4 1.015,5 1.135,6 0.669,7 0.641,8 514.65,9 6.3,10 21,11 64,13 22,14 39,16 67,17 26,20 18,21 8,22 1,23 2,24 28,25 10,26 1,28 4,29 3,31 1,32 36,34 2,35 4.7,36 0.134,37 9,38 50.5,39 64.978,40 72.618,41 42.807,42 41.032,43 3.1,44 7.678}
{0 CHEMBL553,1 7.567,2 42.3,3 44.2,4 1.009,5 1.125,6 0.662,7 0.638,8 393.48,9 5.8,10 17,11 52,13 18,14 31,16 54,17 22,19 2,20 14,21 6,24 23,25 7,28 3,29 4,32 29,33 1,35 7.7,36 0.185,37 10,38 41.5,39 52.451,40 58.485,41 34.449,42 33.191,44 5}
{0 CHEMBL554,1 8.805,2 43.9,3 39.4,4 1.019,5 1.121,6 0.703,7 0.677,8 581.11,9 6.1,10 28,11 66,13 30,14 44,16 70,17 29,18 1,20 24,21 5,22 2,23 1,24 26,25 11,26 2,28 4,29 4,31 1,32 40,34 2,35 6.1,36 0.157,37 11,38 60,39 67.232,40 74.017,41 46.421,42 44.664,43 3,44 5}
{0 CHEMBL558752,1 9.782,2 45.3,3 30.2,4 1.058,5 1.161,6 0.683,7 0.705,8 518.46,9 11.3,10 27,11 53,13 27,14 41,16 57,17 24,20 21,21 3,23 6,24 16,25 13,28 6,29 1,32 37,34 6,35 1.9,36 0.088,37 5,38 54.5,39 56.083,40 61.559,41 36.205,42 37.357,43 11.3,44 5}
{0 CHEMBL559845,1 8.01,2 42.5,3 40,4 1.009,5 1.132,6 0.682,7 0.662,8 320.39,9 15,10 17,11 40,13 18,14 27,16 43,17 17,20 14,21 3,22 1,24 16,25 7,28 6,29 1,32 24,35 2.5,36 0.07,37 3,38 36.5,39 40.356,40 45.275,41 27.296,42 26.477,44 8.046}
{0 CHEMBL572878,1 7.617,2 37.7,3 45.9,4 1.001,5 1.136,6 0.668,7 0.629,8 464.66,9 13.1,10 17,11 61,13 18,14 37,16 65,17 23,20 14,21 9,22 1,24 28,25 10,26 1,28 8,29 1,31 1,32 33,35 1.6,36 0.108,37 7,38 46.5,39 61.054,40 69.268,41 40.762,42 38.341,44 5}
{0 CHEMBL572881,1 7.324,2 43.1,3 45.1,4 0.996,5 1.126,6 0.673,7 0.638,8 373.5,9 9.8,10 18,11 51,13 19,14 31,16 54,17 22,20 17,21 5,22 1,24 23,25 6,28 5,29 1,32 28,35 2,36 0.093,37 5,38 41,39 50.789,40 57.438,41 34.336,42 32.563,44 5}
{0 CHEMBL573339,1 8.295,2 45.2,3 38.1,4 1.016,5 1.122,6 0.689,7 0.676,8 348.39,9 9.5,10 21,11 42,13 21,14 30,16 46,17 19,20 15,21 4,24 16,25 7,28 4,29 3,32 26,35 7.1,36 0.043,37 2,38 40.5,39 42.691,40 47.113,41 28.955,42 28.391,44 5}
{0 CHEMBL574738,1 7.789,2 38.2,3 44.1,4 1.02,5 1.152,6 0.642,7 0.626,8 529.63,9 10.3,10 18,11 68,13 19,14 41,16 71,17 26,20 17,21 9,22 1,23 3,24 30,25 12,28 7,29 2,32 38,34 3,35 2.9,36 0.113,37 8,38 51,39 69.392,40 78.324,41 43.66,42 42.578,43 4.4,44 5}
{0 CHEMBL576982,1 7.788,2 40.3,3 44.4,4 1.007,5 1.127,6 0.672,7 0.639,8 560.74,9 8.3,10 25,11 72,13 26,14 45,16 77,17 29,20 19,21 10,22 1,24 32,25 11,26 1,28 6,29 4,31 1,32 40,35 5.6,36 0.104,37 8,38 58.5,39 72.483,40 81.145,41 48.398,42 46.023,44 5}
{0 CHEMBL601719,1 8.661,2 40.4,3 42.3,4 1.016,5 1.136,6 0.688,7 0.656,8 450.38,9 9.6,10 17,11 52,13 17,14 33,16 55,17 21,18 2,20 14,21 7,23 1,24 22,25 9,26 2,28 5,29 1,32 30,34 3,35 1.9,36 0.091,37 5,38 41.5,39 52.832,40 59.081,41 35.75,42 34.128,43 5.8,44 5}
{0 CHEMBL604712,1 7.683,2 38.8,3 44.9,4 1.019,5 1.148,6 0.641,7 0.623,8 376.45,9 8.2,10 11,11 49,13 13,14 29,16 51,17 19,20 11,21 8,22 2,23 2,24 22,25 8,28 4,29 2,32 27,34 2,35 4.1,36 0.059,37 3,38 36.5,39 49.923,40 56.243,41 31.421,42 30.55,43 4.1,44 5}
{0 CHEMBL608154,1 8.947,2 46.3,3 36.6,4 1.017,5 1.118,6 0.716,7 0.695,8 366.83,9 9.8,10 21,11 41,13 22,14 29,16 44,17 19,18 1,20 17,21 2,22 1,24 15,25 7,26 1,28 4,29 2,32 26,34 1,35 4.9,36 0.068,37 3,38 40.5,39 41.687,40 45.847,41 29.358,42 28.504,43 2.4,44 5}
{0 CHEMBL91829,1 7.438,2 44.4,3 44.4,4 1,5 1.121,6 0.675,7 0.644,8 468.6,9 6.3,10 20,11 63,13 23,14 40,16 68,17 28,20 20,21 8,22 3,24 28,25 7,28 4,29 3,32 35,35 4.8,36 0.029,37 2,38 53,39 62.992,40 70.604,41 42.523,42 40.552,44 5}
{0 CHEMBL939,1 8.126,2 40,3 43.6,4 1.017,5 1.136,6 0.665,7 0.641,8 446.95,9 7.3,10 17,11 55,13 17,14 34,16 58,17 22,18 1,20 14,21 8,23 1,24 24,25 9,26 1,28 4,29 3,32 31,34 2,35 5.5,36 0.138,37 8,38 42.5,39 55.945,40 62.472,41 36.557,42 35.236,43 3.6,44 5}
{0 CHEMBL941,1 7.26,2 42.6,3 45.6,4 0.995,5 1.128,6 0.671,7 0.635,8 493.67,9 10.3,10 24,11 68,13 25,14 41,16 72,17 29,20 22,21 7,22 1,24 31,25 8,28 7,29 1,32 37,35 1.5,36 0.097,37 7,38 54,39 67.643,40 76.68,41 45.631,42 43.186,44 5}
