{
  "data_features": {
    "feature": [
      {
        "data_type": "nominal",
        "index": "0",
        "is_ignore": "false",
        "is_row_identifier": "true",
        "is_target": "false",
        "name": "molecule_id",
        "nominal_value": [
          "CHEMBL109620",
          "CHEMBL111439",
          "CHEMBL112981",
          "CHEMBL113349",
          "CHEMBL132100",
          "CHEMBL139781",
          "CHEMBL140158",
          "CHEMBL140410",
          "CHEMBL140570",
          "CHEMBL141813",
          "CHEMBL142877",
          "CHEMBL143820",
          "CHEMBL158844",
          "CHEMBL160284",
          "CHEMBL160318",
          "CHEMBL160340",
          "CHEMBL1684824",
          "CHEMBL1684825",
          "CHEMBL1684826",
          "CHEMBL1684827",
          "CHEMBL1684828",
          "CHEMBL1684829",
          "CHEMBL1684830",
          "CHEMBL1684831",
          "CHEMBL1684832",
          "CHEMBL1684833",
          "CHEMBL1684834",
          "CHEMBL1684835",
          "CHEMBL1684836",
          "CHEMBL1684837",
          "CHEMBL1684838",
          "CHEMBL1684839",
          "CHEMBL1684840",
          "CHEMBL1684841",
          "CHEMBL1684842",
          "CHEMBL1684843",
          "CHEMBL1684844",
          "CHEMBL1684845",
          "CHEMBL1684846",
          "CHEMBL1684847",
          "CHEMBL1684848",
          "CHEMBL1684849",
          "CHEMBL1684993",
          "CHEMBL1684994",
          "CHEMBL1684995",
          "CHEMBL1684996",
          "CHEMBL1684997",
          "CHEMBL1684998",
          "CHEMBL1684999",
          "CHEMBL1685000",
          "CHEMBL1685001",
          "CHEMBL1685002",
          "CHEMBL1685003",
          "CHEMBL1685004",
          "CHEMBL1685005",
          "CHEMBL1685006",
          "CHEMBL1685007",
          "CHEMBL1685008",
          "CHEMBL1685009",
          "CHEMBL1685010",
          "CHEMBL1685011",
          "CHEMBL1685012",
          "CHEMBL1685013",
          "CHEMBL1685014",
          "CHEMBL1685015",
          "CHEMBL1685016",
          "CHEMBL1685017",
          "CHEMBL1685018",
          "CHEMBL1685021",
          "CHEMBL1685022",
          "CHEMBL1685023",
          "CHEMBL1685024",
          "CHEMBL1685025",
          "CHEMBL1685026",
          "CHEMBL1685027",
          "CHEMBL1685028",
          "CHEMBL1685029",
          "CHEMBL170843",
          "CHEMBL1761645",
          "CHEMBL1761646",
          "CHEMBL1761647",
          "CHEMBL1761648",
          "CHEMBL1761649",
          "CHEMBL1761650",
          "CHEMBL1761651",
          "CHEMBL1761652",
          "CHEMBL1761653",
          "CHEMBL1761654",
          "CHEMBL1761655",
          "CHEMBL1761656",
          "CHEMBL1761657",
          "CHEMBL1761658",
          "CHEMBL1761659",
          "CHEMBL1761660",
          "CHEMBL1761661",
          "CHEMBL1761662",
          "CHEMBL1761663",
          "CHEMBL1761664",
          "CHEMBL1777819",
          "CHEMBL1778339",
          "CHEMBL1778340",
          "CHEMBL1778341",
          "CHEMBL1778342",
          "CHEMBL1778343",
          "CHEMBL1778455",
          "CHEMBL2111970",
          "CHEMBL2112799",
          "CHEMBL2115091",
          "CHEMBL21986",
          "CHEMBL2364573",
          "CHEMBL24362",
          "CHEMBL258503",
          "CHEMBL258717",
          "CHEMBL259665",
          "CHEMBL261776",
          "CHEMBL263277",
          "CHEMBL265765",
          "CHEMBL280978",
          "CHEMBL292530",
          "CHEMBL300532",
          "CHEMBL302601",
          "CHEMBL303794",
          "CHEMBL308420",
          "CHEMBL313675",
          "CHEMBL313884",
          "CHEMBL315074",
          "CHEMBL315705",
          "CHEMBL316436",
          "CHEMBL324526",
          "CHEMBL330511",
          "CHEMBL330577",
          "CHEMBL335369",
          "CHEMBL335394",
          "CHEMBL337655",
          "CHEMBL341795",
          "CHEMBL341976",
          "CHEMBL342236",
          "CHEMBL343293",
          "CHEMBL344212",
          "CHEMBL351151",
          "CHEMBL356514",
          "CHEMBL405407",
          "CHEMBL405590",
          "CHEMBL406774",
          "CHEMBL40991",
          "CHEMBL422638",
          "CHEMBL432033",
          "CHEMBL434494",
          "CHEMBL435224",
          "CHEMBL436588",
          "CHEMBL436691",
          "CHEMBL441322",
          "CHEMBL445291",
          "CHEMBL447414",
          "CHEMBL449115",
          "CHEMBL453439",
          "CHEMBL460718",
          "CHEMBL460895",
          "CHEMBL460896",
          "CHEMBL460912",
          "CHEMBL461778",
          "CHEMBL461788",
          "CHEMBL461965",
          "CHEMBL462651",
          "CHEMBL473343",
          "CHEMBL473344",
          "CHEMBL473737",
          "CHEMBL473738",
          "CHEMBL473739",
          "CHEMBL473741",
          "CHEMBL473742",
          "CHEMBL473934",
          "CHEMBL473937",
          "CHEMBL474135",
          "CHEMBL478348",
          "CHEMBL478981",
          "CHEMBL489113",
          "CHEMBL490300",
          "CHEMBL490494",
          "CHEMBL490690",
          "CHEMBL490890",
          "CHEMBL491874",
          "CHEMBL491875",
          "CHEMBL495623",
          "CHEMBL495624",
          "CHEMBL496801",
          "CHEMBL496802",
          "CHEMBL496803",
          "CHEMBL497410",
          "CHEMBL497616",
          "CHEMBL497617",
          "CHEMBL497618",
          "CHEMBL497634",
          "CHEMBL497635",
          "CHEMBL497815",
          "CHEMBL498628",
          "CHEMBL499922",
          "CHEMBL505374",
          "CHEMBL507677",
          "CHEMBL508773",
          "CHEMBL513622",
          "CHEMBL513790",
          "CHEMBL514788",
          "CHEMBL515716",
          "CHEMBL516044",
          "CHEMBL516975",
          "CHEMBL522608",
          "CHEMBL523897",
          "CHEMBL524084",
          "CHEMBL525377",
          "CHEMBL52620",
          "CHEMBL54714",
          "CHEMBL55959",
          "CHEMBL56078",
          "CHEMBL561057",
          "CHEMBL59440",
          "CHEMBL59729",
          "CHEMBL59981",
          "CHEMBL60151",
          "CHEMBL61935",
          "CHEMBL61985",
          "CHEMBL633",
          "CHEMBL67533",
          "CHEMBL68668",
          "CHEMBL69330",
          "CHEMBL78510",
          "CHEMBL79827",
          "CHEMBL80021",
          "CHEMBL81657",
          "CHEMBL86319",
          "CHEMBL87405",
          "CHEMBL87902",
          "CHEMBL88601",
          "CHEMBL89073",
          "CHEMBL89470",
          "CHEMBL89566",
          "CHEMBL91722"
        ],
        "number_of_missing_values": "0"
      },
      {
        "data_type": "numeric",
        "index": "1",
        "is_ignore": "false",
        "is_row_identifier": "false",
        "is_target": "false",
        "name": "AMW",
        "number_of_missing_values": "0"
      },
      {
        "data_type": "numeric",
        "index": "2",
        "is_ignore": "false",
        "is_row_identifier": "false",
        "is_target": "false",
        "name": "C.",
        "number_of_missing_values": "0"
      },
      {
        "data_type": "numeric",
        "index": "3",
        "is_ignore": "false",
        "is_row_identifier": "false",
        "is_target": "false",
        "name": "H.",
        "number_of_missing_values": "0"
      },
      {
        "data_type": "numeric",
        "index": "4",
        "is_ignore": "false",
        "is_row_identifier": "false",
        "is_target": "false",
        "name": "Me",
        "number_of_missing_values": "0"
      },
      {
        "data_type": "numeric",
        "index": "5",
        "is_ignore": "false",
        "is_row_identifier": "false",
        "is_target": "false",
        "name": "Mi",
        "number_of_missing_values": "0"
      },
      {
        "data_type": "numeric",
        "index": "6",
        "is_ignore": "false",
        "is_row_identifier": "false",
        "is_target": "false",
        "name": "Mp",
        "number_of_missing_values": "0"
      },
      {
        "data_type": "numeric",
        "index": "7",
        "is_ignore": "false",
        "is_row_identifier": "false",
        "is_target": "false",
        "name": "Mv",
        "number_of_missing_values": "0"
      },
      {
        "data_type": "numeric",
        "index": "8",
        "is_ignore": "false",
        "is_row_identifier": "false",
        "is_target": "false",
        "name": "MW",
        "number_of_missing_values": "0"
      },
      {
        "data_type": "numeric",
        "index": "9",
        "is_ignore": "false",
        "is_row_identifier": "false",
        "is_target": "false",
        "name": "N.",
        "number_of_missing_values": "0"
      },
      {
        "data_type": "numeric",
        "index": "10",
        "is_ignore": "false",
        "is_row_identifier": "false",
        "is_target": "false",
        "name": "nAB",
        "number_of_missing_values": "0"
      },
      {
        "data_type": "numeric",
        "index": "11",
        "is_ignore": "false",
        "is_row_identifier": "false",
        "is_target": "false",
        "name": "nAT",
        "number_of_missing_values": "0"
      },
      {
        "data_type": "numeric",
        "index": "12",
        "is_ignore": "false",
        "is_row_identifier": "false",
        "is_target": "false",
        "name": "nB",
        "number_of_missing_values": "0"
      },
      {
        "data_type": "numeric",
        "index": "13",
        "is_ignore": "false",
        "is_row_identifier": "false",
        "is_target": "false",
        "name": "nBM",
        "number_of_missing_values": "0"
      },
      {
        "data_type": "numeric",
        "index": "14",
        "is_ignore": "false",
        "is_row_identifier": "false",
        "is_target": "false",
        "name": "nBO",
        "number_of_missing_values": "0"
      },
      {
        "data_type": "numeric",
        "index": "15",
        "is_ignore": "false",
        "is_row_identifier": "false",
        "is_target": "false",
        "name": "nBR",
        "number_of_missing_values": "0"
      },
      {
        "data_type": "numeric",
        "index": "16",
        "is_ignore": "false",
        "is_row_identifier": "false",
        "is_target": "false",
        "name": "nBT",
        "number_of_missing_values": "0"
      },
      {
        "data_type": "numeric",
        "index": "17",
        "is_ignore": "false",
        "is_row_identifier": "false",
        "is_target": "false",
        "name": "nC",
        "number_of_missing_values": "0"
      },
      {
        "data_type": "numeric",
        "index": "18",
        "is_ignore": "false",
        "is_row_identifier": "false",
        "is_target": "false",
        "name": "nCL",
        "number_of_missing_values": "0"
      },
      {
        "data_type": "numeric",
        "index": "19",
        "is_ignore": "false",
        "is_row_identifier": "false",
        "is_target": "false",
        "name": "nCsp",
        "number_of_missing_values": "0"
      },
      {
        "data_type": "numeric",
        "index": "20",
        "is_ignore": "false",
        "is_row_identifier": "false",
        "is_target": "false",
        "name": "nCsp2",
        "number_of_missing_values": "0"
      },
      {
        "data_type": "numeric",
        "index": "21",
        "is_ignore": "false",
        "is_row_identifier": "false",
        "is_target": "false",
        "name": "nCsp3",
        "number_of_missing_values": "0"
      },
      {
        "data_type": "numeric",
        "index": "22",
        "is_ignore": "false",
        "is_row_identifier": "false",
        "is_target": "false",
        "name": "nDB",
        "number_of_missing_values": "0"
      },
      {
        "data_type": "numeric",
        "index": "23",
        "is_ignore": "false",
        "is_row_identifier": "false",
        "is_target": "false",
        "name": "nF",
        "number_of_missing_values": "0"
      },
      {
        "data_type": "numeric",
        "index": "24",
        "is_ignore": "false",
        "is_row_identifier": "false",
        "is_target": "false",
        "name": "nH",
        "number_of_missing_values": "0"
      },
      {
        "data_type": "numeric",
        "index": "25",
        "is_ignore": "false",
        "is_row_identifier": "false",
        "is_target": "false",
        "name": "nHet",
        "number_of_missing_values": "0"
      },
      {
        "data_type": "numeric",
        "index": "26",
        "is_ignore": "false",
        "is_row_identifier": "false",
        "is_target": "false",
        "name": "nHM",
        "number_of_missing_values": "0"
      },
      {
        "data_type": "numeric",
        "index": "27",
        "is_ignore": "false",
        "is_row_identifier": "false",
        "is_target": "false",
        "name": "nI",
        "number_of_missing_values": "0"
      },
      {
        "data_type": "numeric",
        "index": "28",
        "is_ignore": "false",
        "is_row_identifier": "false",
        "is_target": "false",
        "name": "nN",
        "number_of_missing_values": "0"
      },
      {
        "data_type": "numeric",
        "index": "29",
        "is_ignore": "false",
        "is_row_identifier": "false",
        "is_target": "false",
        "name": "nO",
        "number_of_missing_values": "0"
      },
      {
        "data_type": "numeric",
        "index": "30",
        "is_ignore": "false",
        "is_row_identifier": "false",
        "is_target": "false",
        "name": "nP",
        "number_of_missing_values": "0"
      },
      {
        "data_type": "numeric",
        "index": "31",
        "is_ignore": "false",
        "is_row_identifier": "false",
        "is_target": "false",
        "name": "nS",
        "number_of_missing_values": "0"
      },
      {
        "data_type": "numeric",
        "index": "32",
        "is_ignore": "false",
        "is_row_identifier": "false",
        "is_target": "false",
        "name": "nSK",
        "number_of_missing_values": "0"
      },
      {
        "data_type": "numeric",
        "index": "33",
        "is_ignore": "false",
        "is_row_identifier": "false",
        "is_target": "false",
        "name": "nTB",
        "number_of_missing_values": "0"
      },
      {
        "data_type": "numeric",
        "index": "34",
        "is_ignore": "false",
        "is_row_identifier": "false",
        "is_target": "false",
        "name": "nX",
        "number_of_missing_values": "0"
      },
      {
        "data_type": "numeric",
        "index": "35",
        "is_ignore": "false",
        "is_row_identifier": "false",
        "is_target": "false",
        "name": "O.",
        "number_of_missing_values": "0"
      },
      {
        "data_type": "numeric",
        "index": "36",
        "is_ignore": "false",
        "is_row_identifier": "false",
        "is_target": "false",
        "name": "RBF",
        "number_of_missing_values": "0"
      },
      {
        "data_type": "numeric",
        "index": "37",
        "is_ignore": "false",
        "is_row_identifier": "false",
        "is_target": "false",
        "name": "RBN",
        "number_of_missing_values": "0"
      },
      {
        "data_type": "numeric",
        "index": "38",
        "is_ignore": "false",
        "is_row_identifier": "false",
        "is_target": "false",
        "name": "SCBO",
        "number_of_missing_values": "0"
      },
      {
        "data_type": "numeric",
        "index": "39",
        "is_ignore": "false",
        "is_row_identifier": "false",
        "is_target": "false",
        "name": "Se",
        "number_of_missing_values": "0"
      },
      {
        "data_type": "numeric",
        "index": "40",
        "is_ignore": "false",
        "is_row_identifier": "false",
        "is_target": "false",
        "name": "Si",
        "number_of_missing_values": "0"
      },
      {
        "data_type": "numeric",
        "index": "41",
        "is_ignore": "false",
        "is_row_identifier": "false",
        "is_target": "false",
        "name": "Sp",
        "number_of_missing_values": "0"
      },
      {
        "data_type": "numeric",
        "index": "42",
        "is_ignore": "false",
        "is_row_identifier": "false",
        "is_target": "false",
        "name": "Sv",
        "number_of_missing_values": "0"
      },
      {
        "data_type": "numeric",
        "index": "43",
        "is_ignore": "false",
        "is_row_identifier": "false",
        "is_target": "false",
        "name": "X.",
        "number_of_missing_values": "0"
      },
      {
        "data_type": "numeric",
        "index": "44",
        "is_ignore": "false",
        "is_row_identifier": "false",
        "is_target": "true",
        "name": "pXC50",
        "number_of_missing_values": "0"
      }
    ]
  }
}