"molecule_id","CATS2D_02_AL","GATS4s","Eig04_AEA.dm.","CATS2D_04_DL","MATS1m","SpMax5_Bh.m.","GATS4e","nX","SssNH","ATS3m","AAC","AECC","ALOGP","ALOGP2","AMR","AMW","ARR","ATS1e","ATS1i","ATS1m","ATS1p","ATS1s","ATS1v","ATS2e","ATS2i","ATS2m","ATS2p","ATS2s","ATS2v","ATS3e","ATS3i","ATS3p","ATS3s","ATS3v","ATS4e","ATS4i","ATS4m","ATS4p","ATS4s","ATS4v","ATS5e","ATS5i","ATS5m","ATS5p","ATS5s","ATS5v","ATS6e","ATS6i","ATS6m","ATS6p","ATS6s","ATS6v","ATS7e","ATS7i","ATS7m","ATS7p","ATS7s","pXC50"
{1 9,2 0.924,3 2.934,5 0.001,6 3.571,7 0.832,8 6,10 4.243,11 1.996,12 8.793,13 6.181,14 38.199,15 106.196,16 11.517,17 0.581,18 3.828,19 3.904,20 3.738,21 3.456,22 5.142,23 3.47,24 4.345,25 4.454,26 4.238,27 3.815,28 6.154,29 3.829,30 4.53,31 4.662,32 3.952,33 5.953,34 3.929,35 4.627,36 4.778,37 4.404,38 3.917,39 6.128,40 3.93,41 4.675,42 4.816,43 4.478,44 3.948,45 6.531,46 3.976,47 4.615,48 4.733,49 4.376,50 4.038,51 6.133,52 4.026,53 4.71,54 4.865,55 4.401,56 4.069,57 6.187,58 5.569}
{0 CHEMBL131636,1 8,2 1.094,3 3.569,4 1,6 3.408,7 1.128,8 7,9 1.895,10 4.218,11 2.083,12 11.516,13 5.189,14 26.923,15 98.452,16 10.44,17 0.375,18 3.943,19 4.03,20 3.737,21 3.398,22 5.301,23 3.466,24 4.521,25 4.651,26 4.271,27 3.722,28 6.572,29 3.804,30 4.641,31 4.804,32 3.836,33 6.181,34 3.892,35 4.761,36 4.927,37 4.28,38 3.772,39 6.363,40 3.887,41 4.709,42 4.842,43 4.463,44 3.693,45 6.723,46 3.848,47 4.617,48 4.751,49 4.177,50 3.678,51 6.501,52 3.771,53 4.556,54 4.695,55 4.121,56 3.702,57 6.408,58 6.921}
{0 CHEMBL131741,1 3,2 0.857,3 2.97,4 3,5 -0.002,6 3.381,7 0.873,8 5,9 2.3,10 4.038,11 2.098,12 8.792,13 4.219,14 17.798,15 85.563,16 10.834,17 0.48,18 3.693,19 3.793,20 3.539,21 3.201,22 5.014,23 3.238,24 4.221,25 4.375,26 4.034,27 3.551,28 6.067,29 3.591,30 4.337,31 4.467,32 3.671,33 5.857,34 3.679,35 4.468,36 4.667,37 4.188,38 3.579,39 6.019,40 3.632,41 4.364,42 4.509,43 3.989,44 3.474,45 6.311,46 3.522,47 4.219,48 4.377,49 3.913,50 3.404,51 5.882,52 3.456,53 4.318,54 4.516,55 3.763,56 3.302,57 5.969,58 5}
{0 CHEMBL131789,1 9,2 0.894,3 2.918,4 1,5 0.004,6 3.144,7 0.782,8 4,9 2.318,10 3.953,11 2.112,12 8.875,13 3.03,14 9.178,15 80.004,16 10.335,17 0.48,18 3.707,19 3.789,20 3.505,21 3.147,22 5.063,23 3.218,24 4.227,25 4.354,26 3.976,27 3.436,28 6.096,29 3.532,30 4.261,31 4.368,32 3.567,33 5.802,34 3.631,35 4.405,36 4.542,37 4.022,38 3.565,39 5.979,40 3.631,41 4.513,42 4.687,43 4.149,44 3.46,45 6.441,46 3.554,47 4.215,48 4.359,49 3.677,50 3.346,51 5.731,52 3.381,53 4.202,54 4.405,55 3.594,56 3.313,57 5.595,58 5.796}
{0 CHEMBL131976,1 6,2 1.144,3 3.498,4 2,5 -0.038,6 3.37,7 1.146,8 7,9 1.828,10 4.112,11 2.191,12 9.111,13 3.007,14 9.041,15 81.632,16 12.138,17 0.429,18 3.709,19 3.793,20 3.608,21 3.164,22 5.201,23 3.272,24 4.247,25 4.346,26 4.185,27 3.493,28 6.517,29 3.627,30 4.341,31 4.447,32 3.619,33 6.088,34 3.722,35 4.511,36 4.658,37 4.163,38 3.555,39 6.246,40 3.706,41 4.493,42 4.628,43 4.355,44 3.425,45 6.646,46 3.628,47 4.334,48 4.477,49 3.984,50 3.308,51 6.414,52 3.464,53 4.227,54 4.38,55 3.854,56 3.237,57 6.299,58 5.523}
{0 CHEMBL132257,1 6,2 1.041,3 3.548,4 3,5 -0.007,6 3.408,7 1.033,8 7,9 4.347,10 4.215,11 2.063,12 11.516,13 4.541,14 20.624,15 100.402,16 10.192,17 0.375,18 3.958,19 4.06,20 3.731,21 3.417,22 5.297,23 3.475,24 4.532,25 4.678,26 4.266,27 3.753,28 6.559,29 3.818,30 4.68,31 4.861,32 3.875,33 6.191,34 3.912,35 4.791,36 4.978,37 4.276,38 3.821,39 6.36,40 3.91,41 4.756,42 4.918,43 4.46,44 3.75,45 6.724,46 3.873,47 4.659,48 4.826,49 4.166,50 3.725,51 6.472,52 3.795,53 4.621,54 4.782,55 4.123,56 3.733,57 6.439,58 5}
{0 CHEMBL133044,1 3,2 0.96,3 2.623,4 3,5 -0.012,6 3.264,7 0.908,8 5,9 2.265,10 3.89,11 2.161,12 7.571,13 3.536,14 12.5,15 71.221,16 12.449,17 0.545,18 3.465,19 3.541,20 3.418,21 3.034,22 4.877,23 3.087,24 3.965,25 4.063,26 3.919,27 3.375,28 5.986,29 3.431,30 4.097,31 4.208,32 3.457,33 5.708,34 3.478,35 4.118,36 4.253,37 4.068,38 3.299,39 5.875,40 3.39,41 4.098,42 4.241,43 3.752,44 3.111,45 6.196,46 3.208,47 3.691,48 3.803,49 3.55,50 3.019,51 5.41,52 3.068,53 3.673,54 3.815,55 3.526,56 3.006,57 5.287,58 5}
{0 CHEMBL133159,1 3,2 0.842,3 2.834,4 6,5 -0.007,6 3.387,7 0.825,8 5,9 5.037,10 4.152,11 1.974,12 11.517,13 5.449,14 29.689,15 105.941,16 10.506,17 0.581,18 3.872,19 3.968,20 3.7,21 3.452,22 5.169,23 3.472,24 4.377,25 4.501,26 4.166,27 3.809,28 6.159,29 3.819,30 4.571,31 4.731,32 3.898,33 5.971,34 3.876,35 4.6,36 4.786,37 4.28,38 3.772,39 6.091,40 3.796,41 4.57,42 4.75,43 4.129,44 3.668,45 6.414,46 3.706,47 4.395,48 4.563,49 4.036,50 3.639,51 5.944,52 3.676,53 4.41,54 4.575,55 4.024,56 3.65,57 5.947,58 5}
{0 CHEMBL133940,1 9,2 0.961,3 3.57,4 1,5 0.003,6 3.423,7 1.023,8 7,9 1.932,10 4.297,11 2.034,12 11.636,13 5.718,14 32.699,15 105.592,16 10.119,17 0.343,18 4.034,19 4.122,20 3.81,21 3.516,22 5.331,23 3.57,24 4.64,25 4.769,26 4.352,27 3.89,28 6.599,29 3.945,30 4.845,31 5.026,32 4.018,33 6.259,34 4.038,35 4.92,36 5.11,37 4.335,38 3.916,39 6.417,40 3.993,41 4.803,42 4.946,43 4.515,44 3.81,45 6.764,46 3.943,47 4.706,48 4.835,49 4.246,50 3.818,51 6.541,52 3.891,53 4.683,54 4.836,55 4.208,56 3.871,57 6.431,58 5.921}
{0 CHEMBL134490,1 8,2 1.208,3 3.569,4 1,5 -0.006,6 3.388,7 1.206,8 7,9 1.87,10 4.172,11 2.151,12 10.276,13 4.209,14 17.714,15 89.327,16 11.327,17 0.4,18 3.825,19 3.901,20 3.679,21 3.273,22 5.247,23 3.366,24 4.389,25 4.501,26 4.233,27 3.584,28 6.547,29 3.704,30 4.466,31 4.592,32 3.7,33 6.125,34 3.797,35 4.6,36 4.731,37 4.238,38 3.655,39 6.311,40 3.806,41 4.593,42 4.706,43 4.42,44 3.587,45 6.692,46 3.764,47 4.516,48 4.654,49 4.1,50 3.545,51 6.441,52 3.651,53 4.414,54 4.559,55 4.038,56 3.516,57 6.337,58 6.824}
{0 CHEMBL134522,1 3,2 0.997,3 2.84,4 3,5 -0.008,6 3.337,7 0.981,8 5,9 2.261,10 3.989,11 2.192,12 8.696,13 4.04,14 16.323,15 77.598,16 11.811,17 0.5,18 3.598,19 3.672,20 3.507,21 3.111,22 4.984,23 3.172,24 4.111,25 4.218,26 4.001,27 3.443,28 6.06,29 3.507,30 4.19,31 4.297,32 3.534,33 5.787,34 3.573,35 4.265,36 4.403,37 4.153,38 3.424,39 5.947,40 3.523,41 4.261,42 4.381,43 3.958,44 3.305,45 6.346,46 3.398,47 4.002,48 4.129,49 3.789,50 3.228,51 5.735,52 3.292,53 4.056,54 4.224,55 3.671,56 3.162,57 5.701,58 5}
{0 CHEMBL134576,1 3,2 1.026,3 2.683,4 4,5 -0.035,6 3.3,7 0.958,8 5,9 2.202,10 3.943,11 2.235,12 8.091,13 3.789,14 14.358,15 72.829,16 12.575,17 0.522,18 3.515,19 3.582,20 3.461,21 3.046,22 4.964,23 3.115,24 3.999,25 4.084,26 3.977,27 3.391,28 6.06,29 3.461,30 4.145,31 4.254,32 3.477,33 5.781,34 3.518,35 4.166,36 4.287,37 4.114,38 3.333,39 5.916,40 3.441,41 4.175,42 4.295,43 3.911,44 3.157,45 6.429,46 3.283,47 3.831,48 3.945,49 3.648,50 3.059,51 5.69,52 3.133,53 3.748,54 3.879,55 3.571,56 3.031,57 5.391,58 5}
{0 CHEMBL134603,1 5,2 1.094,3 2.921,4 2,5 -0.014,6 3.425,7 1.07,8 7,9 2.209,10 4.348,11 2.217,12 8.783,13 5.056,14 25.558,15 81.492,16 15,17 0.5,18 3.485,19 3.538,20 3.59,21 3.113,22 4.926,23 3.159,24 3.991,25 4.059,26 4.14,27 3.466,28 6.044,29 3.521,30 4.131,31 4.203,32 3.619,33 5.853,34 3.625,35 4.148,36 4.247,37 4.216,38 3.423,39 5.915,40 3.49,41 4.132,42 4.235,43 4.134,44 3.205,45 6.353,46 3.324,47 3.726,48 3.797,49 3.808,50 3.117,51 5.552,52 3.168,53 3.707,54 3.809,55 3.779,56 3.12,57 5.44,58 6.046}
{0 CHEMBL134773,1 5,2 0.985,3 2.171,4 1,5 -0.002,6 2.982,7 0.945,8 4,9 2.37,10 3.641,11 2.072,12 7.833,13 2.814,14 7.921,15 61.173,16 9.713,17 0.333,18 3.479,19 3.594,20 3.218,21 2.915,22 4.757,23 2.951,24 4.049,25 4.226,26 3.711,27 3.208,28 5.946,29 3.246,30 4.171,31 4.392,32 3.289,33 5.597,34 3.294,35 4.185,36 4.384,37 3.696,38 3.182,39 5.742,40 3.252,41 4.178,42 4.371,43 3.884,44 3.007,45 6.281,46 3.12,47 3.803,48 4.008,49 3.175,50 2.853,51 5.24,52 2.847,53 3.774,54 3.989,55 2.881,56 2.771,57 5.14,58 5}
{0 CHEMBL134776,1 3,2 0.873,3 2.844,4 5,5 -0.011,6 3.385,7 0.839,8 5,9 4.972,10 4.13,11 2.007,12 10.679,13 5.607,14 31.435,15 99.621,16 10.955,17 0.6,18 3.81,19 3.901,20 3.67,21 3.394,22 5.14,23 3.423,24 4.302,25 4.412,26 4.147,27 3.746,28 6.14,29 3.769,30 4.493,31 4.646,32 3.825,33 5.945,34 3.821,35 4.497,36 4.665,37 4.272,38 3.697,39 6.057,40 3.744,41 4.484,42 4.649,43 4.12,44 3.601,45 6.401,46 3.667,47 4.293,48 4.434,49 4.008,50 3.596,51 5.913,52 3.642,53 4.314,54 4.46,55 4.033,56 3.598,57 5.921,58 5}
{0 CHEMBL134863,1 3,2 0.989,3 2.623,4 4,5 -0.031,6 3.315,7 0.912,8 5,9 2.243,10 3.941,11 2.188,12 8.091,13 3.31,14 10.956,15 75.835,16 12.108,17 0.522,18 3.538,19 3.63,20 3.459,21 3.068,22 4.955,23 3.127,24 4.025,25 4.131,26 3.971,27 3.416,28 6.038,29 3.474,30 4.174,31 4.299,32 3.502,33 5.777,34 3.532,35 4.188,36 4.323,37 4.111,38 3.374,39 5.905,40 3.461,41 4.204,42 4.353,43 3.896,44 3.208,45 6.349,46 3.309,47 3.927,48 4.072,49 3.65,50 3.101,51 5.712,52 3.169,53 3.795,54 3.943,55 3.572,56 3.062,57 5.409,58 5}
{0 CHEMBL134876,1 3,2 0.696,3 2.844,4 5,5 -0.001,6 3.385,7 0.701,8 5,9 5.28,10 4.152,11 1.952,12 10.679,13 5.724,14 32.76,15 102.342,16 9.629,17 0.4,18 3.928,19 4.038,20 3.683,21 3.468,22 5.115,23 3.474,24 4.507,25 4.661,26 4.165,27 3.869,28 6.155,29 3.851,30 4.779,31 4.995,32 3.984,33 6.007,34 3.925,35 4.768,36 4.999,37 4.289,38 3.849,39 6.12,40 3.838,41 4.67,42 4.88,43 4.134,44 3.708,45 6.432,46 3.735,47 4.454,48 4.623,49 4.026,50 3.698,51 5.931,52 3.712,53 4.514,54 4.691,55 4.057,56 3.715,57 5.953,58 5}
{0 CHEMBL134990,1 5,2 1.045,3 2.778,4 1,5 -0.009,6 2.943,7 1.004,8 4,9 2.367,10 3.777,11 2.265,12 7.9,13 2.994,14 8.966,15 70.129,16 11.916,17 0.524,18 3.46,19 3.538,20 3.433,21 3.055,22 4.824,23 3.066,24 3.976,25 4.088,26 3.976,27 3.385,28 5.97,29 3.4,30 4.007,31 4.115,32 3.386,33 5.606,34 3.375,35 4.07,36 4.206,37 3.853,38 3.249,39 5.747,40 3.323,41 4.082,42 4.229,43 4.019,44 3.088,45 6.294,46 3.206,47 3.671,48 3.803,49 3.53,50 3.013,51 5.254,52 3,53 3.627,54 3.741,55 3.56,56 2.922,57 5.225,58 5.553}
{0 CHEMBL135133,1 5,2 1.132,3 2.922,4 1,5 -0.015,6 3.246,7 1.168,8 7,9 2.039,10 3.983,11 2.111,12 9.625,13 4.005,14 16.037,15 73.051,16 12.322,17 0.48,18 3.586,19 3.663,20 3.505,21 3.068,22 5.048,23 3.168,24 4.143,25 4.243,26 4.089,27 3.38,28 6.438,29 3.512,30 4.208,31 4.331,32 3.476,33 5.935,34 3.573,35 4.349,36 4.503,37 4.001,38 3.357,39 6.137,40 3.512,41 4.287,42 4.444,43 4.078,44 3.143,45 6.458,46 3.338,47 3.797,48 3.922,49 3.559,50 3.014,51 5.555,52 3.104,53 3.857,54 4.012,55 3.494,56 3.005,57 5.531,58 6.31}
{0 CHEMBL334485,1 5,2 1.034,3 2.919,4 3,5 -0.013,6 3.382,7 0.978,8 6,9 2.241,10 4.001,11 2.203,12 8.091,13 4.391,14 19.282,15 76.687,16 13.724,17 0.522,18 3.475,19 3.539,20 3.508,21 3.074,22 4.898,23 3.124,24 3.979,25 4.061,26 4.044,27 3.411,28 6.029,29 3.471,30 4.107,31 4.207,32 3.51,33 5.741,34 3.528,35 4.134,36 4.25,37 4.165,38 3.372,39 5.886,40 3.451,41 4.126,42 4.236,43 4.079,44 3.183,45 6.341,46 3.302,47 3.711,48 3.8,49 3.737,50 3.064,51 5.531,52 3.123,53 3.689,54 3.812,55 3.614,56 3.063,57 5.322,58 6.301}
{0 CHEMBL335080,1 3,2 0.829,3 2.703,4 5,5 -0.005,6 3.384,7 0.817,8 5,9 5.016,10 4.062,11 2.007,12 10.538,13 5.194,14 26.978,15 95.202,16 9.933,17 0.444,18 3.827,19 3.938,20 3.6,21 3.343,22 5.076,23 3.358,24 4.369,25 4.529,26 4.07,27 3.694,28 6.113,29 3.693,30 4.563,31 4.765,32 3.783,33 5.913,34 3.755,35 4.556,36 4.757,37 4.23,38 3.677,39 6.044,40 3.707,41 4.541,42 4.733,43 4.056,44 3.582,45 6.386,46 3.62,47 4.35,48 4.523,49 3.942,50 3.553,51 5.885,52 3.577,53 4.393,54 4.58,55 3.911,56 3.544,57 5.887,58 5}
{0 CHEMBL335655,1 5,2 0.751,3 3.093,4 3,5 0.003,6 3.384,7 0.776,8 5,9 2.35,10 4.144,11 1.991,12 10.037,13 5.136,14 26.378,15 97.704,16 9.982,17 0.414,18 3.87,19 3.975,20 3.657,21 3.404,22 5.078,23 3.419,24 4.447,25 4.603,26 4.143,27 3.797,28 6.131,29 3.796,30 4.68,31 4.88,32 3.917,33 5.963,34 3.879,35 4.684,36 4.899,37 4.283,38 3.794,39 6.1,40 3.808,41 4.593,42 4.78,43 4.111,44 3.684,45 6.388,46 3.714,47 4.41,48 4.566,49 4.042,50 3.664,51 5.91,52 3.687,53 4.538,54 4.724,55 4.038,56 3.614,57 6.078,58 5.398}
{0 CHEMBL335697,1 8,2 1.088,3 2.778,4 1,5 -0.007,6 2.94,7 1.129,8 4,9 2.12,10 3.737,11 2.259,12 7.9,13 1.924,14 3.7,15 62.364,16 11.794,17 0.524,18 3.458,19 3.538,20 3.353,21 2.885,22 4.895,23 2.987,24 3.963,25 4.08,26 3.866,27 3.172,28 6.001,29 3.304,30 3.984,31 4.106,32 3.186,33 5.649,34 3.295,35 4.066,36 4.195,37 3.786,38 3.103,39 5.8,40 3.256,41 4.019,42 4.14,43 3.975,44 2.893,45 6.311,46 3.126,47 3.651,48 3.787,49 3.391,50 2.767,51 5.298,52 2.882,53 3.631,54 3.756,55 3.328,56 2.674,57 5.452,58 5.42}
{0 CHEMBL335703,1 5,2 0.831,3 2.914,4 1,5 -0.001,6 3.067,7 0.845,8 4,9 2.465,10 3.895,11 1.988,12 8,13 4.035,14 16.279,15 77.16,16 9.992,17 0.522,18 3.622,19 3.723,20 3.4,21 3.155,22 4.936,23 3.183,24 4.149,25 4.296,26 3.908,27 3.481,28 6.023,29 3.52,30 4.249,31 4.385,32 3.611,33 5.748,34 3.624,35 4.431,36 4.613,37 3.91,38 3.586,39 5.911,40 3.609,41 4.478,42 4.676,43 4.068,44 3.465,45 6.418,46 3.5,47 4.191,48 4.407,49 3.513,50 3.291,51 5.597,52 3.28,53 3.922,54 4.06,55 3.494,56 3.25,57 5.342,58 5}
{0 CHEMBL336099,1 10,2 1.165,3 2.919,4 2,5 -0.023,6 3.379,7 1.104,8 6,9 2.09,10 3.989,11 2.28,12 8.091,13 3.552,14 12.615,15 75.42,16 14.901,17 0.522,18 3.436,19 3.502,20 3.522,21 2.964,22 4.918,23 3.056,24 3.935,25 4.022,26 4.079,27 3.25,28 6.07,29 3.375,30 3.976,31 4.069,32 3.358,33 5.692,34 3.435,35 4.039,36 4.127,37 4.177,38 3.265,39 5.903,40 3.388,41 4.062,42 4.171,43 4.079,44 3.072,45 6.325,46 3.236,47 3.644,48 3.73,49 3.753,50 2.922,51 5.572,52 3.034,53 3.554,54 3.664,55 3.635,56 2.91,57 5.381,58 6.301}
{0 CHEMBL336546,1 5,2 1.237,3 3.571,4 1,5 -0.019,6 3.382,7 1.271,8 10,9 1.553,10 4.177,11 2.069,12 9.179,13 4.947,14 24.472,15 79.025,16 13.263,17 0.414,18 3.701,19 3.771,20 3.662,21 3.138,22 5.218,23 3.274,24 4.301,25 4.395,26 4.301,27 3.462,28 6.753,29 3.643,30 4.333,31 4.435,32 3.582,33 6.159,34 3.722,35 4.549,36 4.701,37 4.231,38 3.5,39 6.354,40 3.709,41 4.477,42 4.592,43 4.438,44 3.343,45 6.712,46 3.627,47 4.429,48 4.578,49 4.197,50 3.218,51 6.861,52 3.469,53 4.082,54 4.177,55 3.94,56 3.145,57 6.397,58 7.301}
{0 CHEMBL337482,1 8,2 0.948,3 3.569,4 1,5 0.006,6 3.467,7 0.97,8 7,9 1.924,10 4.295,11 1.952,12 14.6,13 7.014,14 49.189,15 116.856,16 9.227,17 0.333,18 4.145,19 4.248,20 3.842,21 3.61,22 5.4,23 3.64,24 4.741,25 4.897,26 4.344,27 3.952,28 6.622,29 3.977,30 4.92,31 5.128,32 4.073,33 6.278,34 4.066,35 5.012,36 5.218,37 4.353,38 4.023,39 6.442,40 4.062,41 4.971,42 5.155,43 4.528,44 3.956,45 6.783,46 4.025,47 4.907,48 5.098,49 4.261,50 3.923,51 6.577,52 3.949,53 4.819,54 5.003,55 4.225,56 3.921,57 6.49,58 5.921}
{0 CHEMBL337516,1 8,2 1.075,3 2.926,5 -0.002,6 3.426,7 0.958,8 6,10 4.079,11 2.173,12 8.043,13 4.597,14 21.132,15 81.584,16 12.819,17 0.5,18 3.561,19 3.632,20 3.546,21 3.143,22 4.941,23 3.181,24 4.086,25 4.199,26 4.081,27 3.487,28 6.044,29 3.539,30 4.2,31 4.297,32 3.634,33 5.798,34 3.648,35 4.317,36 4.431,37 4.239,38 3.584,39 5.985,40 3.632,41 4.37,42 4.508,43 4.243,44 3.507,45 6.396,46 3.559,47 4.148,48 4.285,49 3.91,50 3.395,51 5.806,52 3.394,53 4.058,54 4.246,55 3.72,56 3.212,57 5.666,58 5.523}
{0 CHEMBL337695,1 9,2 1.219,3 3.57,4 1,5 0.094,6 3.433,7 1.235,8 7,9 1.837,10 4.456,11 2.219,12 12.444,13 3.854,14 14.852,15 113.967,16 10.638,17 0.324,18 4.105,19 4.184,20 4.039,21 3.579,22 5.429,23 3.61,24 4.701,25 4.818,26 4.494,27 3.879,28 6.71,29 3.937,30 4.799,31 4.928,32 4.019,33 6.382,34 4.041,35 4.898,36 5.022,37 4.506,38 4.013,39 6.52,40 4.084,41 4.999,42 5.129,43 4.651,44 3.965,45 6.937,46 4.069,47 4.913,48 5.082,49 4.393,50 3.963,51 6.636,52 3.99,53 4.838,54 4.986,55 4.387,56 3.96,57 6.596,58 5.523}
{0 CHEMBL423153,1 8,2 1.009,3 3.569,4 1,5 0.003,6 3.435,7 1.035,8 7,9 1.912,10 4.257,11 2.015,12 12.97,13 6.101,14 37.223,15 107.654,16 9.762,17 0.353,18 4.049,19 4.145,20 3.791,21 3.509,22 5.352,23 3.557,24 4.637,25 4.781,26 4.308,27 3.843,28 6.597,29 3.894,30 4.79,31 4.979,32 3.962,33 6.231,34 3.983,35 4.894,36 5.083,37 4.317,38 3.905,39 6.402,40 3.979,41 4.849,42 5.01,43 4.498,44 3.829,45 6.755,46 3.938,47 4.776,48 4.944,49 4.222,50 3.792,51 6.544,52 3.855,53 4.675,54 4.833,55 4.18,56 3.797,57 6.449,58 6.18}
{0 CHEMBL424086,1 5,2 1.013,3 2.545,4 1,5 -0.009,6 2.943,7 0.986,8 4,9 2.328,10 3.742,11 2.082,12 7.9,13 3.062,14 9.378,15 67.078,16 11.173,17 0.571,18 3.455,19 3.542,20 3.319,21 2.992,22 4.844,23 3.048,24 3.954,25 4.064,26 3.819,27 3.291,28 5.977,29 3.362,30 4.065,31 4.214,32 3.357,33 5.641,34 3.397,35 4.099,36 4.256,37 3.767,38 3.217,39 5.763,40 3.314,41 4.096,42 4.242,43 3.959,44 3.049,45 6.31,46 3.204,47 3.674,48 3.806,49 3.353,50 2.94,51 5.302,52 2.99,53 3.656,54 3.817,55 3.244,56 2.888,57 5.234,58 5}
