"molecule_id","GATS2m","C.007","SpMin1_Bh.e.","SpMin3_Bh.i.","CATS2D_05_LL","SpMax1_Bh.m.","SpMin1_Bh.i.","GGI4","SpMAD_AEA.ed.","Eta_betaS_A","SdssC","ATS4v","H.048","SpMin3_Bh.m.","SpMin3_Bh.e.","CATS2D_04_LL","nC..N.N2","ATS5v","SpMax1_Bh.e.","ATS6p","SdsCH","SpMax1_Bh.i.","ATS4p","SM08_AEA.ed.","ATSC6p","SM10_EA.ri.","SM11_EA.ri.","SM12_EA.ri.","SM13_EA.ri.","SM14_EA.ri.","SpMax1_Bh.v.","ATSC7p","SpMin3_Bh.s.","GGI5","ATSC6i","SpMin1_Bh.p.","SpMax3_Bh.i.","nR.Cs","ATSC5i","SM13_EA.ed.","SM14_EA.ed.","SM15_EA.ed.","ATS6v","SpMax1_Bh.p.","SM15_EA.ri.","SM09_AEA.ed.","Mv","ATS5p","Eig01_EA.bo.","SM11_AEA.ri.","SpDiam_EA.bo.","SpMax_EA.bo.","ATS5s","O.","SM07_EA.ed.","SM08_EA.ed.","SM09_EA.ed.","SM10_EA.ed.","SM11_EA.ed.","SM12_EA.ed.","SM03_EA.ed.","MATS3i","SpMax6_Bh.m.","SM06_EA.ed.","C.025","SM05_EA.ed.","pXC50"
{1 1.025,3 1.93,4 1.782,5 14,6 4.34,7 1.915,8 1.466,9 1.551,10 0.63,12 3.886,14 1.921,15 1.814,16 6,18 3.871,19 4.093,20 3.935,22 4.128,23 3.95,24 16.099,25 7.486,26 11.733,27 12.749,28 13.876,29 14.942,30 16.059,31 4.007,32 7.987,33 0.975,34 1.202,35 1.223,36 2.02,37 3.867,39 1.29,40 31.342,41 33.738,42 36.124,43 3.856,44 4.01,45 17.151,46 17.918,47 0.699,48 3.946,49 4.301,50 4.301,51 7.301,52 4.301,53 5.646,54 2.3,55 17.109,56 19.567,57 21.832,58 24.24,59 26.576,60 28.972,61 7.529,62 -0.103,63 2.853,64 15.002,65 3,66 12.386,67 5}
{0 CHEMBL101253,1 0.711,3 2.047,4 1.793,5 13,6 4.071,7 2.023,8 1.24,9 1.496,10 0.63,12 3.754,14 1.943,15 1.827,16 8,18 3.723,19 4.095,20 3.806,22 4.126,23 3.84,24 15.817,25 5.816,26 11.595,27 12.606,28 13.748,29 14.816,30 15.942,31 4.025,32 6.574,33 1.033,34 0.542,35 1.026,36 2.141,37 3.882,39 1.11,40 31.076,41 33.468,42 35.845,43 3.734,44 4.02,45 17.039,46 17.626,47 0.702,48 3.782,49 4.543,50 4.543,51 7.543,52 4.543,53 5.493,55 16.832,56 19.301,57 21.565,58 23.98,59 26.315,60 28.712,61 7.273,62 -0.099,63 3.047,64 14.736,65 3,66 12.104,67 5}
{0 CHEMBL103667,1 0.877,3 2.066,4 1.737,5 6,6 4.073,7 2.051,8 2.225,9 1.525,10 0.647,11 -0.338,12 4.385,14 1.992,15 1.784,16 6,18 4.322,19 4.112,20 4.38,22 4.142,23 4.494,24 16.699,25 12.847,26 12.603,27 13.716,28 14.884,29 16.029,30 17.197,31 4.048,32 14.686,33 1.211,34 1.507,35 2.014,36 2.136,37 3.869,39 2.184,40 32.509,41 34.951,42 37.389,43 4.313,44 4.047,45 18.358,46 18.572,47 0.614,48 4.402,49 4.54,50 4.54,51 7.54,52 4.54,53 6.266,54 3.9,55 17.936,56 20.428,57 22.783,58 25.235,59 27.64,60 30.083,61 8.116,62 -0.076,63 3.392,64 15.702,65 3,66 13.082,67 5}
{0 CHEMBL105442,1 0.575,3 1.93,4 1.379,5 5,6 10.695,7 1.912,8 1.623,9 1.555,10 0.63,11 -0.663,12 3.678,14 1.676,15 1.429,16 3,18 3.633,19 4.002,20 3.733,22 4.027,23 3.765,24 16.036,25 7.893,26 11.606,27 12.619,28 13.726,29 14.782,30 15.882,31 3.925,32 7.74,33 1.015,34 0.976,35 1.152,36 2.036,37 3.858,39 1.123,40 31.082,41 33.464,42 35.83,43 3.707,44 4.034,45 16.961,46 17.852,47 0.708,48 3.624,49 4.211,50 4.211,51 7.211,52 4.211,53 5.907,54 5.1,55 16.941,56 19.4,57 21.633,58 24.038,59 26.348,60 28.735,61 7.493,62 -0.026,63 3.249,64 14.869,65 1,66 12.261,67 5}
{0 CHEMBL1092509,1 0.549,3 1.935,4 1.595,5 5,6 6.881,7 1.92,8 1.571,9 1.632,10 0.648,12 3.742,14 1.675,15 1.626,16 6,18 3.587,19 4.201,20 3.496,22 4.228,23 3.787,24 16.418,25 5.368,26 12.231,27 13.352,28 14.53,29 15.68,30 16.852,31 4.127,32 4.904,33 0.808,34 0.893,35 0.742,36 2.014,37 3.518,39 0.878,40 32.742,41 35.234,42 37.72,43 3.464,44 4.12,45 18.015,46 18.302,47 0.738,48 3.585,49 4.763,50 4.763,51 7.763,52 4.763,53 5.721,54 6.3,55 17.86,56 20.414,57 22.815,58 25.321,59 27.773,60 30.267,61 7.753,62 -0.167,63 2.987,64 15.588,65 3,66 12.882,67 5.886}
{0 CHEMBL1173655,1 0.748,3 2.013,4 1.646,5 7,6 4.079,7 1.989,8 1.986,9 1.504,10 0.676,11 -0.287,12 4.071,14 1.902,15 1.699,16 5,18 4.113,19 4.088,20 4.21,21 3.254,22 4.118,23 4.132,24 16.093,25 10.483,26 11.602,27 12.582,28 13.682,29 14.717,30 15.809,31 4,32 10.965,33 1.047,34 1.007,35 1.688,36 2.132,37 3.824,38 2,39 1.557,40 30.797,41 33.139,42 35.467,43 4.177,44 3.986,45 16.874,46 17.879,47 0.648,48 4.152,49 4.514,50 4.514,51 7.514,52 4.514,53 6.044,54 5.1,55 16.899,56 19.33,57 21.511,58 23.878,59 26.144,60 28.49,61 7.573,62 -0.158,63 3.341,64 14.895,65 1,66 12.29,67 5.745}
{0 CHEMBL1179821,1 0.838,2 1,3 1.891,4 1.438,6 3.961,7 1.876,8 0.898,9 1.549,10 0.702,11 0.723,12 3.481,13 2,14 1.669,15 1.463,17 1,18 3.395,19 3.999,20 3.374,21 1.72,22 4.02,23 3.529,24 15.852,25 4.624,26 11.442,27 12.457,28 13.554,29 14.604,30 15.69,31 3.907,32 4.323,33 0.737,34 0.66,35 0.749,36 1.97,37 3.634,38 2,39 0.793,40 30.64,41 32.971,42 35.285,43 3.337,44 3.897,45 16.756,46 17.668,47 0.632,48 3.449,49 3.987,50 3.987,51 6.987,52 3.987,53 5.375,54 8.1,55 16.74,56 19.169,57 21.372,58 23.735,59 26.003,60 28.342,61 7.252,62 -0.073,63 2.845,64 14.684,65 1,66 12.077,67 6.149}
{0 CHEMBL119385,1 0.658,3 1.952,4 1.69,5 8,6 4.149,7 1.939,8 2.524,9 1.587,10 0.643,11 0.593,12 3.907,14 1.807,15 1.722,16 6,18 3.841,19 4.021,20 3.765,21 4.53,22 4.042,23 3.951,24 16.367,25 5.601,26 11.902,27 12.968,28 14.121,29 15.232,30 16.38,31 3.954,32 5.842,33 0.883,34 0.826,35 1.044,36 2.047,37 3.805,38 3,39 1.119,40 32.428,41 34.912,42 37.391,43 3.725,44 3.958,45 17.513,46 18.22,47 0.784,48 3.838,49 4.28,50 4.28,51 7.28,52 4.28,53 6.04,54 2.7,55 17.636,56 20.173,57 22.546,58 25.039,59 27.478,60 29.962,61 7.756,62 -0.085,63 3.16,64 15.422,65 1,66 12.737,67 5}
{0 CHEMBL1230020,1 0.811,3 1.941,4 1.747,5 3,6 4.723,7 1.935,8 2.138,9 1.617,10 0.639,11 -0.961,12 3.861,13 1,14 1.877,15 1.748,16 3,18 3.796,19 4.134,20 3.713,22 4.162,23 3.839,24 16.576,25 7.853,26 12.335,27 13.44,28 14.591,29 15.721,30 16.87,31 4.042,32 7.11,33 1.001,34 1.08,35 1.433,36 2.044,37 3.833,39 1.303,40 32.448,41 34.881,42 37.306,43 3.736,44 4.042,45 18.012,46 18.452,47 0.699,48 3.776,49 4.565,50 4.565,51 7.565,52 4.565,53 6.311,54 7.3,55 17.899,56 20.4,57 22.748,58 25.202,59 27.595,60 30.033,61 8.019,62 -0.118,63 3.155,64 15.659,65 3,66 13.027,67 5.569}
{0 CHEMBL1233659,1 0.554,3 1.942,4 1.595,5 5,6 6.881,7 1.927,8 1.922,9 1.653,10 0.65,11 -1.097,12 3.871,14 1.675,15 1.626,16 6,18 3.735,19 4.205,20 3.612,22 4.231,23 3.889,24 16.527,25 5.848,26 12.351,27 13.466,28 14.637,29 15.781,30 16.948,31 4.132,32 5.566,33 0.808,34 1.264,35 0.869,36 2.027,37 3.576,39 0.984,40 32.765,41 35.256,42 37.741,43 3.626,44 4.124,45 18.108,46 18.402,47 0.744,48 3.705,49 4.77,50 4.77,51 7.77,52 4.77,53 5.91,54 11.4,55 17.91,56 20.458,57 22.849,58 25.352,59 27.8,60 30.292,61 7.879,62 -0.191,63 3.108,64 15.655,65 4,66 12.959,67 6.886}
{0 CHEMBL1236107,1 0.745,3 2.027,4 1.446,5 4,6 4.196,7 2.006,8 1.254,9 1.536,10 0.673,12 3.719,13 1,14 1.724,15 1.502,16 4,18 3.618,19 4.118,20 3.628,22 4.169,23 3.811,24 16.068,25 5.214,26 11.588,27 12.565,28 13.652,29 14.671,30 15.74,31 4.015,32 4.658,33 0.777,34 0.688,35 0.988,36 2.104,37 3.934,39 1.046,40 30.827,41 33.151,42 35.464,43 3.567,44 4.02,45 16.779,46 17.872,47 0.716,48 3.7,49 4.523,50 4.523,51 7.523,52 4.523,53 5.335,55 16.978,56 19.391,57 21.589,58 23.938,59 26.203,60 28.531,61 7.526,62 -0.048,63 3.007,64 14.928,65 2,66 12.335,67 5}
{0 CHEMBL1240703,1 0.763,3 2.034,4 1.882,5 21,6 4.353,7 2.027,8 4.638,9 1.676,10 0.693,11 -0.393,12 4.899,13 2,14 2.019,15 1.907,16 18,18 4.991,19 4.368,20 5.077,22 4.39,23 4.916,24 17.719,25 27.353,26 13.504,27 14.703,28 15.94,29 17.166,30 18.408,31 4.3,32 28.908,33 1.166,34 3.362,35 3.852,36 2.095,37 3.972,39 3.566,40 35.883,41 38.599,42 41.316,43 5.016,44 4.286,45 19.65,46 19.689,47 0.669,48 5.024,49 5.289,50 5.289,51 8.289,52 5.289,53 6.785,54 6.8,55 19.729,56 22.45,57 25.084,58 27.788,59 30.47,60 33.178,61 8.967,62 0.056,63 3.432,64 17.219,65 7,66 14.394,67 5}
{0 CHEMBL1241674,1 0.646,3 1.919,4 1.615,5 2,6 4.164,7 1.9,8 1.932,9 1.628,10 0.685,12 3.771,14 1.839,15 1.68,16 4,18 3.674,19 4.187,20 3.669,22 4.228,23 3.812,24 16.344,25 5.097,26 12.089,27 13.182,28 14.335,29 15.461,30 16.61,31 4.088,32 5.868,33 0.961,34 0.674,35 1.06,36 2.028,37 3.655,39 1.111,40 32.475,41 34.96,42 37.439,43 3.617,44 4.072,45 17.751,46 18.206,47 0.653,48 3.731,49 4.748,50 4.748,51 7.748,52 4.748,53 5.562,54 2.6,55 17.672,56 20.211,57 22.59,58 25.084,59 27.524,60 30.009,61 7.716,62 -0.114,63 2.868,64 15.44,65 2,66 12.752,67 7.229}
{0 CHEMBL124660,1 0.965,3 2.006,4 1.77,5 6,6 4.057,7 1.984,8 2.293,9 1.504,10 0.683,11 -0.113,12 4.436,14 1.999,15 1.836,16 7,18 4.425,19 4.087,20 4.494,22 4.12,23 4.536,24 16.294,25 16.851,26 11.748,27 12.72,28 13.822,29 14.852,30 15.943,31 3.992,32 14.519,33 1.175,34 1.25,35 2.283,36 2.138,37 3.928,39 2.338,40 31.285,41 33.664,42 36.034,43 4.371,44 3.977,45 17.005,46 18.092,47 0.596,48 4.538,49 4.523,50 4.523,51 7.523,52 4.523,53 6.32,54 4.8,55 17.193,56 19.632,57 21.859,58 24.249,59 26.558,60 28.936,61 7.766,62 -0.008,63 3.419,64 15.139,65 1,66 12.537,67 5}
{0 CHEMBL1287853,1 0.851,3 1.972,4 1.735,5 9,6 4.737,7 1.975,8 1.801,9 1.492,10 0.649,12 4.254,14 1.955,15 1.774,16 2,18 4.214,19 4.095,20 4.306,22 4.093,23 4.382,24 16.64,25 12.133,26 12.224,27 13.288,28 14.416,29 15.518,30 16.648,31 3.99,32 13.852,33 1.152,34 1.08,35 1.832,36 2.071,37 3.921,39 1.86,40 33.145,41 35.684,42 38.221,43 4.205,44 4.071,45 17.771,46 18.525,47 0.608,48 4.294,49 4.71,50 4.71,51 7.71,52 4.71,53 6.317,54 4.1,55 18.053,56 20.591,57 23.047,58 25.577,59 28.084,60 30.617,61 8.148,62 -0.145,63 3.491,64 15.723,65 1,66 13.112,67 5}
{0 CHEMBL1289926,1 0.846,3 1.957,4 1.798,5 10,6 4.161,7 1.944,8 1.067,9 1.52,10 0.616,11 -0.092,12 3.882,14 1.936,15 1.831,16 11,18 3.83,19 4.114,20 3.926,21 3.931,22 4.149,23 3.986,24 15.991,25 8.907,26 11.719,27 12.725,28 13.841,29 14.892,30 15.992,31 4.035,32 7.871,33 0.976,34 0.761,35 1.195,36 2.012,37 3.903,38 2,39 1.163,40 30.851,41 33.179,42 35.493,43 3.818,44 4.04,45 17.063,46 17.802,47 0.689,48 3.941,49 4.514,50 4.514,51 7.514,52 4.514,53 5.584,54 2.2,55 16.934,56 19.354,57 21.575,58 23.933,59 26.212,60 28.547,61 7.434,62 -0.044,63 3.169,64 14.856,65 2,66 12.263,67 5}
{0 CHEMBL1336,1 0.611,3 1.911,4 1.77,5 4,6 4.047,7 1.889,8 1.716,9 1.535,10 0.656,11 -1.095,12 3.909,14 1.896,15 1.8,16 4,18 3.811,19 3.988,20 3.776,22 4.014,23 3.87,24 16.409,25 8.134,26 11.579,27 12.536,28 13.611,29 14.614,30 15.673,31 3.896,32 6.854,33 0.937,34 0.979,35 1.273,36 2.036,37 3.871,39 1.415,40 32.516,41 35.013,42 37.507,43 3.752,44 3.891,45 16.701,46 18.281,47 0.696,48 3.794,49 4.049,50 4.049,51 7.049,52 4.049,53 6.141,54 6.3,55 17.645,56 20.162,57 22.573,58 25.07,59 27.535,60 30.03,61 7.861,62 -0.113,63 3.356,64 15.376,65 1,66 12.764,67 5}
{0 CHEMBL1421,1 0.718,3 1.911,4 1.628,5 1,6 4.246,7 1.888,8 1.899,9 1.535,10 0.689,11 -0.267,12 4.143,14 1.843,15 1.692,16 5,18 4.099,19 3.993,20 4.148,22 4.038,23 4.257,24 16.099,25 11.058,26 11.36,27 12.288,28 13.339,29 14.314,30 15.348,31 3.896,32 11.075,33 0.964,34 1.181,35 1.578,36 2.062,37 3.859,39 1.693,40 30.267,41 32.531,42 34.773,43 4.032,44 3.912,45 16.347,46 17.878,47 0.642,48 4.219,49 4.012,50 4.012,51 7.012,52 4.012,53 6.107,54 3.4,55 16.784,56 19.165,57 21.277,58 23.582,59 25.769,60 28.043,61 7.582,62 -0.01,63 3.265,64 14.832,65 1,66 12.26,67 5}
{0 CHEMBL1474834,1 0.84,2 1,3 2.047,4 1.534,5 2,6 4.219,7 2.025,8 1.395,9 1.546,10 0.688,12 3.967,13 3,14 1.767,15 1.587,16 6,18 3.937,19 4.104,20 3.988,22 4.132,23 4.054,24 16.196,25 10.052,26 11.81,27 12.826,28 13.936,29 14.994,30 16.094,31 4.035,32 7.517,33 0.936,34 0.993,35 1.416,36 2.138,37 3.872,39 1.354,40 31.178,41 33.537,42 35.885,43 3.888,44 4.03,45 17.173,46 18.01,47 0.682,48 4.045,49 4.495,50 4.495,51 7.495,52 4.495,53 5.644,54 4.3,55 17.152,56 19.589,57 21.813,58 24.191,59 26.486,60 28.848,61 7.636,62 -0.126,63 3.065,64 15.08,65 3,66 12.472,67 6.319}
{0 CHEMBL1614701,1 0.584,3 1.956,4 1.426,5 4,6 6.88,7 1.936,8 2.129,9 1.589,10 0.667,11 -0.679,12 3.844,14 1.738,15 1.498,16 3,18 3.785,19 4.134,20 3.821,22 4.172,23 3.873,24 16.283,25 7.522,26 11.869,27 12.937,28 14.078,29 15.185,30 16.322,31 4.031,32 7.214,33 0.946,34 1.285,35 1.235,36 2.066,37 3.663,39 1.243,40 31.892,41 34.328,42 36.751,43 3.842,44 4.012,45 17.448,46 18.13,47 0.694,48 3.765,49 4.67,50 4.67,51 7.67,52 4.67,53 6.036,54 7.1,55 17.407,56 19.918,57 22.219,58 24.675,59 27.047,60 29.486,61 7.65,62 -0.065,63 3.238,64 15.259,65 1,66 12.59,67 5}
{0 CHEMBL162,1 0.771,3 2.036,4 1.856,5 19,6 4.351,7 2.028,8 3.922,9 1.699,10 0.707,11 0.004,12 4.727,13 1,14 1.955,15 1.889,16 17,18 4.794,19 4.366,20 4.848,22 4.389,23 4.756,24 17.596,25 22.265,26 13.386,27 14.592,28 15.834,29 17.065,30 18.311,31 4.299,32 21.781,33 1.166,34 2.588,35 3.117,36 2.088,37 3.888,39 3.038,40 35.831,41 38.547,42 41.264,43 4.761,44 4.286,45 19.555,46 19.575,47 0.656,48 4.847,49 5.285,50 5.285,51 8.285,52 5.285,53 6.495,54 4.9,55 19.656,56 22.381,57 25.023,58 27.73,59 30.416,60 33.125,61 8.844,62 0.123,63 3.272,64 17.129,65 6,66 14.301,67 6.602}
{0 CHEMBL1721885,1 0.836,3 1.891,4 1.672,5 5,6 4.051,7 1.872,8 1.814,9 1.578,10 0.664,11 -0.296,12 4.135,14 1.852,15 1.708,16 7,18 4.069,19 4.086,20 4.095,21 1.632,22 4.116,23 4.214,24 16.392,25 11.059,26 12.332,27 13.436,28 14.595,29 15.728,30 16.883,31 4.002,32 10.501,33 1.06,34 1.022,35 1.624,36 2.002,37 3.888,38 1,39 1.7,40 31.984,41 34.397,42 36.8,43 4.026,44 3.991,45 18.029,46 18.234,47 0.621,48 4.128,49 4.332,50 4.332,51 7.332,52 4.332,53 6.304,54 6.8,55 17.545,56 20.041,57 22.358,58 24.797,59 27.17,60 29.589,61 7.781,62 0.002,63 3.157,64 15.374,65 3,66 12.717,67 5.886}
{0 CHEMBL1789941,1 0.92,3 1.858,4 1.507,5 2,6 4.094,7 1.826,8 0.733,9 1.52,10 0.674,12 3.814,13 2,14 1.86,15 1.577,16 4,18 3.777,19 4.127,20 3.656,22 4.174,23 3.896,24 16.067,25 6.431,26 11.787,27 12.836,28 13.954,29 15.034,30 16.143,31 4.012,32 4.675,33 1.022,34 0.647,35 1.111,36 2.003,37 3.828,39 1.284,40 31.406,41 33.782,42 36.144,43 3.543,44 3.992,45 17.238,46 17.911,47 0.641,48 3.876,49 4.516,50 4.516,51 7.516,52 4.516,53 5.675,55 17.205,56 19.668,57 21.942,58 24.345,59 26.673,60 29.055,61 7.455,62 -0.179,63 2.871,64 15.058,65 2,66 12.43,67 5.432}
{0 CHEMBL180022,1 0.756,3 2.044,4 1.783,5 9,6 4.095,7 2.024,8 2.533,9 1.512,10 0.65,11 -0.297,12 4.307,14 1.919,15 1.818,16 8,18 4.343,19 4.107,20 4.433,21 3.245,22 4.132,23 4.375,24 16.274,25 13.018,26 11.891,27 12.899,28 14.022,29 15.087,30 16.203,31 4.036,32 13.007,33 1.046,34 1.528,35 1.956,36 2.14,37 3.874,38 2,39 1.869,40 31.362,41 33.749,42 36.124,43 4.382,44 4.025,45 17.297,46 18.076,47 0.658,48 4.408,49 4.576,50 4.576,51 7.576,52 4.576,53 6.257,54 4.3,55 17.206,56 19.662,57 21.898,58 24.3,59 26.618,60 29.006,61 7.743,62 -0.095,63 3.349,64 15.143,65 2,66 12.525,67 5}
{0 CHEMBL1802355,1 0.834,2 1,3 1.893,4 1.419,6 3.965,7 1.877,8 0.996,9 1.521,10 0.69,11 0.422,12 3.623,13 2,14 1.576,15 1.436,17 1,18 3.538,19 4.005,20 3.455,21 1.694,22 4.028,23 3.674,24 15.744,25 5.014,26 11.368,27 12.309,28 13.384,29 14.374,30 15.43,31 3.912,32 4.144,33 0.591,34 0.699,35 0.831,36 1.997,37 3.78,38 2,39 0.95,40 29.654,41 31.883,42 34.093,43 3.451,44 3.903,45 16.445,46 17.503,47 0.677,48 3.583,49 3.975,50 3.975,51 6.975,52 3.975,53 5.503,54 10,55 16.364,56 18.711,57 20.793,58 23.063,59 25.221,60 27.461,61 7.273,62 -0.115,63 2.864,64 14.443,65 1,66 11.904,67 7.097}
{0 CHEMBL1802356,1 0.844,2 2,3 1.892,4 1.419,6 3.974,7 1.876,8 0.942,9 1.518,10 0.721,11 0.36,12 3.633,13 4,14 1.514,15 1.436,17 1,18 3.524,19 4.012,20 3.442,21 1.686,22 4.034,23 3.659,24 15.955,25 4.606,26 11.555,27 12.514,28 13.59,29 14.591,30 15.648,31 3.916,32 4.29,33 0.591,34 0.716,35 0.809,36 1.976,37 3.79,38 2,39 0.915,40 30.036,41 32.271,42 34.486,43 3.467,44 3.905,45 16.67,46 17.731,47 0.699,48 3.535,49 3.978,50 3.978,51 6.978,52 3.978,53 5.497,54 12.8,55 16.668,56 19.027,57 21.134,58 23.414,59 25.586,60 27.834,61 7.445,62 -0.137,63 2.88,64 14.708,65 1,66 12.152,67 7.398}
{0 CHEMBL1802357,1 0.858,2 1,3 1.896,4 1.422,6 3.973,7 1.879,8 1.129,9 1.517,10 0.713,11 0.366,12 3.711,13 2,14 1.689,15 1.451,17 1,18 3.624,19 4.012,20 3.537,21 1.69,22 4.034,23 3.745,24 15.954,25 5.443,26 11.523,27 12.479,28 13.553,29 14.552,30 15.607,31 3.916,32 4.67,33 0.921,34 0.719,35 0.91,36 2.03,37 3.793,38 2,39 1.003,40 30.022,41 32.257,42 34.47,43 3.538,44 3.905,45 16.627,46 17.729,47 0.686,48 3.653,49 3.977,50 3.977,51 6.977,52 3.977,53 5.563,54 11.9,55 16.658,56 19.02,57 21.123,58 23.405,59 25.574,60 27.823,61 7.445,62 -0.03,63 2.937,64 14.706,65 1,66 12.144,67 6.959}
{0 CHEMBL1802358,1 0.849,2 1,3 1.895,4 1.419,6 3.963,7 1.877,8 0.764,9 1.499,10 0.685,11 0.497,12 3.486,13 2,14 1.515,15 1.436,17 1,18 3.419,19 4.003,20 3.364,21 1.705,22 4.026,23 3.533,24 15.653,25 4.25,26 11.305,27 12.248,28 13.329,29 14.321,30 15.381,31 3.911,32 3.953,33 0.591,34 0.581,35 0.739,36 1.992,37 3.777,38 2,39 0.813,40 29.639,41 31.871,42 34.082,43 3.367,44 3.902,45 16.398,46 17.418,47 0.69,48 3.434,49 3.975,50 3.975,51 6.975,52 3.975,53 5.369,54 8.3,55 16.313,56 18.667,57 20.759,58 23.035,59 25.198,60 27.443,61 7.154,62 -0.121,63 2.794,64 14.379,65 1,66 11.824,67 7.297}
{0 CHEMBL1802841,1 0.765,2 1,3 1.891,4 1.41,6 3.96,7 1.876,8 0.818,9 1.568,10 0.711,11 0.796,12 3.37,13 2,14 1.632,15 1.455,17 1,18 3.219,19 3.997,20 3.113,21 1.727,22 4.017,23 3.412,24 15.846,25 4.051,26 11.435,27 12.453,28 13.549,29 14.599,30 15.685,31 3.907,32 3.011,33 0.668,34 0.469,35 0.579,36 1.97,37 3.441,38 2,39 0.661,40 30.623,41 32.951,42 35.264,43 3.075,44 3.897,45 16.751,46 17.663,47 0.651,48 3.29,49 3.987,50 3.987,51 6.987,52 3.987,53 5.214,54 9.4,55 16.731,56 19.157,57 21.36,58 23.721,59 25.989,60 28.325,61 7.252,62 -0.251,63 2.707,64 14.672,65 1,66 12.071,67 5.658}
{0 CHEMBL1802842,1 0.785,2 1,3 1.891,4 1.438,6 3.961,7 1.876,8 0.898,9 1.565,10 0.7,11 0.852,12 3.44,13 2,14 1.669,15 1.463,17 1,18 3.347,19 3.998,20 3.315,21 1.741,22 4.019,23 3.487,24 15.85,25 4.93,26 11.44,27 12.456,28 13.553,29 14.603,30 15.689,31 3.907,32 4.161,33 0.735,34 0.605,35 0.691,36 1.97,37 3.576,38 2,39 0.754,40 30.64,41 32.97,42 35.284,43 3.253,44 3.897,45 16.756,46 17.667,47 0.639,48 3.405,49 3.987,50 3.987,51 6.987,52 3.987,53 5.289,54 8.6,55 16.74,56 19.169,57 21.372,58 23.734,59 26.003,60 28.341,61 7.252,62 -0.124,63 2.745,64 14.683,65 1,66 12.077,67 6.194}
{0 CHEMBL1802843,1 0.814,2 1,3 1.891,4 1.439,6 3.961,7 1.876,8 0.898,9 1.549,10 0.69,11 0.884,12 3.501,13 2,14 1.68,15 1.466,17 1,18 3.418,19 3.999,20 3.428,21 1.751,22 4.021,23 3.559,24 15.852,25 5.008,26 11.442,27 12.457,28 13.555,29 14.604,30 15.69,31 3.907,32 5.07,33 0.745,34 0.66,35 0.784,36 1.97,37 3.663,38 2,39 0.818,40 30.64,41 32.971,42 35.285,43 3.377,44 3.897,45 16.756,46 17.668,47 0.629,48 3.48,49 3.987,50 3.987,51 6.987,52 3.987,53 5.34,54 7.9,55 16.74,56 19.169,57 21.372,58 23.735,59 26.003,60 28.342,61 7.252,62 -0.175,63 2.874,64 14.684,65 1,66 12.077,67 6.26}
{0 CHEMBL1802844,1 0.758,2 1,3 1.891,4 1.439,6 3.962,7 1.876,8 0.978,9 1.565,10 0.69,11 0.845,12 3.525,13 2,14 1.673,15 1.465,17 1,18 3.46,19 4,20 3.483,21 1.746,22 4.022,23 3.593,24 15.882,25 5.84,26 11.468,27 12.481,28 13.575,29 14.624,30 15.708,31 3.908,32 5.257,33 0.738,34 0.796,35 0.804,36 1.97,37 3.661,38 2,39 0.847,40 30.666,41 32.999,42 35.315,43 3.404,44 3.898,45 16.774,46 17.694,47 0.629,48 3.509,49 3.987,50 3.987,51 6.987,52 3.987,53 5.378,54 7.9,55 16.758,56 19.191,57 21.391,58 23.757,59 26.025,60 28.366,61 7.302,62 -0.124,63 2.772,64 14.709,65 1,66 12.1,67 6.276}
{0 CHEMBL1802845,1 0.84,2 1,3 1.891,4 1.439,6 3.962,7 1.876,8 0.898,9 1.54,10 0.682,11 0.905,12 3.564,13 2,14 1.694,15 1.47,17 1,18 3.48,19 4,20 3.501,21 1.759,22 4.022,23 3.637,24 15.854,25 5.467,26 11.445,27 12.457,28 13.556,29 14.604,30 15.691,31 3.908,32 5.164,33 0.787,34 0.66,35 0.847,36 1.97,37 3.719,38 2,39 0.898,40 30.64,41 32.971,42 35.285,43 3.446,44 3.898,45 16.756,46 17.669,47 0.62,48 3.553,49 3.987,50 3.987,51 6.987,52 3.987,53 5.404,54 7.3,55 16.74,56 19.17,57 21.372,58 23.735,59 26.003,60 28.342,61 7.252,62 -0.158,63 2.901,64 14.685,65 1,66 12.077,67 6.215}
{0 CHEMBL1802846,1 0.796,2 1,3 1.891,4 1.439,6 3.962,7 1.876,8 0.978,9 1.558,10 0.682,11 0.877,12 3.576,13 2,14 1.684,15 1.468,17 1,18 3.485,19 4,20 3.529,21 1.755,22 4.023,23 3.66,24 15.878,25 5.099,26 11.47,27 12.479,28 13.572,29 14.618,30 15.701,31 3.908,32 6.001,33 0.749,34 0.716,35 0.876,36 1.971,37 3.729,38 2,39 0.882,40 30.641,41 32.972,42 35.286,43 3.487,44 3.898,45 16.765,46 17.689,47 0.62,48 3.55,49 3.987,50 3.987,51 6.987,52 3.987,53 5.397,54 7.3,55 16.745,56 19.173,57 21.374,58 23.737,59 26.005,60 28.343,61 7.302,62 -0.307,63 2.891,64 14.694,65 1,66 12.092,67 6.678}
{0 CHEMBL1802847,1 0.823,2 1,3 1.891,4 1.439,6 3.962,7 1.876,8 0.898,9 1.548,10 0.674,11 0.899,12 3.64,13 2,14 1.705,15 1.477,17 1,18 3.538,19 4.001,20 3.57,21 1.762,22 4.023,23 3.742,24 15.88,25 5.915,26 11.474,27 12.48,28 13.574,29 14.618,30 15.702,31 3.908,32 5.268,33 0.83,34 0.716,35 0.911,36 1.971,37 3.77,38 2,39 0.977,40 30.64,41 32.971,42 35.285,43 3.512,44 3.898,45 16.765,46 17.689,47 0.612,48 3.62,49 3.987,50 3.987,51 6.987,52 3.987,53 5.47,54 6.8,55 16.744,56 19.172,57 21.374,58 23.736,59 26.004,60 28.342,61 7.302,62 -0.227,63 2.902,64 14.694,65 1,66 12.092,67 6.252}
{0 CHEMBL1802848,1 0.824,2 1,3 1.891,4 1.439,6 3.961,7 1.876,8 0.898,9 1.549,10 0.69,11 0.744,12 3.48,13 2,14 1.672,15 1.465,17 1,18 3.394,19 3.999,20 3.374,21 3.434,22 4.02,23 3.528,24 15.852,25 4.823,26 11.442,27 12.457,28 13.555,29 14.604,30 15.69,31 3.907,32 4.492,33 0.729,34 0.66,35 0.742,36 1.97,37 3.63,38 3,39 0.786,40 30.64,41 32.971,42 35.285,43 3.335,44 3.897,45 16.756,46 17.668,47 0.649,48 3.449,49 3.987,50 3.987,51 6.987,52 3.987,53 5.34,54 8.3,55 16.74,56 19.169,57 21.372,58 23.735,59 26.003,60 28.342,61 7.252,62 -0.242,63 2.867,64 14.684,65 1,66 12.077,67 6.208}
{0 CHEMBL1802849,1 0.882,2 1,3 1.891,4 1.438,6 3.965,7 1.876,8 0.853,9 1.547,10 0.705,11 0.958,12 3.539,13 2,14 1.653,15 1.461,17 1,18 3.465,19 4.007,20 3.501,21 1.77,22 4.038,23 3.598,24 15.954,25 5.164,26 11.611,27 12.614,28 13.699,29 14.737,30 15.812,31 3.911,32 5.504,33 0.825,34 0.605,35 0.84,36 1.97,37 3.822,38 2,39 0.859,40 30.652,41 32.98,42 35.292,43 3.462,44 3.901,45 16.868,46 17.76,47 0.638,48 3.52,49 3.987,50 3.987,51 6.987,52 3.987,53 5.349,54 7.7,55 16.8,56 19.214,57 21.406,58 23.761,59 26.023,60 28.357,61 7.427,62 -0.236,63 2.897,64 14.756,65 1,66 12.181,67 6.469}
{0 CHEMBL1802850,1 0.861,2 1,3 1.891,4 1.507,6 3.966,7 1.876,8 0.853,9 1.521,10 0.696,11 0.99,12 3.613,13 2,14 1.849,15 1.577,17 1,18 3.566,19 4.007,20 3.642,21 1.782,22 4.036,23 3.689,24 15.942,25 6.081,26 11.542,27 12.544,28 13.635,29 14.676,30 15.757,31 3.911,32 6.645,33 1.098,34 0.796,35 0.952,36 1.97,37 3.801,38 2,39 0.953,40 30.683,41 33.015,42 35.331,43 3.586,44 3.901,45 16.817,46 17.749,47 0.629,48 3.612,49 3.988,50 3.988,51 6.988,52 3.988,53 5.424,54 7.1,55 16.798,56 19.225,57 21.419,58 23.781,59 26.045,60 28.385,61 7.361,62 -0.207,63 2.891,64 14.76,65 1,66 12.158,67 5.222}
{0 CHEMBL1802851,1 0.853,2 1,3 1.891,4 1.438,6 3.961,7 1.876,8 0.898,9 1.549,10 0.702,11 0.561,12 3.469,13 2,14 1.662,15 1.462,17 1,18 3.382,19 3.998,20 3.34,21 1.689,22 4.019,23 3.506,24 15.852,25 4.818,26 11.442,27 12.457,28 13.554,29 14.604,30 15.69,31 3.907,32 4.294,33 0.735,34 0.66,35 0.709,36 1.97,37 3.582,38 2,39 0.765,40 30.64,41 32.971,42 35.285,43 3.318,44 3.897,45 16.756,46 17.668,47 0.641,48 3.425,49 3.987,50 3.987,51 6.987,52 3.987,53 5.408,54 11.1,55 16.74,56 19.169,57 21.372,58 23.735,59 26.003,60 28.342,61 7.252,62 -0.114,63 2.815,64 14.684,65 1,66 12.077,67 5}
{0 CHEMBL1802852,1 0.885,2 1,3 1.891,4 1.438,6 3.961,7 1.876,8 0.898,9 1.54,10 0.705,11 0.743,12 3.534,13 2,14 1.67,15 1.463,17 1,18 3.446,19 3.999,20 3.42,21 1.728,22 4.02,23 3.589,24 15.854,25 5.267,26 11.442,27 12.457,28 13.555,29 14.604,30 15.69,31 3.907,32 4.379,33 0.737,34 0.66,35 0.772,36 1.97,37 3.615,38 2,39 0.843,40 30.64,41 32.971,42 35.285,43 3.392,44 3.897,45 16.756,46 17.669,47 0.631,48 3.502,49 3.987,50 3.987,51 6.987,52 3.987,53 5.424,54 10.3,55 16.74,56 19.17,57 21.372,58 23.735,59 26.003,60 28.342,61 7.252,62 -0.147,63 2.898,64 14.685,65 1,66 12.077,67 6.114}
{0 CHEMBL1802853,1 0.872,2 1,3 1.891,4 1.439,6 3.961,7 1.876,8 0.898,9 1.54,10 0.693,11 0.669,12 3.53,13 2,14 1.676,15 1.465,17 1,18 3.448,19 3.999,20 3.447,21 1.71,22 4.021,23 3.581,24 15.854,25 5.128,26 11.444,27 12.457,28 13.555,29 14.604,30 15.69,31 3.908,32 4.965,33 0.745,34 0.66,35 0.793,36 1.97,37 3.666,38 2,39 0.836,40 30.64,41 32.971,42 35.285,43 3.411,44 3.897,45 16.756,46 17.669,47 0.631,48 3.5,49 3.987,50 3.987,51 6.987,52 3.987,53 5.411,54 10.3,55 16.74,56 19.17,57 21.372,58 23.735,59 26.003,60 28.342,61 7.252,62 -0.166,63 2.896,64 14.685,65 1,66 12.077,67 6.328}
{0 CHEMBL1802854,1 0.909,2 1,3 1.891,4 1.439,6 3.962,7 1.876,8 0.898,9 1.518,10 0.677,11 0.788,12 3.656,13 2,14 1.715,15 1.483,17 1,18 3.576,19 4,20 3.594,21 1.737,22 4.023,23 3.735,24 15.857,25 6.042,26 11.449,27 12.457,28 13.558,29 14.604,30 15.691,31 3.908,32 5.679,33 0.929,34 0.66,35 0.94,36 1.971,37 3.758,38 2,39 0.991,40 30.64,41 32.971,42 35.285,43 3.536,44 3.898,45 16.756,46 17.671,47 0.615,48 3.653,49 3.987,50 3.987,51 6.987,52 3.987,53 5.54,54 8.9,55 16.74,56 19.17,57 21.372,58 23.735,59 26.003,60 28.342,61 7.252,62 -0.138,63 2.908,64 14.686,65 1,66 12.077,67 5.699}
{0 CHEMBL1802855,1 0.953,2 1,3 1.891,4 1.442,6 3.963,7 1.876,8 0.889,9 1.513,10 0.721,11 0.854,12 3.772,13 2,14 1.74,15 1.511,17 1,18 3.66,19 4.002,20 3.647,21 1.761,22 4.026,23 3.875,24 15.94,25 6.281,26 11.491,27 12.49,28 13.585,29 14.626,30 15.709,31 3.908,32 5.279,33 0.974,34 0.695,35 1.015,36 1.995,37 3.824,38 2,39 1.128,40 30.645,41 32.974,42 35.287,43 3.598,44 3.898,45 16.77,46 17.743,47 0.618,48 3.754,49 3.987,50 3.987,51 6.987,52 3.987,53 5.614,54 8.3,55 16.777,56 19.198,57 21.391,58 23.749,59 26.013,60 28.348,61 7.361,62 0.002,63 2.907,64 14.74,65 1,66 12.144,67 5.796}
{0 CHEMBL1802856,1 0.7,2 1,3 1.891,4 1.438,6 3.962,7 1.876,8 0.978,9 1.565,10 0.702,11 -0.089,12 3.45,13 2,14 1.659,15 1.461,17 1,18 3.366,19 3.999,20 3.285,21 1.635,22 4.019,23 3.475,24 15.882,25 4.515,26 11.482,27 12.494,28 13.587,29 14.634,30 15.718,31 3.907,32 4.032,33 0.705,34 0.796,35 0.664,36 1.97,37 3.563,38 2,39 0.73,40 30.666,41 32.999,42 35.315,43 3.271,44 3.897,45 16.783,46 17.694,47 0.663,48 3.374,49 3.988,50 3.988,51 6.988,52 3.988,53 5.424,54 11.8,55 16.758,56 19.191,57 21.391,58 23.757,59 26.025,60 28.366,61 7.302,62 -0.153,63 2.758,64 14.709,65 1,66 12.1,67 5.292}
{0 CHEMBL1802857,1 0.729,2 1,3 1.891,4 1.439,6 3.964,7 1.876,8 1.138,9 1.571,10 0.7,11 -2.392,12 3.616,13 2,14 1.69,15 1.469,17 1,18 3.55,19 4,20 3.432,21 1.546,22 4.019,23 3.605,24 16.032,25 4.803,26 11.644,27 12.655,28 13.74,29 14.783,30 15.859,31 3.908,32 4.303,33 0.748,34 0.907,35 0.788,36 1.97,37 3.647,38 2,39 0.847,40 30.706,41 33.035,42 35.348,43 3.492,44 3.897,45 16.918,46 17.841,47 0.663,48 3.522,49 3.988,50 3.988,51 6.988,52 3.988,53 5.801,54 15,55 16.849,56 19.274,57 21.459,58 23.818,59 26.076,60 28.412,61 7.438,62 -0.087,63 2.909,64 14.819,65 1,66 12.219,67 5.187}
{0 CHEMBL1803067,1 0.857,2 1,3 1.911,4 1.439,6 3.967,7 1.881,8 0.969,9 1.524,10 0.68,11 0.783,12 3.666,13 2,14 1.694,15 1.482,17 1,18 3.578,19 4.007,20 3.597,21 1.748,22 4.032,23 3.736,24 15.938,25 5.822,26 11.554,27 12.54,28 13.638,29 14.669,30 15.752,31 3.914,32 5.486,33 0.764,34 0.695,35 0.951,36 2.004,37 3.829,38 2,39 0.99,40 30.646,41 32.976,42 35.289,43 3.572,44 3.905,45 16.807,46 17.743,47 0.664,48 3.641,49 3.987,50 3.987,51 6.987,52 3.987,53 5.476,54 7.1,55 16.777,56 19.199,57 21.392,58 23.75,59 26.014,60 28.35,61 7.361,62 -0.289,63 2.903,64 14.741,65 2,66 12.144,67 6.252}
{0 CHEMBL1803068,1 0.84,2 2,3 1.893,4 1.439,6 3.975,7 1.876,8 1.227,9 1.538,10 0.714,11 0.676,12 3.793,13 4,14 1.688,15 1.478,17 1,18 3.677,19 4.015,20 3.667,21 1.732,22 4.038,23 3.84,24 16.173,25 6.28,26 11.756,27 12.749,28 13.841,29 14.873,30 15.951,31 3.919,32 6.023,33 0.759,34 0.719,35 1.026,36 1.985,37 3.837,38 2,39 1.085,40 30.809,41 33.125,42 35.425,43 3.656,44 3.909,45 17.003,46 17.978,47 0.674,48 3.733,49 3.988,50 3.988,51 6.988,52 3.988,53 5.595,54 11.1,55 17.014,56 19.425,57 21.608,58 23.953,59 26.203,60 28.526,61 7.603,62 -0.292,63 2.98,64 14.981,65 2,66 12.393,67 5.481}
{0 CHEMBL1803069,1 0.819,2 1,3 1.895,4 1.439,6 3.97,7 1.877,8 0.969,9 1.528,10 0.688,11 0.707,12 3.607,13 2,14 1.68,15 1.469,17 1,18 3.548,19 4.008,20 3.576,21 1.737,22 4.034,23 3.659,24 15.942,25 5.368,26 11.542,27 12.532,28 13.632,29 14.667,30 15.753,31 3.915,32 5.649,33 0.742,34 0.803,35 0.875,36 1.993,37 3.802,38 2,39 0.91,40 30.683,41 33.015,42 35.33,43 3.553,44 3.905,45 16.81,46 17.749,47 0.676,48 3.578,49 3.989,50 3.989,51 6.989,52 3.989,53 5.44,54 7.7,55 16.796,56 19.225,57 21.418,58 23.78,59 26.045,60 28.384,61 7.361,62 -0.242,63 2.896,64 14.761,65 1,66 12.154,67 6.337}
{0 CHEMBL1803070,1 0.776,2 1,3 1.893,4 1.439,6 3.972,7 1.877,8 1.161,9 1.55,10 0.69,11 0.532,12 3.643,13 2,14 1.678,15 1.468,17 1,18 3.569,19 4.009,20 3.585,21 1.701,22 4.034,23 3.689,24 15.987,25 5.33,26 11.581,27 12.57,28 13.665,29 14.698,30 15.78,31 3.915,32 5.812,33 0.741,34 0.858,35 0.888,36 1.994,37 3.802,38 2,39 0.932,40 30.685,41 33.017,42 35.332,43 3.574,44 3.905,45 16.835,46 17.786,47 0.677,48 3.598,49 3.989,50 3.989,51 6.989,52 3.989,53 5.504,54 10,55 16.811,56 19.237,57 21.425,58 23.786,59 26.049,60 28.387,61 7.427,62 -0.255,63 2.9,64 14.785,65 1,66 12.185,67 5.959}
{0 CHEMBL1803071,1 0.81,2 1,3 1.893,4 1.439,6 3.972,7 1.877,8 1.201,9 1.547,10 0.692,11 0.633,12 3.73,13 2,14 1.68,15 1.469,17 1,18 3.653,19 4.01,20 3.65,21 1.726,22 4.035,23 3.784,24 16.011,25 6.135,26 11.591,27 12.579,28 13.673,29 14.705,30 15.787,31 3.916,32 5.851,33 0.742,34 0.921,35 0.968,36 1.999,37 3.805,38 2,39 1.047,40 30.688,41 33.019,42 35.333,43 3.623,44 3.905,45 16.841,46 17.81,47 0.665,48 3.708,49 3.989,50 3.989,51 6.989,52 3.989,53 5.565,54 9.3,55 16.829,56 19.25,57 21.435,58 23.794,59 26.055,60 28.392,61 7.459,62 -0.228,63 2.909,64 14.805,65 1,66 12.212,67 6.292}
{0 CHEMBL1803072,1 0.811,2 2,3 1.892,4 1.439,6 3.981,7 1.876,8 1.147,9 1.541,10 0.722,11 0.571,12 3.739,13 4,14 1.677,15 1.468,17 1,18 3.641,19 4.018,20 3.639,21 1.717,22 4.041,23 3.77,24 16.176,25 5.726,26 11.743,27 12.739,28 13.831,29 14.866,30 15.944,31 3.92,32 5.978,33 0.741,34 0.883,35 0.945,36 1.977,37 3.816,38 2,39 1.012,40 30.841,41 33.161,42 35.465,43 3.637,44 3.907,45 16.998,46 17.983,47 0.686,48 3.666,49 3.993,50 3.993,51 6.993,52 3.993,53 5.56,54 11.9,55 17.03,56 19.446,57 21.629,58 23.978,59 26.23,60 28.556,61 7.603,62 -0.249,63 2.912,64 14.997,65 1,66 12.4,67 7}
{0 CHEMBL1803073,1 0.83,2 1,3 1.896,4 1.439,6 3.98,7 1.879,8 1.334,9 1.542,10 0.714,11 0.577,12 3.809,13 2,14 1.702,15 1.476,17 1,18 3.73,19 4.018,20 3.718,21 1.722,22 4.041,23 3.848,24 16.176,25 6.562,26 11.717,27 12.711,28 13.803,29 14.836,30 15.914,31 3.92,32 6.357,33 0.922,34 0.886,35 1.046,36 2.031,37 3.818,38 2,39 1.101,40 30.835,41 33.155,42 35.459,43 3.697,44 3.908,45 16.967,46 17.981,47 0.674,48 3.77,49 3.992,50 3.992,51 6.992,52 3.992,53 5.622,54 11.1,55 17.023,56 19.442,57 21.623,58 23.973,59 26.224,60 28.55,61 7.603,62 -0.136,63 2.94,64 14.995,65 1,66 12.394,67 6.921}
{0 CHEMBL1803075,1 0.823,3 1.902,4 1.461,6 3.958,7 1.893,8 1.494,9 1.582,10 0.667,11 0.744,12 3.805,14 1.682,15 1.483,17 1,18 3.806,19 3.991,20 3.833,21 1.698,22 4.013,23 3.838,24 16.037,25 8.276,26 11.56,27 12.591,28 13.692,29 14.753,30 15.843,31 3.901,32 8.11,33 0.746,34 0.99,35 1.141,36 2.009,37 3.662,38 2,39 1.151,40 31.05,41 33.395,42 35.722,43 3.734,44 3.889,45 16.918,46 17.868,47 0.6,48 3.863,49 4.132,50 4.132,51 7.132,52 4.132,53 5.786,54 8.5,55 17.02,56 19.471,57 21.703,58 24.087,59 26.378,60 28.734,61 7.438,62 -0.12,63 2.98,64 14.926,65 1,66 12.305,67 5}
{0 CHEMBL1803076,1 0.795,3 1.908,4 1.446,6 3.933,7 1.888,8 0.912,9 1.553,10 0.645,11 0.693,12 3.4,14 1.682,15 1.476,16 1,17 1,18 3.348,19 3.974,20 3.37,21 1.592,22 4.005,23 3.467,24 15.704,25 4.627,26 11.327,27 12.349,28 13.451,29 14.506,30 15.597,31 3.888,32 4.769,33 0.746,34 0.636,35 0.747,36 1.992,37 3.658,38 2,39 0.761,40 30.536,41 32.876,42 35.199,43 3.319,44 3.883,45 16.668,46 17.527,47 0.616,48 3.405,49 3.95,50 3.95,51 6.95,52 3.95,53 5.359,54 5.6,55 16.582,56 19.022,57 21.231,58 23.604,59 25.88,60 28.228,61 7.071,62 -0.19,63 2.818,64 14.519,65 1,66 11.904,67 5}
{0 CHEMBL1803079,1 0.832,2 1,3 1.891,4 1.417,6 3.955,7 1.876,8 0.773,9 1.521,10 0.688,11 0.674,12 3.365,13 2,14 1.52,15 1.434,17 1,18 3.284,19 3.994,20 3.214,21 1.72,22 4.013,23 3.42,24 15.531,25 3.694,26 11.18,27 12.149,28 13.227,29 14.237,30 15.297,31 3.905,32 3.66,33 0.593,34 0.494,35 0.643,36 1.97,37 3.655,38 2,39 0.715,40 29.592,41 31.826,42 34.04,43 3.197,44 3.895,45 16.326,46 17.306,47 0.639,48 3.325,49 3.975,50 3.975,51 6.975,52 3.975,53 5.262,54 8.6,55 16.229,56 18.586,57 20.693,58 22.972,59 25.144,60 27.391,61 7.018,62 -0.057,63 2.789,64 14.272,65 1,66 11.718,67 6.921}
{0 CHEMBL1803080,1 0.857,2 1,3 1.892,4 1.544,5 1,6 3.965,7 1.876,8 1.103,9 1.539,10 0.674,11 1.018,12 3.679,13 2,14 1.906,15 1.617,17 1,18 3.656,19 4.003,20 3.69,21 1.785,22 4.027,23 3.735,24 15.909,25 6.398,26 11.49,27 12.508,28 13.611,29 14.666,30 15.758,31 3.91,32 7.248,33 1.096,34 0.74,35 1.023,36 1.97,37 3.68,38 2,39 1.043,40 31.011,41 33.375,42 35.728,43 3.62,44 3.899,45 16.83,46 17.733,47 0.612,48 3.713,49 3.989,50 3.989,51 6.989,52 3.989,53 5.615,54 6.8,55 16.914,56 19.36,57 21.608,58 23.994,59 26.305,60 28.673,61 7.318,62 -0.088,63 2.909,64 14.813,65 1,66 12.196,67 5.678}
{0 CHEMBL1803081,1 0.852,2 1,3 1.897,4 1.568,5 2,6 3.986,7 1.879,8 1.339,9 1.529,10 0.673,11 0.772,12 3.804,13 2,14 1.922,15 1.645,17 1,18 3.803,19 4.022,20 3.82,21 1.765,22 4.05,23 3.841,24 16.116,25 6.811,26 11.698,27 12.722,28 13.843,29 14.91,30 16.02,31 3.927,32 7.832,33 1.068,34 0.779,35 1.133,36 1.993,37 3.774,38 2,39 1.169,40 31.8,41 34.234,42 36.661,43 3.78,44 3.916,45 17.108,46 17.957,47 0.654,48 3.829,49 4.011,50 4.011,51 7.011,52 4.011,53 5.747,54 6.7,55 17.297,56 19.793,57 22.117,58 24.564,59 26.951,60 29.386,61 7.506,62 -0.078,63 2.912,64 15.123,65 1,66 12.469,67 5}
{0 CHEMBL1803082,1 0.806,2 1,3 1.891,4 1.412,6 3.955,7 1.876,8 0.773,9 1.532,10 0.697,11 0.642,12 3.295,13 2,14 1.513,15 1.43,17 1,18 3.201,19 3.993,20 3.09,21 1.71,22 4.012,23 3.337,24 15.529,25 3.616,26 11.177,27 12.149,28 13.225,29 14.236,30 15.296,31 3.904,32 2.866,33 0.59,34 0.494,35 0.554,36 1.97,37 3.57,38 2,39 0.651,40 29.592,41 31.825,42 34.039,43 3.073,44 3.895,45 16.326,46 17.304,47 0.651,48 3.237,49 3.975,50 3.975,51 6.975,52 3.975,53 5.202,54 9.4,55 16.229,56 18.585,57 20.693,58 22.971,59 25.144,60 27.39,61 7.018,62 0.012,63 2.74,64 14.27,65 1,66 11.718,67 6.796}
{0 CHEMBL1803083,1 0.908,2 1,3 1.891,4 1.408,6 3.958,7 1.876,8 0.808,9 1.518,10 0.702,11 0.747,12 3.408,13 2,14 1.513,15 1.428,17 1,18 3.337,19 4.002,20 3.29,21 1.739,22 4.03,23 3.464,24 15.669,25 3.823,26 11.393,27 12.358,28 13.422,29 14.423,30 15.472,31 3.908,32 4.026,33 0.825,34 0.431,35 0.696,36 1.97,37 3.797,38 2,39 0.757,40 29.621,41 31.85,42 34.06,43 3.278,44 3.899,45 16.492,46 17.435,47 0.649,48 3.371,49 3.975,50 3.975,51 6.975,52 3.975,53 5.272,54 8.3,55 16.327,56 18.664,57 20.759,58 23.025,59 25.188,60 27.427,61 7.235,62 -0.124,63 2.794,64 14.379,65 1,66 11.863,67 7.328}
{0 CHEMBL1803084,1 0.789,2 1,3 1.914,4 1.42,6 3.966,7 1.885,8 0.956,9 1.521,10 0.677,11 0.501,12 3.577,13 2,14 1.57,15 1.438,17 1,18 3.475,19 4.006,20 3.417,21 1.709,22 4.031,23 3.65,24 15.712,25 4.279,26 11.382,27 12.325,28 13.399,29 14.389,30 15.444,31 3.915,32 4.5,33 0.631,34 0.636,35 0.789,36 2.01,37 3.787,38 2,39 0.894,40 29.645,41 31.876,42 34.087,43 3.418,44 3.907,45 16.459,46 17.471,47 0.676,48 3.509,49 3.975,50 3.975,51 6.975,52 3.975,53 5.426,54 7.7,55 16.336,56 18.689,57 20.774,58 23.048,59 25.207,60 27.451,61 7.235,62 -0.164,63 2.809,64 14.415,65 2,66 11.866,67 7.215}
{0 CHEMBL1803085,1 0.803,2 1,3 1.893,4 1.419,6 3.964,7 1.876,8 0.956,9 1.521,10 0.688,11 0.321,12 3.526,13 2,14 1.514,15 1.436,17 1,18 3.443,19 4.003,20 3.376,21 1.669,22 4.026,23 3.567,24 15.712,25 4.201,26 11.355,27 12.297,28 13.373,29 14.364,30 15.42,31 3.912,32 4.114,33 0.591,34 0.636,35 0.751,36 1.992,37 3.777,38 2,39 0.835,40 29.645,41 31.876,42 34.087,43 3.393,44 3.902,45 16.436,46 17.471,47 0.691,48 3.457,49 3.975,50 3.975,51 6.975,52 3.975,53 5.438,54 10.8,55 16.336,56 18.689,57 20.774,58 23.048,59 25.207,60 27.451,61 7.235,62 -0.139,63 2.799,64 14.415,65 1,66 11.866,67 7.222}
{0 CHEMBL1908391,1 0.905,3 1.953,4 1.814,5 8,6 4.233,7 1.927,8 1.779,9 1.508,10 0.66,11 -0.121,12 4.232,13 1,14 1.951,15 1.847,16 5,18 4.17,19 4.027,20 4.257,22 4.062,23 4.381,24 16.03,25 12.227,26 11.676,27 12.614,28 13.686,29 14.672,30 15.723,31 3.943,32 12.794,33 1.125,34 0.934,35 1.685,36 2.068,37 3.928,39 1.937,40 29.726,41 31.937,42 34.122,43 4.129,44 3.955,45 16.734,46 17.783,47 0.642,48 4.309,49 3.988,50 3.988,51 6.988,52 3.988,53 5.994,54 1.5,55 16.567,56 18.907,57 20.953,58 23.211,59 25.337,60 27.561,61 7.554,62 -0.138,63 3.336,64 14.684,65 4,66 12.146,67 5}
{0 CHEMBL1908392,1 0.906,3 1.975,4 1.835,5 17,6 4.116,7 1.953,8 2.178,9 1.548,10 0.66,11 0.752,12 4.315,14 1.997,15 1.864,16 10,18 4.315,19 4.148,20 4.439,22 4.176,23 4.417,24 16.432,25 13.536,26 12.171,27 13.226,28 14.374,29 15.477,30 16.619,31 4.073,32 15.806,33 1.097,34 1.427,35 1.978,36 2.061,37 3.916,39 2.048,40 32.257,41 34.721,42 37.181,43 4.362,44 4.064,45 17.747,46 18.269,47 0.633,48 4.386,49 4.626,50 4.626,51 7.626,52 4.626,53 6.24,54 3,55 17.605,56 20.119,57 22.463,58 24.935,59 27.349,60 29.812,61 7.832,62 0.041,63 3.352,64 15.426,65 3,66 12.764,67 5}
{0 CHEMBL1908393,1 0.902,3 2.021,4 1.817,5 17,6 4.064,7 2.007,8 2.874,9 1.546,10 0.668,11 -0.552,12 4.447,14 1.976,15 1.852,16 8,18 4.459,19 4.096,20 4.524,21 4.417,22 4.115,23 4.493,24 17.141,25 17.118,26 13.286,27 14.527,28 15.807,29 17.08,30 18.367,31 4.015,32 16.613,33 1.203,34 1.626,35 2.488,36 2.124,37 3.913,38 4,39 2.373,40 35.26,41 37.968,42 40.677,43 4.482,44 4.003,45 19.655,46 19.104,47 0.635,48 4.514,49 4.513,50 4.513,51 7.513,52 4.513,53 6.429,54 7.3,55 19.092,56 21.793,57 24.456,58 27.156,59 29.85,60 32.555,61 8.48,62 -0.054,63 3.487,64 16.534,65 1,66 13.783,67 5.699}
{0 CHEMBL1908394,1 0.742,3 1.953,4 1.683,5 9,6 4.307,7 1.925,8 2.541,9 1.58,10 0.671,11 -0.715,12 4.371,14 1.95,15 1.756,16 6,18 4.328,19 4.148,20 4.368,22 4.182,23 4.459,24 16.847,25 15.232,26 12.154,27 13.188,28 14.298,29 15.368,30 16.471,31 4.054,32 13.693,33 1.167,34 1.379,35 2.313,36 2.069,37 3.918,39 2.549,40 32.984,41 35.475,42 37.962,43 4.284,44 4.061,45 17.559,46 18.729,47 0.647,48 4.41,49 4.57,50 4.57,51 7.57,52 4.57,53 6.462,54 3,55 18.164,56 20.689,57 23.082,58 25.575,59 28.023,60 30.511,61 8.244,62 -0.086,63 3.347,64 15.9,65 3,66 13.253,67 5}
{0 CHEMBL1908395,1 0.905,3 2.011,4 1.657,5 11,6 4,7 1.984,8 1.722,9 1.539,10 0.654,11 1.089,12 4.275,13 1,14 1.885,15 1.709,16 13,18 4.261,19 4.056,20 4.392,21 2.279,22 4.093,23 4.391,24 16.189,25 14.14,26 11.937,27 12.939,28 14.042,29 15.087,30 16.18,31 3.979,32 15.464,33 1.073,34 1.354,35 2.01,36 2.103,37 3.904,38 1,39 1.968,40 30.743,41 33.056,42 35.356,43 4.276,44 3.982,45 17.249,46 17.986,47 0.612,48 4.364,49 4.07,50 4.07,51 7.07,52 4.07,53 6.187,54 3,55 16.998,56 19.398,57 21.568,58 23.904,59 26.147,60 28.463,61 7.653,62 0.065,63 3.283,64 14.982,65 2,66 12.405,67 5}
{0 CHEMBL1908396,1 0.848,3 2.02,4 1.59,5 4,6 4.213,7 2.006,8 2.441,9 1.53,10 0.669,11 -0.365,12 4.155,13 1,14 1.822,15 1.636,16 5,18 4.144,19 4.084,20 4.147,22 4.1,23 4.189,24 16.238,25 11.964,26 11.703,27 12.691,28 13.783,29 14.816,30 15.898,31 4.008,32 10.886,33 1.035,34 1.052,35 1.573,36 2.123,37 3.869,39 1.662,40 30.898,41 33.224,42 35.536,43 4.08,44 3.997,45 16.955,46 18.038,47 0.657,48 4.199,49 4.513,50 4.513,51 7.513,52 4.513,53 6.198,54 8.6,55 17.084,56 19.497,57 21.676,58 24.025,59 26.278,60 28.607,61 7.703,62 0.023,63 3.12,64 15.06,65 1,66 12.471,67 5}
{0 CHEMBL1908397,1 0.961,3 1.964,4 1.66,5 7,6 4.074,7 1.942,8 0.796,9 1.515,10 0.64,11 0.108,12 3.773,14 1.941,15 1.731,16 7,18 3.635,19 4.111,20 3.711,21 4.043,22 4.149,23 3.874,24 15.896,25 7.21,26 11.706,27 12.714,28 13.83,29 14.88,30 15.978,31 4.024,32 6.932,33 1.091,34 0.486,35 0.972,36 2.053,37 3.838,38 2,39 1.045,40 30.653,41 32.971,42 35.274,43 3.589,44 4.016,45 17.048,46 17.709,47 0.645,48 3.747,49 4.486,50 4.486,51 7.486,52 4.486,53 5.542,54 2.2,55 16.798,56 19.211,57 21.419,58 23.769,59 26.035,60 28.361,61 7.318,62 0.005,63 2.952,64 14.73,65 3,66 12.144,67 6.409}
{0 CHEMBL191384,1 0.858,3 1.873,4 1.773,5 2,6 4.135,7 1.835,8 0.921,9 1.492,10 0.657,11 1.299,12 3.785,14 1.867,15 1.806,16 4,18 3.703,19 3.994,20 3.731,22 4.026,23 3.888,24 15.837,25 6.216,26 11.259,27 12.194,28 13.276,29 14.266,30 15.325,31 3.922,32 5.56,33 0.912,34 0.827,35 1.094,36 2.018,37 3.869,39 1.179,40 30.637,41 32.971,42 35.292,43 3.662,44 3.947,45 16.344,46 17.635,47 0.697,48 3.784,49 4.065,50 4.065,51 7.065,52 4.065,53 5.589,55 16.74,56 19.157,57 21.362,58 23.72,59 25.993,60 28.332,61 7.298,62 -0.117,63 3.156,64 14.689,65 1,66 12.099,67 6.523}
{0 CHEMBL1916359,1 0.576,3 2.098,4 1.747,5 9,6 4.212,7 2.079,8 2.324,9 1.612,10 0.639,12 4.02,14 1.851,15 1.77,16 13,18 4.019,19 4.175,20 3.976,22 4.2,23 4.058,24 16.519,25 7.232,26 12.144,27 13.232,28 14.396,29 15.521,30 16.678,31 4.094,32 6.777,33 0.943,34 0.986,35 1.024,36 2.22,37 3.826,39 0.981,40 32.764,41 35.253,42 37.736,43 3.903,44 4.084,45 17.821,46 18.396,47 0.778,48 4.061,49 4.763,50 4.763,51 7.763,52 4.763,53 5.999,54 2.7,55 17.909,56 20.463,57 22.853,58 25.357,59 27.803,60 30.294,61 7.865,62 0.034,63 3.337,64 15.656,65 4,66 12.949,67 5}
{0 CHEMBL2012558,1 0.867,3 1.971,4 1.519,5 5,6 4.205,7 1.955,8 1.267,9 1.583,10 0.65,12 3.797,14 1.832,15 1.589,16 7,18 3.738,19 4.229,20 3.748,22 4.258,23 3.897,24 16.176,25 8.099,26 12.006,27 13.143,28 14.334,29 15.501,30 16.688,31 4.156,32 7.216,33 0.995,34 0.775,35 1.106,36 2.048,37 3.7,39 1.175,40 32.834,41 35.36,42 37.882,43 3.6,44 4.145,45 17.867,46 18.064,47 0.615,48 3.875,49 4.97,50 4.97,51 7.97,52 4.97,53 5.456,54 2.6,55 17.713,56 20.298,57 22.748,58 25.291,59 27.789,60 30.319,61 7.519,62 0.192,63 2.882,64 15.397,65 2,66 12.671,67 5}
{0 CHEMBL2012559,1 0.896,3 1.971,4 1.589,5 8,6 4.205,7 1.955,8 1.267,9 1.564,10 0.643,12 3.847,14 1.88,15 1.654,16 7,18 3.791,19 4.23,20 3.834,22 4.259,23 3.955,24 16.177,25 8.813,26 12.008,27 13.143,28 14.335,29 15.501,30 16.688,31 4.157,32 8.091,33 1.056,34 0.775,35 1.177,36 2.051,37 3.732,39 1.261,40 32.834,41 35.36,42 37.882,43 3.683,44 4.145,45 17.867,46 18.065,47 0.608,48 3.935,49 4.97,50 4.97,51 7.97,52 4.97,53 5.517,54 2.4,55 17.713,56 20.298,57 22.748,58 25.291,59 27.789,60 30.319,61 7.519,62 0.178,63 2.912,64 15.398,65 2,66 12.671,67 5}
{0 CHEMBL2012560,1 0.95,3 1.967,4 1.583,5 5,6 4.197,7 1.951,8 0.791,9 1.541,10 0.65,12 3.726,14 1.859,15 1.648,16 5,18 3.641,19 4.224,20 3.656,22 4.253,23 3.839,24 16.028,25 7.191,26 11.865,27 12.988,28 14.174,29 15.329,30 16.508,31 4.149,32 6.312,33 1.015,34 0.688,35 0.998,36 2.046,37 3.706,39 1.091,40 32.476,41 34.976,42 37.471,43 3.52,44 4.138,45 17.676,46 17.907,47 0.615,48 3.774,49 4.928,50 4.928,51 7.928,52 4.928,53 5.393,54 2.6,55 17.502,56 20.067,57 22.492,58 25.011,59 27.483,60 29.987,61 7.38,62 0.16,63 2.804,64 15.212,65 2,66 12.501,67 5}
{0 CHEMBL2012561,1 0.907,3 1.977,4 1.602,5 12,6 4.209,7 1.96,8 1.427,9 1.579,10 0.63,12 3.994,14 1.919,15 1.669,16 9,18 4.006,19 4.234,20 4.117,22 4.263,23 4.102,24 16.3,25 11.732,26 12.128,27 13.263,28 14.454,29 15.621,30 16.809,31 4.161,32 11.293,33 1.138,34 1.226,35 1.516,36 2.065,37 3.75,39 1.516,40 33.006,41 35.543,42 38.075,43 3.953,44 4.15,45 17.99,46 18.189,47 0.595,48 4.136,49 4.976,50 4.976,51 7.976,52 4.976,53 5.68,54 2.1,55 17.844,56 20.433,57 22.888,58 25.438,59 27.943,60 30.482,61 7.642,62 0.081,63 3.02,64 15.524,65 2,66 12.796,67 5}
{0 CHEMBL2012562,1 0.923,3 1.974,4 1.593,5 10,6 4.207,7 1.957,8 1.307,9 1.559,10 0.636,12 3.917,14 1.899,15 1.66,16 8,18 3.904,19 4.232,20 3.986,22 4.261,23 4.02,24 16.207,25 10.266,26 12.035,27 13.169,28 14.362,29 15.528,30 16.716,31 4.159,32 9.693,33 1.109,34 0.917,35 1.346,36 2.056,37 3.75,39 1.388,40 32.897,41 35.428,42 37.954,43 3.827,44 4.148,45 17.896,46 18.095,47 0.601,48 4.04,49 4.972,50 4.972,51 7.972,52 4.972,53 5.596,54 2.2,55 17.758,56 20.345,57 22.798,58 25.343,59 27.845,60 30.378,61 7.557,62 0.166,63 3.003,64 15.439,65 2,66 12.713,67 5}
{0 CHEMBL2012563,1 0.853,3 1.97,4 1.587,5 8,6 4.204,7 1.954,8 1.227,9 1.573,10 0.638,12 3.77,14 1.878,15 1.653,16 7,18 3.709,19 4.229,20 3.74,22 4.258,23 3.876,24 16.156,25 8.263,26 12.001,27 13.137,28 14.329,29 15.496,30 16.684,31 4.156,32 7.203,33 1.053,34 0.712,35 1.074,36 2.05,37 3.723,39 1.146,40 32.831,41 35.357,42 37.879,43 3.582,44 4.145,45 17.863,46 18.047,47 0.615,48 3.845,49 4.97,50 4.97,51 7.97,52 4.97,53 5.478,54 2.6,55 17.704,56 20.292,57 22.744,58 25.287,59 27.786,60 30.316,61 7.489,62 0.159,63 2.857,64 15.385,65 2,66 12.653,67 5}
{0 CHEMBL2012564,1 0.815,3 1.971,4 1.587,5 8,6 4.206,7 1.953,8 1.227,9 1.573,10 0.638,12 3.751,14 1.876,15 1.653,16 7,18 3.691,19 4.23,20 3.7,22 4.26,23 3.848,24 16.156,25 8.235,26 11.994,27 13.13,28 14.323,29 15.49,30 16.678,31 4.156,32 7.085,33 1.052,34 0.712,35 1.201,36 2.05,37 3.73,39 1.24,40 32.831,41 35.357,42 37.879,43 3.553,44 4.145,45 17.857,46 18.047,47 0.623,48 3.819,49 4.97,50 4.97,51 7.97,52 4.97,53 5.498,55 17.704,56 20.292,57 22.744,58 25.287,59 27.786,60 30.316,61 7.489,62 0.113,63 2.858,64 15.385,65 2,66 12.653,67 5}
{0 CHEMBL2012565,1 1.023,3 1.985,4 1.717,5 8,6 4.716,7 1.97,8 1.507,9 1.566,10 0.635,12 3.958,14 1.882,15 1.7,16 7,18 3.933,19 4.237,20 4.001,22 4.266,23 4.069,24 16.422,25 10.602,26 12.244,27 13.365,28 14.536,29 15.687,30 16.857,31 4.162,32 9.859,33 1.072,34 0.914,35 1.388,36 2.064,37 3.75,39 1.427,40 32.903,41 35.417,42 37.929,43 3.841,44 4.156,45 18.022,46 18.305,47 0.618,48 4.062,49 4.971,50 4.971,51 7.971,52 4.971,53 5.797,54 4.3,55 17.915,56 20.464,57 22.893,58 25.41,59 27.889,60 30.402,61 7.883,62 0.217,63 3.027,64 15.611,65 2,66 12.945,67 5}
{0 CHEMBL2012566,1 0.814,3 1.974,4 1.633,5 11,6 4.206,7 1.958,8 1.507,9 1.566,10 0.625,12 4.016,14 1.939,15 1.689,16 13,18 4,19 4.231,20 4.085,22 4.26,23 4.147,24 16.422,25 11.757,26 12.251,27 13.373,28 14.543,29 15.693,30 16.862,31 4.158,32 9.723,33 1.118,34 0.914,35 1.516,36 2.054,37 3.75,39 1.504,40 32.903,41 35.417,42 37.929,43 3.916,44 4.147,45 18.026,46 18.305,47 0.59,48 4.145,49 4.97,50 4.97,51 7.97,52 4.97,53 5.698,54 2,55 17.915,56 20.464,57 22.893,58 25.41,59 27.889,60 30.402,61 7.883,62 0.114,63 3.015,64 15.611,65 2,66 12.945,67 5}
{0 CHEMBL2012567,1 0.896,3 1.97,4 1.588,5 8,6 4.208,7 1.955,8 1.392,9 1.574,10 0.643,12 3.881,14 1.883,15 1.654,16 8,18 3.853,19 4.231,20 3.898,22 4.259,23 3.97,24 16.279,25 9.572,26 12.105,27 13.254,28 14.455,29 15.633,30 16.83,31 4.157,32 8.523,33 1.056,34 0.778,35 1.258,36 2.05,37 3.728,39 1.307,40 33.152,41 35.7,42 38.245,43 3.734,44 4.145,45 18.019,46 18.183,47 0.608,48 3.987,49 5.008,50 5.008,51 8.008,52 5.008,53 5.576,54 2.4,55 17.906,56 20.507,57 22.982,58 25.543,59 28.064,60 30.614,61 7.597,62 0.178,63 2.999,64 15.558,65 2,66 12.816,67 5.155}
{0 CHEMBL2012568,1 0.896,3 1.971,4 1.589,5 10,6 4.205,7 1.955,8 1.267,9 1.564,10 0.643,12 3.849,14 1.881,15 1.654,16 7,18 3.794,19 4.23,20 3.835,22 4.259,23 3.956,24 16.177,25 8.982,26 12.009,27 13.145,28 14.337,29 15.504,30 16.691,31 4.157,32 7.76,33 1.056,34 0.775,35 1.174,36 2.05,37 3.731,39 1.257,40 32.834,41 35.36,42 37.882,43 3.678,44 4.145,45 17.871,46 18.065,47 0.608,48 3.941,49 4.971,50 4.971,51 7.971,52 4.971,53 5.524,54 2.4,55 17.713,56 20.298,57 22.748,58 25.291,59 27.789,60 30.319,61 7.519,62 0.178,63 2.933,64 15.398,65 2,66 12.671,67 5.31}
{0 CHEMBL2012569,1 0.896,3 1.971,4 1.588,5 8,6 4.208,7 1.955,8 1.392,9 1.573,10 0.643,12 3.878,14 1.88,15 1.654,16 6,18 3.856,19 4.231,20 3.916,22 4.259,23 3.963,24 16.279,25 9.902,26 12.087,27 13.233,28 14.431,29 15.606,30 16.8,31 4.157,32 8.843,33 1.057,34 0.813,35 1.261,36 2.051,37 3.73,39 1.31,40 33.152,41 35.7,42 38.245,43 3.756,44 4.145,45 17.987,46 18.183,47 0.608,48 3.987,49 5.002,50 5.002,51 8.002,52 5.002,53 5.58,54 2.4,55 17.906,56 20.507,57 22.982,58 25.543,59 28.063,60 30.614,61 7.597,62 0.178,63 2.959,64 15.558,65 2,66 12.816,67 5}
{0 CHEMBL2012570,1 0.86,2 1,3 1.96,4 1.585,5 8,6 4.214,7 1.946,8 1.373,9 1.572,10 0.682,12 3.857,13 2,14 1.864,15 1.649,16 6,18 3.798,19 4.236,20 3.817,22 4.263,23 3.944,24 16.319,25 8.48,26 12.119,27 13.25,28 14.437,29 15.6,30 16.784,31 4.161,32 7.914,33 1.054,34 0.768,35 1.145,36 2.049,37 3.748,39 1.224,40 32.886,41 35.411,42 37.931,43 3.703,44 4.148,45 17.961,46 18.203,47 0.627,48 3.91,49 4.982,50 4.982,51 7.982,52 4.982,53 5.525,54 4.9,55 17.811,56 20.387,57 22.823,58 25.358,59 27.848,60 30.374,61 7.656,62 0.158,63 2.908,64 15.516,65 2,66 12.796,67 5.319}
{0 CHEMBL2012571,1 0.686,3 1.969,4 1.589,5 8,6 4.251,7 1.956,8 1.663,9 1.603,10 0.648,12 3.935,14 1.866,15 1.653,16 7,18 3.873,19 4.232,20 3.919,22 4.258,23 4.04,24 16.377,25 9.582,26 12.073,27 13.212,28 14.405,29 15.575,30 16.765,31 4.161,32 8.97,33 1.055,34 0.948,35 1.14,36 2.048,37 3.731,39 1.217,40 33.195,41 35.745,42 38.29,43 3.773,44 4.151,45 17.947,46 18.277,47 0.627,48 4.019,49 5.015,50 5.015,51 8.015,52 5.015,53 5.634,54 2.4,55 17.958,56 20.561,57 23.027,58 25.589,59 28.107,60 30.658,61 7.689,62 0.178,63 3.069,64 15.625,65 2,66 12.882,67 5.097}
{0 CHEMBL2012572,1 0.927,3 1.971,4 1.603,5 8,6 4.205,7 1.955,8 1.267,9 1.554,10 0.648,12 3.895,14 1.891,15 1.67,16 7,18 3.842,19 4.23,20 3.894,22 4.259,23 4.013,24 16.178,25 9.517,26 12.009,27 13.143,28 14.335,29 15.501,30 16.688,31 4.157,32 8.529,33 1.07,34 0.775,35 1.257,36 2.051,37 3.732,39 1.34,40 32.834,41 35.36,42 37.882,43 3.735,44 4.145,45 17.867,46 18.066,47 0.601,48 3.993,49 4.97,50 4.97,51 7.97,52 4.97,53 5.549,54 2.2,55 17.713,56 20.299,57 22.748,58 25.291,59 27.789,60 30.319,61 7.519,62 0.156,63 2.981,64 15.398,65 2,66 12.671,67 5}
{0 CHEMBL2012573,1 0.914,3 1.971,4 1.624,5 8,6 4.205,7 1.955,8 1.347,9 1.562,10 0.652,12 3.953,14 1.906,15 1.692,16 7,18 3.891,19 4.23,20 3.951,22 4.259,23 4.09,24 16.197,25 10.207,26 12.016,27 13.147,28 14.338,29 15.503,30 16.689,31 4.157,32 8.956,33 1.086,34 0.775,35 1.337,36 2.052,37 3.732,39 1.419,40 32.834,41 35.36,42 37.882,43 3.785,44 4.146,45 17.868,46 18.079,47 0.595,48 4.049,49 4.97,50 4.97,51 7.97,52 4.97,53 5.594,54 2.1,55 17.715,56 20.299,57 22.749,58 25.291,59 27.789,60 30.319,61 7.557,62 0.059,63 3.017,64 15.402,65 2,66 12.679,67 5}
{0 CHEMBL2012574,1 0.712,3 1.97,4 1.588,5 5,6 4.212,7 1.954,8 1.634,9 1.586,10 0.656,12 3.912,14 1.855,15 1.652,16 5,18 3.896,19 4.233,20 3.817,22 4.261,23 3.946,24 16.675,25 9.109,26 12.197,27 13.334,28 14.523,29 15.69,30 16.877,31 4.158,32 8.42,33 1.035,34 1.536,35 1.694,36 2.052,37 3.747,39 1.858,40 33.637,41 36.201,42 38.761,43 3.787,44 4.145,45 18.059,46 18.606,47 0.635,48 3.918,49 4.984,50 4.984,51 7.984,52 4.984,53 6.009,54 2.4,55 18.323,56 20.926,57 23.418,58 25.988,59 28.522,60 31.085,61 8.017,62 0.134,63 3.014,64 15.939,65 2,66 13.222,67 4.824}
{0 CHEMBL2012575,1 0.675,3 1.968,4 1.586,5 5,6 4.211,7 1.953,8 1.594,9 1.594,10 0.652,12 3.841,14 1.853,15 1.65,16 5,18 3.822,19 4.232,20 3.722,22 4.26,23 3.865,24 16.663,25 8.557,26 12.191,27 13.329,28 14.518,29 15.686,30 16.874,31 4.157,32 7.516,33 1.032,34 1.473,35 1.586,36 2.051,37 3.739,39 1.757,40 33.636,41 36.199,42 38.76,43 3.696,44 4.144,45 18.055,46 18.596,47 0.645,48 3.827,49 4.984,50 4.984,51 7.984,52 4.984,53 5.985,54 2.6,55 18.318,56 20.923,57 23.416,58 25.986,59 28.521,60 31.084,61 7.999,62 0.117,63 2.895,64 15.932,65 2,66 13.212,67 5.071}
{0 CHEMBL215152,1 0.895,3 2.002,4 1.654,5 3,6 4.047,7 1.978,8 1.449,9 1.492,10 0.662,11 -0.295,12 4.167,14 1.961,15 1.724,16 6,18 4.136,19 4.079,20 4.138,22 4.117,23 4.241,24 15.924,25 11.702,26 11.537,27 12.481,28 13.568,29 14.57,30 15.641,31 3.985,32 9.258,33 1.063,34 0.962,35 1.666,36 2.118,37 3.921,39 1.811,40 30.397,41 32.722,42 35.033,43 4.06,44 3.972,45 16.675,46 17.682,47 0.627,48 4.209,49 4.464,50 4.464,51 7.464,52 4.464,53 6.206,54 4.5,55 16.637,56 19.036,57 21.191,58 23.533,59 25.78,60 28.107,61 7.466,62 -0.012,63 3.361,64 14.676,65 1,66 12.104,67 5}
{0 CHEMBL221959,1 0.86,3 1.902,4 1.486,5 4,6 4.064,7 1.851,8 1.217,9 1.577,10 0.696,11 -0.09,12 3.897,13 1,14 1.709,15 1.53,16 2,18 3.869,19 4.1,20 3.916,22 4.15,23 3.998,24 16.115,25 8.631,26 11.648,27 12.682,28 13.781,29 14.846,30 15.938,31 3.974,32 7.42,33 0.847,34 0.903,35 1.307,36 2.081,37 3.642,39 1.405,40 31.479,41 33.879,42 36.264,43 3.789,44 3.952,45 17.017,46 17.96,47 0.617,48 4.009,49 4.474,50 4.474,51 7.474,52 4.474,53 5.772,54 2.3,55 17.192,56 19.673,57 21.945,58 24.369,59 26.705,60 29.11,61 7.483,62 -0.183,63 3.067,64 15.061,65 1,66 12.417,67 5}
{0 CHEMBL223360,1 0.71,3 2.013,4 1.755,5 4,6 4.103,7 1.995,8 1.559,9 1.563,10 0.634,11 -0.515,12 3.912,14 1.895,15 1.785,16 7,18 3.812,19 4.134,20 3.733,22 4.17,23 3.963,24 16.164,25 7.478,26 11.984,27 13.035,28 14.176,29 15.272,30 16.408,31 4.056,32 6.136,33 0.989,34 0.847,35 1.257,36 2.08,37 3.888,39 1.362,40 31.763,41 34.196,42 36.623,43 3.668,44 4.049,45 17.527,46 17.991,47 0.672,48 3.86,49 4.621,50 4.621,51 7.621,52 4.621,53 6.017,54 2.2,55 17.278,56 19.767,57 22.085,58 24.529,59 26.914,60 29.348,61 7.594,62 -0.047,63 3.048,64 15.123,65 4,66 12.482,67 5}
{0 CHEMBL230011,1 0.628,3 2.008,4 1.749,5 6,6 4.075,7 1.982,8 1.933,9 1.571,10 0.673,12 3.817,14 1.845,15 1.786,16 4,18 3.846,19 4.091,20 3.893,22 4.128,23 3.821,24 16.166,25 6.25,26 11.822,27 12.853,28 13.978,29 15.053,30 16.17,31 3.997,32 6.594,33 0.844,34 1.035,35 1.188,36 2.14,37 3.874,39 1.192,40 31.545,41 33.945,42 36.334,43 3.878,44 3.982,45 17.267,46 17.992,47 0.692,48 3.849,49 4.578,50 4.578,51 7.578,52 4.578,53 5.791,54 5,55 17.239,56 19.729,57 21.999,58 24.426,59 26.766,60 29.172,61 7.591,62 -0.037,63 2.846,64 15.131,65 2,66 12.468,67 5.252}
{0 CHEMBL2309006,1 0.693,3 2.037,4 1.883,5 21,6 4.355,7 2.029,8 3.731,9 1.71,10 0.705,11 -0.056,12 4.624,13 1,14 1.995,15 1.917,16 16,18 4.657,19 4.369,20 4.661,22 4.392,23 4.645,24 17.879,25 17.223,26 13.683,27 14.93,28 16.204,29 17.471,30 18.749,31 4.301,32 17.535,33 1.176,34 2.737,35 2.417,36 2.081,37 3.874,39 2.483,40 36.969,41 39.792,42 42.616,43 4.604,44 4.288,45 20.028,46 19.921,47 0.679,48 4.696,49 5.287,50 5.287,51 8.287,52 5.287,53 6.412,54 7.4,55 20.164,56 22.975,57 25.733,58 28.541,59 31.338,60 34.154,61 9.032,62 0.063,63 3.208,64 17.511,65 6,66 14.629,67 7.658}
{0 CHEMBL2309609,1 0.77,3 2.036,4 1.882,5 21,6 4.352,7 2.028,8 4.473,9 1.667,10 0.692,11 -0.107,12 4.88,13 1,14 2.019,15 1.907,16 18,18 4.969,19 4.367,20 5.063,22 4.39,23 4.904,24 17.688,25 27.096,26 13.47,27 14.666,28 15.901,29 17.125,30 18.365,31 4.3,32 28.599,33 1.166,34 3.053,35 3.793,36 2.095,37 3.972,39 3.522,40 35.854,41 38.57,42 41.288,43 4.989,44 4.287,45 19.604,46 19.658,47 0.668,48 5.013,49 5.285,50 5.285,51 8.285,52 5.285,53 6.721,54 5.5,55 19.696,56 22.418,57 25.051,58 27.756,59 30.439,60 33.148,61 8.936,62 0.047,63 3.429,64 17.185,65 7,66 14.362,67 5}
{0 CHEMBL2321945,1 0.548,3 1.931,4 1.555,5 5,6 6.881,7 1.915,8 1.797,9 1.659,10 0.646,11 -1.347,12 3.775,14 1.613,15 1.576,16 6,18 3.594,19 4.156,20 3.475,22 4.178,23 3.792,24 16.499,25 4.857,26 12.413,27 13.538,28 14.714,29 15.867,30 17.04,31 4.087,32 4.394,33 0.714,34 1.094,35 0.624,36 1.99,37 3.54,39 0.795,40 32.634,41 35.117,42 37.594,43 3.468,44 4.082,45 18.207,46 18.371,47 0.759,48 3.564,49 4.696,50 4.696,51 7.696,52 4.696,53 5.916,54 12.1,55 17.833,56 20.376,57 22.754,58 25.25,59 27.687,60 30.171,61 7.842,62 -0.152,63 3.009,64 15.595,65 4,66 12.902,67 5.886}
{0 CHEMBL2321946,1 0.502,3 1.95,4 1.566,5 5,6 4.148,7 1.932,8 2.004,9 1.665,10 0.657,11 -2.079,12 3.881,14 1.626,15 1.586,16 4,18 3.753,19 4.167,20 3.484,22 4.191,23 3.794,24 16.882,25 5.477,26 12.618,27 13.749,28 14.926,29 16.083,30 17.259,31 4.092,32 4.805,33 0.731,34 1.744,35 1.026,36 2.036,37 3.588,39 1.462,40 33.404,41 35.923,42 38.438,43 3.565,44 4.079,45 18.429,46 18.794,47 0.741,48 3.626,49 4.721,50 4.721,51 7.721,52 4.721,53 6.28,54 11.1,55 18.369,56 20.935,57 23.37,58 25.898,59 28.381,60 30.9,61 8.225,62 -0.15,63 3.006,64 16.047,65 5,66 13.356,67 5}
{0 CHEMBL2321947,1 0.551,3 1.931,4 1.554,5 5,6 6.881,7 1.915,8 1.757,9 1.644,10 0.641,11 -0.052,12 3.769,14 1.613,15 1.576,16 6,18 3.602,19 4.156,20 3.493,22 4.178,23 3.816,24 16.435,25 5.37,26 12.355,27 13.484,28 14.666,29 15.824,30 17.002,31 4.087,32 4.442,33 0.713,34 1.032,35 0.699,36 1.99,37 3.544,39 0.807,40 32.631,41 35.116,42 37.594,43 3.46,44 4.082,45 18.173,46 18.309,47 0.731,48 3.596,49 4.696,50 4.696,51 7.696,52 4.696,53 5.822,54 8.8,55 17.805,56 20.355,57 22.739,58 25.239,59 27.679,60 30.166,61 7.781,62 -0.151,63 2.954,64 15.559,65 4,66 12.857,67 5}
{0 CHEMBL2321949,1 0.557,3 1.953,4 1.604,5 5,6 4.185,7 1.935,8 1.778,9 1.641,10 0.66,12 3.851,14 1.687,15 1.635,16 4,18 3.747,19 4.208,20 3.504,22 4.235,23 3.789,24 16.828,25 5.705,26 12.472,27 13.602,28 14.78,29 15.935,30 17.11,31 4.131,32 4.957,33 0.822,34 1.543,35 1.072,36 2.039,37 3.571,39 1.518,40 33.455,41 35.977,42 38.494,43 3.561,44 4.119,45 18.278,46 18.75,47 0.722,48 3.645,49 4.778,50 4.778,51 7.778,52 4.778,53 6.149,54 5.7,55 18.384,56 20.956,57 23.403,58 25.936,59 28.425,60 30.948,61 8.165,62 -0.16,63 2.986,64 16.042,65 4,66 13.344,67 5}
{0 CHEMBL2321950,1 0.539,3 1.94,4 1.624,5 5,6 6.881,7 1.924,8 1.736,9 1.649,10 0.652,12 3.881,14 1.759,15 1.66,16 6,18 3.741,19 4.209,20 3.662,22 4.236,23 3.936,24 16.583,25 6.666,26 12.356,27 13.493,28 14.679,29 15.842,30 17.024,31 4.135,32 6.299,33 0.897,34 1.011,35 0.923,36 2.015,37 3.536,39 1.025,40 33.199,41 35.727,42 38.249,43 3.609,44 4.127,45 18.199,46 18.481,47 0.719,48 3.784,49 4.845,50 4.845,51 7.845,52 4.845,53 5.821,54 5.7,55 18.109,56 20.694,57 23.131,58 25.671,59 28.16,60 30.688,61 7.888,62 -0.168,63 3,64 15.8,65 3,66 13.068,67 5}
{0 CHEMBL2321951,1 0.683,3 1.943,4 1.593,5 5,6 4.179,7 1.927,8 1.606,9 1.63,10 0.66,11 -0.503,12 3.854,14 1.688,15 1.627,16 4,18 3.768,19 4.204,20 3.663,22 4.232,23 3.843,24 16.455,25 6.393,26 12.34,27 13.454,28 14.623,29 15.767,30 16.933,31 4.128,32 5.61,33 0.808,34 1.237,35 0.992,36 2.03,37 3.6,39 1.057,40 32.65,41 35.135,42 37.615,43 3.668,44 4.117,45 18.09,46 18.326,47 0.699,48 3.741,49 4.742,50 4.742,51 7.742,52 4.742,53 5.892,54 10.5,55 17.831,56 20.372,57 22.759,58 25.255,59 27.698,60 30.183,61 7.813,62 -0.186,63 2.952,64 15.58,65 4,66 12.89,67 6}
{0 CHEMBL2321952,1 0.635,3 1.943,4 1.593,5 5,6 4.179,7 1.927,8 1.606,9 1.63,10 0.656,11 -1.091,12 3.793,14 1.688,15 1.627,16 4,18 3.685,19 4.204,20 3.536,22 4.232,23 3.779,24 16.436,25 5.255,26 12.331,27 13.445,28 14.615,29 15.759,30 16.925,31 4.128,32 4.779,33 0.808,34 1.209,35 0.874,36 2.028,37 3.577,39 0.987,40 32.646,41 35.132,42 37.612,43 3.57,44 4.116,45 18.083,46 18.309,47 0.715,48 3.642,49 4.742,50 4.742,51 7.742,52 4.742,53 5.873,54 11.4,55 17.817,56 20.36,57 22.749,58 25.247,59 27.691,60 30.178,61 7.794,62 -0.168,63 2.894,64 15.563,65 4,66 12.871,67 6.456}
{0 CHEMBL2321953,1 0.555,3 1.943,4 1.595,5 5,6 6.881,7 1.928,8 1.922,9 1.652,10 0.654,11 -0.509,12 3.928,14 1.675,15 1.626,16 6,18 3.814,19 4.205,20 3.73,22 4.231,23 3.947,24 16.544,25 7.054,26 12.36,27 13.475,28 14.645,29 15.789,30 16.956,31 4.132,32 6.429,33 0.808,34 1.292,35 0.991,36 2.029,37 3.599,39 1.052,40 32.768,41 35.259,42 37.744,43 3.72,44 4.124,45 18.114,46 18.418,47 0.726,48 3.799,49 4.77,50 4.77,51 7.77,52 4.77,53 5.928,54 10.5,55 17.922,56 20.469,57 22.858,58 25.359,59 27.806,60 30.296,61 7.897,62 -0.209,63 3.152,64 15.67,65 4,66 12.975,67 5}
{0 CHEMBL2321954,1 0.559,3 1.953,4 1.604,5 5,6 4.19,7 1.936,8 2.129,9 1.661,10 0.664,11 -0.628,12 4.019,14 1.687,15 1.635,16 4,18 3.943,19 4.212,20 3.737,22 4.238,23 3.949,24 16.913,25 7.275,26 12.575,27 13.699,28 14.87,29 16.021,30 17.191,31 4.136,32 6.306,33 0.822,34 1.942,35 1.285,36 2.04,37 3.621,39 1.715,40 33.468,41 35.989,42 38.505,43 3.795,44 4.123,45 18.355,46 18.826,47 0.713,48 3.848,49 4.783,50 4.783,51 7.783,52 4.783,53 6.289,54 9.8,55 18.422,56 20.988,57 23.427,58 25.957,59 28.442,60 30.963,61 8.263,62 -0.171,63 3.152,64 16.095,65 5,66 13.404,67 5}
{0 CHEMBL2321955,1 0.538,3 1.953,4 1.604,5 5,6 4.189,7 1.936,8 2.089,9 1.649,10 0.657,12 3.924,14 1.687,15 1.635,16 4,18 3.828,19 4.21,20 3.578,22 4.237,23 3.859,24 16.859,25 5.785,26 12.517,27 13.644,28 14.82,29 15.974,30 17.148,31 4.135,32 5.063,33 0.822,34 1.765,35 1.163,36 2.039,37 3.602,39 1.606,40 33.463,41 35.984,42 38.501,43 3.652,44 4.123,45 18.315,46 18.776,47 0.744,48 3.718,49 4.783,50 4.783,51 7.783,52 4.783,53 6.218,54 5.6,55 18.397,56 20.968,57 23.413,58 25.945,59 28.433,60 30.955,61 8.21,62 -0.164,63 3.08,64 16.062,65 5,66 13.365,67 5}
{0 CHEMBL2321956,1 0.554,3 1.953,4 1.604,5 5,6 4.192,7 1.936,8 2.059,9 1.609,10 0.667,12 4.022,14 1.687,15 1.635,16 4,18 3.952,19 4.214,20 3.719,22 4.242,23 3.952,24 16.932,25 6.29,26 12.586,27 13.706,28 14.878,29 16.027,30 17.197,31 4.137,32 5.438,33 0.822,34 1.859,35 1.308,36 2.039,37 3.867,39 1.767,40 33.473,41 35.993,42 38.508,43 3.797,44 4.124,45 18.36,46 18.843,47 0.733,48 3.847,49 4.784,50 4.784,51 7.784,52 4.784,53 6.275,54 5,55 18.438,56 21.003,57 23.439,58 25.967,59 28.45,60 30.969,61 8.281,62 -0.156,63 3.211,64 16.115,65 5,66 13.425,67 5}
{0 CHEMBL2321957,1 0.545,3 1.943,4 1.624,5 5,6 6.881,7 1.929,8 2.087,9 1.671,10 0.657,11 -0.506,12 4.045,14 1.759,15 1.66,16 6,18 3.938,19 4.213,20 3.864,22 4.239,23 4.075,24 16.691,25 8.294,26 12.471,27 13.6,28 14.779,29 15.936,30 17.112,31 4.14,32 7.723,33 0.897,34 1.41,35 1.165,36 2.029,37 3.599,39 1.203,40 33.216,41 35.742,42 38.263,43 3.834,44 4.131,45 18.283,46 18.579,47 0.71,48 3.962,49 4.848,50 4.848,51 7.848,52 4.848,53 6.011,54 9.8,55 18.157,56 20.735,57 23.163,58 25.698,59 28.182,60 30.707,61 8.015,62 -0.202,63 3.163,64 15.867,65 4,66 13.146,67 5}
{0 CHEMBL2321958,1 0.541,3 1.943,4 1.624,5 5,6 6.881,7 1.928,8 2.087,9 1.669,10 0.654,11 -1.094,12 3.994,14 1.759,15 1.66,16 6,18 3.869,19 4.212,20 3.762,22 4.238,23 4.025,24 16.676,25 7.13,26 12.463,27 13.592,28 14.772,29 15.929,30 17.106,31 4.139,32 6.899,33 0.897,34 1.382,35 1.046,36 2.027,37 3.578,39 1.133,40 33.214,41 35.74,42 38.261,43 3.752,44 4.131,45 18.277,46 18.565,47 0.726,48 3.883,49 4.848,50 4.848,51 7.848,52 4.848,53 5.994,54 10.5,55 18.148,56 20.727,57 23.156,58 25.693,59 28.178,60 30.704,61 7.999,62 -0.188,63 3.112,64 15.854,65 4,66 13.132,67 6.658}
{0 CHEMBL2321959,1 0.635,3 1.942,4 1.595,5 5,6 4.179,7 1.926,8 1.606,9 1.63,10 0.656,11 -1.066,12 3.789,14 1.688,15 1.628,16 4,18 3.672,19 4.204,20 3.532,22 4.232,23 3.774,24 16.436,25 5.438,26 12.329,27 13.441,28 14.611,29 15.753,30 16.919,31 4.128,32 4.66,33 0.809,34 1.122,35 0.852,36 2.029,37 3.577,39 0.996,40 32.639,41 35.124,42 37.604,43 3.553,44 4.116,45 18.076,46 18.308,47 0.715,48 3.635,49 4.741,50 4.741,51 7.741,52 4.741,53 5.902,54 11.4,55 17.814,56 20.356,57 22.744,58 25.241,59 27.685,60 30.171,61 7.794,62 -0.168,63 2.984,64 15.561,65 4,66 12.871,67 5.721}
{0 CHEMBL2321960,1 0.555,3 1.942,4 1.596,5 5,6 6.881,7 1.927,8 1.922,9 1.652,10 0.654,11 -0.484,12 3.925,14 1.675,15 1.627,16 6,18 3.802,19 4.205,20 3.721,22 4.231,23 3.942,24 16.544,25 7.286,26 12.358,27 13.471,28 14.64,29 15.784,30 16.949,31 4.132,32 6.048,33 0.809,34 1.206,35 0.969,36 2.03,37 3.599,39 1.063,40 32.762,41 35.252,42 37.736,43 3.701,44 4.124,45 18.107,46 18.418,47 0.726,48 3.793,49 4.769,50 4.769,51 7.769,52 4.769,53 5.951,54 10.5,55 17.92,56 20.465,57 22.853,58 25.354,59 27.8,60 30.29,61 7.897,62 -0.209,63 3.119,64 15.668,65 4,66 12.975,67 5}
{0 CHEMBL2321962,1 0.554,3 1.942,4 1.596,5 5,6 6.881,7 1.926,8 1.922,9 1.653,10 0.65,11 -1.072,12 3.867,14 1.675,15 1.627,16 6,18 3.722,19 4.205,20 3.608,22 4.231,23 3.884,24 16.527,25 6.083,26 12.349,27 13.463,28 14.632,29 15.776,30 16.942,31 4.132,32 5.35,33 0.809,34 1.178,35 0.845,36 2.028,37 3.576,39 0.997,40 32.758,41 35.249,42 37.734,43 3.611,44 4.124,45 18.1,46 18.401,47 0.744,48 3.699,49 4.769,50 4.769,51 7.769,52 4.769,53 5.938,54 11.4,55 17.907,56 20.454,57 22.845,58 25.347,59 27.794,60 30.285,61 7.879,62 -0.191,63 3.037,64 15.653,65 4,66 12.958,67 5.77}
{0 CHEMBL2321963,1 0.518,3 1.953,4 1.606,5 5,6 4.19,7 1.936,8 2.129,9 1.661,10 0.661,11 -1.191,12 3.964,14 1.687,15 1.636,16 4,18 3.863,19 4.211,20 3.616,22 4.238,23 3.887,24 16.902,25 6.336,26 12.566,27 13.689,28 14.86,29 16.01,30 17.181,31 4.135,32 5.4,33 0.823,34 1.827,35 1.165,36 2.04,37 3.606,39 1.62,40 33.463,41 35.984,42 38.501,43 3.695,44 4.123,45 18.345,46 18.815,47 0.729,48 3.753,49 4.783,50 4.783,51 7.783,52 4.783,53 6.296,54 10.5,55 18.412,56 20.98,57 23.42,58 25.95,59 28.436,60 30.957,61 8.25,62 -0.162,63 3.037,64 16.084,65 5,66 13.392,67 5}
{0 CHEMBL2321966,1 0.532,3 1.936,4 1.592,5 5,6 6.881,7 1.92,8 1.611,9 1.655,10 0.648,11 0.14,12 3.79,14 1.74,15 1.623,16 6,18 3.621,19 4.166,20 3.539,22 4.189,23 3.849,24 16.556,25 5.765,26 12.42,27 13.565,28 14.757,29 15.927,30 17.115,31 4.096,32 5.22,33 0.856,34 0.928,35 0.73,36 2.003,37 3.532,39 0.81,40 33.121,41 35.646,42 38.166,43 3.472,44 4.09,45 18.296,46 18.453,47 0.731,48 3.667,49 4.809,50 4.809,51 7.809,52 4.809,53 5.779,54 6.1,55 18.049,56 20.633,57 23.064,58 25.601,59 28.086,60 30.612,61 7.851,62 -0.128,63 2.857,64 15.751,65 3,66 13.018,67 5}
{0 CHEMBL2321967,1 0.672,3 1.935,4 1.553,5 5,6 4.128,7 1.913,8 1.481,9 1.638,10 0.656,11 -0.702,12 3.761,14 1.628,15 1.577,16 4,18 3.651,19 4.155,20 3.531,22 4.179,23 3.747,24 16.424,25 5.777,26 12.406,27 13.53,28 14.706,29 15.859,30 17.033,31 4.079,32 4.769,33 0.714,34 1.153,35 0.802,36 2.013,37 3.561,39 0.856,40 32.509,41 34.985,42 37.454,43 3.523,44 4.068,45 18.2,46 18.293,47 0.709,48 3.617,49 4.635,50 4.635,51 7.635,52 4.635,53 5.872,54 11.1,55 17.751,56 20.287,57 22.658,58 25.147,59 27.577,60 30.053,61 7.774,62 -0.148,63 2.833,64 15.517,65 4,66 12.829,67 5}
{0 CHEMBL2321968,1 0.62,3 1.935,4 1.553,5 5,6 4.128,7 1.913,8 1.481,9 1.636,10 0.652,11 -1.398,12 3.693,14 1.628,15 1.577,16 4,18 3.557,19 4.154,20 3.385,22 4.179,23 3.676,24 16.405,25 4.593,26 12.397,27 13.522,28 14.699,29 15.852,30 17.026,31 4.079,32 3.881,33 0.714,34 1.126,35 0.677,36 2.013,37 3.54,39 0.789,40 32.505,41 34.981,42 37.451,43 3.408,44 4.068,45 18.194,46 18.275,47 0.728,48 3.503,49 4.635,50 4.635,51 7.635,52 4.635,53 5.853,54 12.1,55 17.736,56 20.273,57 22.648,58 25.138,59 27.57,60 30.047,61 7.753,62 -0.124,63 2.828,64 15.5,65 4,66 12.81,67 5.745}
{0 CHEMBL2321969,1 0.549,3 1.931,4 1.554,5 5,6 6.881,7 1.915,8 1.797,9 1.66,10 0.65,11 -0.737,12 3.842,14 1.613,15 1.576,16 6,18 3.702,19 4.156,20 3.607,22 4.178,23 3.86,24 16.517,25 6.34,26 12.424,27 13.549,28 14.726,29 15.879,30 17.054,31 4.087,32 5.219,33 0.713,34 1.209,35 0.788,36 1.99,37 3.56,39 0.84,40 32.644,41 35.127,42 37.603,43 3.582,44 4.082,45 18.221,46 18.388,47 0.738,48 3.681,49 4.696,50 4.696,51 7.696,52 4.696,53 5.909,54 11.1,55 17.849,56 20.392,57 22.767,58 25.263,59 27.698,60 30.181,61 7.861,62 -0.176,63 3.114,64 15.613,65 4,66 12.92,67 5}
{0 CHEMBL2321970,1 0.546,3 1.95,4 1.564,5 5,6 4.148,7 1.932,8 2.004,9 1.667,10 0.661,11 -1.469,12 3.941,14 1.627,15 1.586,16 4,18 3.846,19 4.168,20 3.615,22 4.191,23 3.862,24 16.894,25 6.712,26 12.627,27 13.759,28 14.936,29 16.093,30 17.27,31 4.093,32 5.554,33 0.73,34 1.859,35 1.144,36 2.036,37 3.598,39 1.551,40 33.408,41 35.927,42 38.442,43 3.669,44 4.08,45 18.441,46 18.805,47 0.723,48 3.736,49 4.721,50 4.721,51 7.721,52 4.721,53 6.275,54 10.3,55 18.378,56 20.943,57 23.377,58 25.905,59 28.386,60 30.905,61 8.238,62 -0.159,63 3.114,64 16.058,65 5,66 13.368,67 5}
{0 CHEMBL2321971,1 0.523,3 1.95,4 1.564,5 5,6 4.147,7 1.932,8 1.964,9 1.655,10 0.654,11 -0.733,12 3.838,14 1.626,15 1.586,16 4,18 3.718,19 4.167,20 3.435,22 4.191,23 3.764,24 16.839,25 5.044,26 12.572,27 13.707,28 14.888,29 16.05,30 17.229,31 4.092,32 4.356,33 0.73,34 1.682,35 1.014,36 2.036,37 3.586,39 1.439,40 33.403,41 35.923,42 38.438,43 3.505,44 4.079,45 18.403,46 18.754,47 0.757,48 3.59,49 4.721,50 4.721,51 7.721,52 4.721,53 6.211,54 5.9,55 18.352,56 20.922,57 23.362,58 25.893,59 28.377,60 30.898,61 8.184,62 -0.151,63 2.988,64 16.024,65 5,66 13.328,67 5}
{0 CHEMBL2321972,1 0.542,3 1.95,4 1.564,5 5,6 4.15,7 1.932,8 1.934,9 1.612,10 0.664,11 -0.674,12 3.944,14 1.626,15 1.586,16 4,18 3.855,19 4.169,20 3.593,22 4.194,23 3.866,24 16.913,25 5.64,26 12.637,27 13.765,28 14.943,29 16.099,30 17.275,31 4.094,32 4.795,33 0.73,34 1.775,35 1.174,36 2.036,37 3.82,39 1.623,40 33.414,41 35.932,42 38.445,43 3.67,44 4.081,45 18.445,46 18.823,47 0.744,48 3.736,49 4.721,50 4.721,51 7.721,52 4.721,53 6.261,54 5.3,55 18.395,56 20.958,57 23.389,58 25.915,59 28.395,60 30.912,61 8.257,62 -0.145,63 3.195,64 16.08,65 5,66 13.39,67 5}
{0 CHEMBL2321973,1 0.539,3 1.936,4 1.593,5 5,6 6.881,7 1.92,8 1.962,9 1.676,10 0.654,11 -0.706,12 3.969,14 1.74,15 1.623,16 6,18 3.84,19 4.169,20 3.749,22 4.191,23 4,24 16.667,25 7.649,26 12.529,27 13.666,28 14.85,29 16.014,30 17.197,31 4.098,32 6.459,33 0.856,34 1.327,35 0.971,36 2.003,37 3.563,39 0.991,40 33.137,41 35.66,42 38.179,43 3.707,44 4.092,45 18.374,46 18.553,47 0.72,48 3.864,49 4.809,50 4.809,51 7.809,52 4.809,53 5.99,54 10.3,55 18.1,56 20.676,57 23.097,58 25.63,59 28.109,60 30.632,61 7.982,62 -0.177,63 3.136,64 15.821,65 4,66 13.1,67 5}
{0 CHEMBL2321974,1 0.62,3 1.935,4 1.554,5 5,6 4.128,7 1.913,8 1.481,9 1.636,10 0.652,11 -1.312,12 3.689,14 1.628,15 1.578,16 4,18 3.537,19 4.154,20 3.388,22 4.179,23 3.67,24 16.405,25 4.465,26 12.394,27 13.518,28 14.694,29 15.846,30 17.019,31 4.079,32 3.995,33 0.715,34 1.039,35 0.648,36 2.013,37 3.541,39 0.805,40 32.498,41 34.974,42 37.444,43 3.401,44 4.068,45 18.185,46 18.274,47 0.728,48 3.492,49 4.635,50 4.635,51 7.635,52 4.635,53 5.879,54 12.1,55 17.733,56 20.27,57 22.643,58 25.133,59 27.564,60 30.041,61 7.753,62 -0.124,63 2.796,64 15.498,65 4,66 12.809,67 5.959}
{0 CHEMBL2321975,1 0.549,3 1.931,4 1.555,5 5,6 6.881,7 1.915,8 1.797,9 1.661,10 0.65,11 -0.667,12 3.838,14 1.614,15 1.576,16 6,18 3.685,19 4.156,20 3.603,22 4.178,23 3.855,24 16.516,25 6.173,26 12.422,27 13.546,28 14.721,29 15.874,30 17.047,31 4.087,32 5.212,33 0.714,34 1.122,35 0.757,36 1.99,37 3.561,39 0.857,40 32.638,41 35.121,42 37.597,43 3.571,44 4.082,45 18.213,46 18.387,47 0.738,48 3.672,49 4.696,50 4.696,51 7.696,52 4.696,53 5.925,54 11.1,55 17.847,56 20.388,57 22.763,58 25.258,59 27.693,60 30.176,61 7.861,62 -0.176,63 3.097,64 15.612,65 4,66 12.919,67 5}
{0 CHEMBL2322019,1 0.546,3 1.95,4 1.566,5 5,6 4.148,7 1.932,8 2.004,9 1.668,10 0.661,11 -1.399,12 3.937,14 1.627,15 1.587,16 4,18 3.831,19 4.168,20 3.611,22 4.191,23 3.857,24 16.894,25 6.632,26 12.625,27 13.756,28 14.932,29 16.088,30 17.264,31 4.093,32 5.45,33 0.731,34 1.772,35 1.138,36 2.036,37 3.598,39 1.547,40 33.406,41 35.925,42 38.439,43 3.659,44 4.08,45 18.434,46 18.805,47 0.723,48 3.727,49 4.721,50 4.721,51 7.721,52 4.721,53 6.287,54 10.3,55 18.377,56 20.941,57 23.375,58 25.903,59 28.384,60 30.903,61 8.238,62 -0.159,63 3.096,64 16.057,65 5,66 13.368,67 5}
{0 CHEMBL2333365,1 0.908,3 1.995,4 1.694,5 5,6 4.737,7 2.006,8 2.17,9 1.588,10 0.641,11 -0.391,12 4.212,14 1.838,15 1.727,16 6,18 4.124,19 4.108,20 4.118,22 4.099,23 4.265,24 16.752,25 11.9,26 12.192,27 13.24,28 14.356,29 15.436,30 16.547,31 4.025,32 11.587,33 1.07,34 1.337,35 1.574,36 2.069,37 3.848,39 1.833,40 32.817,41 35.309,42 37.796,43 4.029,44 4.104,45 17.644,46 18.639,47 0.662,48 4.206,49 4.731,50 4.731,51 7.731,52 4.731,53 6.289,54 7.4,55 18.015,56 20.542,57 22.922,58 25.416,59 27.857,60 30.346,61 8.127,62 -0.123,63 3.115,64 15.765,65 5,66 13.12,67 5}
{0 CHEMBL24828,1 0.585,3 2.006,4 1.788,5 6,6 6.88,7 1.985,8 2.053,9 1.535,10 0.667,12 4.028,14 1.91,15 1.842,16 2,18 3.947,19 4.081,20 4.046,22 4.109,23 4.119,24 16.065,25 9.744,26 11.577,27 12.555,28 13.657,29 14.688,30 15.776,31 3.993,32 10.393,33 1.044,34 0.958,35 1.441,36 2.128,37 3.907,39 1.495,40 30.786,41 33.126,42 35.451,43 3.985,44 3.98,45 16.835,46 17.857,47 0.643,48 4.02,49 4.513,50 4.513,51 7.513,52 4.513,53 5.885,54 3.7,55 16.895,56 19.32,57 21.507,58 23.87,59 26.137,60 28.48,61 7.545,62 -0.119,63 3.183,64 14.876,65 1,66 12.28,67 5}
{0 CHEMBL249697,1 0.767,3 2.052,4 1.489,5 2,6 4.181,7 2.019,8 1.454,9 1.583,10 0.684,12 3.609,14 1.771,15 1.551,16 1,18 3.534,19 4.201,20 3.548,22 4.246,23 3.681,24 16.035,25 5.385,26 11.545,27 12.606,28 13.738,29 14.836,30 15.963,31 4.085,32 5.646,33 0.884,34 0.656,35 0.914,36 2.186,37 3.686,39 0.966,40 32.216,41 34.695,42 37.166,43 3.415,44 4.062,45 17.078,46 17.902,47 0.619,48 3.618,49 4.874,50 4.874,51 7.874,52 4.874,53 5.314,55 17.402,56 19.95,57 22.333,58 24.832,59 27.271,60 29.755,61 7.405,62 0.219,63 2.77,64 15.162,65 1,66 12.461,67 5.678}
{0 CHEMBL255863,1 0.665,3 1.959,4 1.85,5 7,6 4.029,7 1.933,8 2.388,9 1.534,10 0.673,11 -0.574,12 4.228,13 1,14 1.976,15 1.88,16 4,18 4.226,19 4.066,20 4.232,22 4.107,23 4.247,24 16.642,25 10.516,26 12.055,27 13.045,28 14.131,29 15.159,30 16.232,31 3.964,32 11.889,33 1.027,34 1.514,35 2.306,36 2.075,37 3.938,39 2.211,40 32.158,41 34.597,42 37.035,43 4.24,44 3.952,45 17.281,46 18.493,47 0.685,48 4.231,49 4.104,50 4.104,51 7.104,52 4.104,53 6.329,54 1.6,55 17.711,56 20.169,57 22.49,58 24.919,59 27.306,60 29.737,61 8.089,62 -0.186,63 3.407,64 15.535,65 4,66 12.95,67 5}
{0 CHEMBL259084,1 0.627,3 1.969,4 1.833,5 7,6 4.095,7 1.953,8 2.367,9 1.573,10 0.654,11 -0.88,12 4.184,14 1.937,15 1.856,16 7,18 4.187,19 4.08,20 4.181,22 4.108,23 4.18,24 16.527,25 9.764,26 12.26,27 13.322,28 14.469,29 15.574,30 16.715,31 4.012,32 10.125,33 1.059,34 1.295,35 1.966,36 2.054,37 3.89,39 1.794,40 32.334,41 34.789,42 37.236,43 4.165,44 4.006,45 17.841,46 18.372,47 0.731,48 4.193,49 4.341,50 4.341,51 7.341,52 4.341,53 6.118,54 4.1,55 17.725,56 20.24,57 22.576,58 25.043,59 27.446,60 29.901,61 7.932,62 -0.196,63 3.243,64 15.545,65 5,66 12.879,67 5}
{0 CHEMBL261849,1 0.86,3 1.94,4 1.685,5 4,6 3.948,7 1.92,8 1.529,9 1.511,10 0.648,12 3.858,14 1.81,15 1.725,16 2,18 3.8,19 3.998,20 3.83,22 4.025,23 3.943,24 15.682,25 8.032,26 11.209,27 12.115,28 13.18,29 14.14,30 15.181,31 3.913,32 8.165,33 0.866,34 0.764,35 1.141,36 2.053,37 3.839,39 1.239,40 29.356,41 31.57,42 33.756,43 3.746,44 3.908,45 16.17,46 17.431,47 0.632,48 3.901,49 3.955,50 3.955,51 6.955,52 3.955,53 5.695,54 6.1,55 16.195,56 18.531,57 20.577,58 22.836,59 24.962,60 27.189,61 7.235,62 -0.181,63 3.007,64 14.312,65 3,66 11.791,67 5}
{0 CHEMBL265470,1 0.629,3 2.117,4 1.488,5 11,6 4.209,7 2.105,8 2.267,9 1.643,10 0.667,11 -1.19,12 3.95,14 1.653,15 1.509,16 9,18 3.809,19 4.226,20 3.603,22 4.25,23 3.933,24 16.691,25 5.795,26 12.593,27 13.741,28 14.941,29 16.12,30 17.32,31 4.157,32 4.742,33 0.716,34 1.094,35 0.804,36 2.18,37 3.563,39 0.938,40 33.369,41 35.91,42 38.445,43 3.581,44 4.147,45 18.515,46 18.589,47 0.744,48 3.808,49 4.83,50 4.83,51 7.83,52 4.83,53 5.837,54 8.8,55 18.227,56 20.822,57 23.26,58 25.811,59 28.307,60 30.847,61 8.007,62 -0.104,63 2.958,64 15.926,65 5,66 13.184,67 6.022}
{0 CHEMBL269538,1 0.757,3 1.971,4 1.204,5 2,6 4.183,7 1.955,8 0.902,9 1.586,10 0.656,12 3.376,14 1.584,15 1.261,16 4,18 3.093,19 4.211,20 2.879,22 4.241,23 3.475,24 15.845,25 3.535,26 11.734,27 12.835,28 14,29 15.133,30 16.291,31 4.139,32 2.829,33 0.62,34 0.403,35 0.49,36 2.041,37 3.361,39 0.67,40 31.648,41 34.083,42 36.51,43 2.737,44 4.129,45 17.438,46 17.696,47 0.657,48 3.25,49 4.848,50 4.848,51 7.848,52 4.848,53 4.917,54 3.6,55 17.087,56 19.597,57 21.936,58 24.394,59 26.79,60 29.23,61 7.235,62 0.062,63 2.662,64 14.889,65 2,66 12.222,67 6.104}
{0 CHEMBL288441,1 0.709,3 2.038,4 1.726,5 6,6 4.131,7 2.021,8 2.596,9 1.548,10 0.674,12 4.3,14 1.889,15 1.799,16 5,18 4.252,19 4.102,20 4.327,22 4.123,23 4.411,24 16.346,25 13.209,26 11.836,27 12.855,28 13.978,29 15.048,30 16.164,31 4.031,32 12.79,33 1.12,34 1.278,35 1.697,36 2.134,37 3.906,39 1.823,40 31.419,41 33.803,42 36.175,43 4.251,44 4.02,45 17.26,46 18.156,47 0.642,48 4.353,49 4.576,50 4.576,51 7.576,52 4.576,53 6.121,54 4.6,55 17.281,56 19.737,57 21.97,58 24.37,59 26.683,60 29.067,61 7.796,62 -0.025,63 3.363,64 15.213,65 2,66 12.597,67 5}
{0 CHEMBL296468,1 0.796,3 1.836,4 1.505,5 3,6 4.312,7 1.783,8 1.296,9 1.503,10 0.65,11 0.079,12 3.792,14 1.565,15 1.509,16 1,18 3.614,19 3.964,20 3.739,22 3.99,23 3.959,24 16.193,25 7.881,26 12.223,27 13.367,28 14.546,29 15.715,30 16.898,31 3.831,32 10.196,33 0.892,34 0.511,35 0.985,36 2.019,37 3.794,39 1.155,40 32,41 34.454,42 36.907,43 3.56,44 3.884,45 18.079,46 18.069,47 0.615,48 3.766,49 3.913,50 3.913,51 6.55,52 3.913,53 5.612,54 4.1,55 17.376,56 19.847,57 22.226,58 24.679,59 27.104,60 29.556,61 7.644,62 -0.227,63 3.179,64 15.115,66 12.55,67 5.77}
{0 CHEMBL300138,1 0.868,3 1.968,4 1.833,5 17,6 4.181,7 1.948,8 2.248,9 1.584,10 0.673,11 0.228,12 4.508,13 2,14 2.005,15 1.877,16 16,18 4.532,19 4.212,20 4.613,22 4.241,23 4.597,24 16.885,25 16.945,26 12.829,27 13.964,28 15.159,29 16.329,30 17.523,31 4.139,32 17.217,33 1.146,34 1.668,35 2.432,36 2.091,37 3.958,39 2.439,40 33.314,41 35.828,42 38.337,43 4.535,44 4.13,45 18.711,46 18.763,47 0.66,48 4.613,49 4.717,50 4.717,51 7.717,52 4.717,53 6.325,54 2.9,55 18.334,56 20.9,57 23.313,58 25.836,59 28.306,60 30.819,61 8.231,62 0.031,63 3.33,64 16.059,65 4,66 13.347,67 5}
{0 CHEMBL31965,1 0.783,3 2.013,4 1.691,5 7,6 4.077,7 1.989,8 1.942,9 1.504,10 0.676,11 -0.366,12 4.1,14 1.925,15 1.754,16 5,18 4.098,19 4.085,20 4.161,21 1.188,22 4.116,23 4.174,24 16.065,25 10.923,26 11.573,27 12.553,28 13.656,29 14.692,30 15.785,31 3.998,32 10.748,33 1.069,34 0.847,35 1.615,36 2.132,37 3.884,38 1,39 1.619,40 30.768,41 33.11,42 35.438,43 4.111,44 3.984,45 16.851,46 17.853,47 0.648,48 4.173,49 4.514,50 4.514,51 7.514,52 4.514,53 6.025,54 5.1,55 16.873,56 19.301,57 21.484,58 23.849,59 26.115,60 28.461,61 7.535,62 -0.05,63 3.333,64 14.865,65 1,66 12.263,67 5.174}
{0 CHEMBL37139,1 0.726,3 2.042,4 1.541,5 7,6 4.06,7 2.025,8 1.751,9 1.564,10 0.62,11 -1.212,12 3.754,14 1.682,15 1.561,16 6,18 3.584,19 4.09,20 3.491,21 3.443,22 4.109,23 3.779,24 16.045,25 6.177,26 11.753,27 12.772,28 13.89,29 14.953,30 16.062,31 4.025,32 5.078,33 0.747,34 0.764,35 0.795,36 2.128,37 3.619,38 2,39 0.953,40 31.012,41 33.384,42 35.739,43 3.431,44 4.018,45 17.148,46 17.861,47 0.682,48 3.649,49 4.537,50 4.537,51 7.537,52 4.537,53 5.778,54 12.5,55 16.936,56 19.387,57 21.608,58 24.003,59 26.3,60 28.677,61 7.476,62 -0.127,63 2.94,64 14.875,65 3,66 12.266,67 5.959}
{0 CHEMBL377300,1 0.679,3 1.92,4 1.59,5 3,6 4.131,7 1.905,8 1.743,9 1.601,10 0.676,12 3.848,13 1,14 1.837,15 1.631,16 2,18 3.768,19 4.156,20 3.815,22 4.19,23 3.855,24 16.367,25 7.571,26 11.989,27 13.061,28 14.192,29 15.293,30 16.417,31 4.056,32 7.274,33 0.985,34 0.896,35 1.336,36 2.063,37 3.677,39 1.27,40 32.073,41 34.501,42 36.918,43 3.786,44 4.041,45 17.53,46 18.217,47 0.648,48 3.781,49 4.663,50 4.663,51 7.663,52 4.663,53 5.811,54 6.5,55 17.569,56 20.078,57 22.401,58 24.853,59 27.234,60 29.667,61 7.748,62 -0.058,63 2.953,64 15.389,65 2,66 12.718,67 5}
{0 CHEMBL379218,1 0.91,3 1.988,4 1.707,5 3,6 4.088,7 1.969,8 1.142,9 1.51,10 0.62,12 3.879,14 1.849,15 1.735,16 5,18 3.805,19 4.123,20 3.85,22 4.16,23 3.999,24 15.846,25 8.561,26 11.684,27 12.682,28 13.797,29 14.845,30 15.946,31 4.042,32 7.822,33 0.967,34 0.663,35 1.23,36 2.062,37 3.877,39 1.263,40 30.411,41 32.721,42 35.021,43 3.748,44 4.034,45 17.019,46 17.633,47 0.644,48 3.912,49 4.51,50 4.51,51 7.51,52 4.51,53 5.619,54 2,55 16.652,56 19.049,57 21.228,58 23.563,59 25.813,60 28.128,61 7.322,62 -0.044,63 2.932,64 14.635,65 4,66 12.058,67 7.201}
{0 CHEMBL384304,1 0.896,3 1.916,4 1.692,5 1,6 4.722,7 1.901,8 2.2,9 1.595,10 0.667,11 -0.908,12 4.03,14 1.782,15 1.721,16 1,18 3.925,19 4.045,20 3.819,22 4.06,23 4.054,24 16.661,25 7.928,26 12.311,27 13.404,28 14.546,29 15.665,30 16.804,31 3.916,32 6.467,33 0.964,34 1.347,35 1.518,36 2.073,37 3.856,39 1.548,40 32.561,41 35.01,42 37.452,43 3.798,44 3.973,45 17.936,46 18.549,47 0.64,48 3.955,49 4.51,50 4.51,51 7.51,52 4.51,53 6.289,54 7.8,55 17.92,56 20.427,57 22.795,58 25.261,59 27.675,60 30.127,61 8.048,62 -0.065,63 3.118,64 15.667,65 2,66 13.036,67 5}
{0 CHEMBL386051,1 0.771,3 1.967,4 1.743,5 5,6 4.135,7 1.95,8 2.244,9 1.582,10 0.655,11 0.175,12 4.039,14 1.85,15 1.773,16 9,18 3.963,19 4.041,20 3.951,21 1.725,22 4.07,23 4.114,24 16.371,25 7.782,26 11.937,27 12.992,28 14.135,29 15.234,30 16.372,31 3.964,32 8.419,33 0.943,34 1.222,35 1.253,36 2.082,37 3.842,38 1,39 1.234,40 32.045,41 34.485,42 36.913,43 3.877,44 3.963,45 17.494,46 18.216,47 0.718,48 4.029,49 4.242,50 4.242,51 7.242,52 4.242,53 5.964,54 2.2,55 17.514,56 20.034,57 22.344,58 24.808,59 27.188,60 29.633,61 7.756,62 -0.271,63 3.378,64 15.363,65 2,66 12.685,67 5}
{0 CHEMBL409450,1 0.549,3 1.936,4 1.594,5 6,6 6.88,7 1.92,8 1.446,9 1.624,10 0.648,12 3.705,14 1.68,15 1.626,16 4,18 3.595,19 4.201,20 3.473,22 4.229,23 3.732,24 16.35,25 5.244,26 12.216,27 13.336,28 14.513,29 15.662,30 16.833,31 4.126,32 4.762,33 0.808,34 1.028,35 0.75,36 2.014,37 3.516,39 0.878,40 32.63,41 35.116,42 37.598,43 3.454,44 4.117,45 17.995,46 18.227,47 0.738,48 3.605,49 4.739,50 4.739,51 7.739,52 4.739,53 5.693,54 6.3,55 17.775,56 20.325,57 22.721,58 25.223,59 27.671,60 30.159,61 7.706,62 -0.152,63 2.989,64 15.51,65 3,66 12.808,67 5.678}
{0 CHEMBL428690,1 0.673,3 1.991,4 1.693,5 5,6 4.071,7 1.984,8 2.316,9 1.628,10 0.643,11 -0.214,12 4.136,14 1.869,15 1.734,16 10,18 4.086,19 4.063,20 4.068,21 1.273,22 4.072,23 4.174,24 16.536,25 10.934,26 12.283,27 13.381,28 14.544,29 15.677,30 16.838,31 3.989,32 9.96,33 1.029,34 1.465,35 1.309,36 2.1,37 3.816,38 2,39 1.382,40 32.636,41 35.12,42 37.597,43 4.031,44 3.98,45 17.99,46 18.403,47 0.66,48 4.12,49 4.38,50 4.38,51 7.38,52 4.38,53 6.224,54 10.4,55 17.847,56 20.393,57 22.761,58 25.257,59 27.69,60 30.173,61 7.892,62 -0.052,63 3.115,64 15.627,65 3,66 12.926,67 5}
{0 CHEMBL445813,1 0.649,3 1.892,4 1.529,6 4.115,7 1.881,8 1.169,9 1.539,10 0.66,11 -0.846,12 3.747,13 1,14 1.652,15 1.56,16 3,18 3.6,19 3.994,20 3.634,22 4.039,23 3.795,24 16.004,25 5.304,26 11.561,27 12.568,28 13.668,29 14.713,30 15.798,31 3.894,32 5.395,33 0.825,34 0.802,35 0.856,36 2.021,37 3.878,39 0.875,40 31.094,41 33.446,42 35.786,43 3.61,44 3.894,45 16.861,46 17.838,47 0.664,48 3.629,49 4.113,50 4.113,51 7.113,52 4.113,53 5.817,54 4.8,55 17.016,56 19.464,57 21.714,58 24.099,59 26.404,60 28.765,61 7.394,62 0.02,63 3.18,64 14.902,65 1,66 12.283,67 5.268}
{0 CHEMBL450786,1 0.724,3 2.008,4 1.72,5 11,6 4.747,7 2.025,8 2.982,9 1.601,10 0.651,11 -0.011,12 4.57,14 1.91,15 1.745,16 14,18 4.572,19 4.157,20 4.71,21 1.702,22 4.16,23 4.684,24 17.12,25 19.7,26 12.678,27 13.77,28 14.917,29 16.04,30 17.185,31 4.081,32 22.144,33 1.211,34 2.146,35 2.549,36 2.044,37 3.971,38 1,39 2.442,40 33.376,41 35.872,42 38.367,43 4.618,44 4.15,45 18.323,46 19.014,47 0.652,48 4.644,49 4.726,50 4.726,51 7.726,52 4.726,53 6.664,54 5.2,55 18.501,56 21.037,57 23.443,58 25.943,59 28.401,60 30.894,61 8.473,62 0.01,63 3.613,64 16.215,65 4,66 13.549,67 5}
{0 CHEMBL464552,1 0.753,3 1.927,4 1.732,5 3,6 4.091,7 1.901,8 2.467,9 1.59,10 0.699,11 -0.558,12 4.341,13 1,14 1.863,15 1.764,16 2,18 4.335,19 4.121,20 4.424,22 4.166,23 4.357,24 16.666,25 12.764,26 12.327,27 13.38,28 14.5,29 15.585,30 16.697,31 4.004,32 13.696,33 1.053,34 1.466,35 2.287,36 2.069,37 3.952,39 2.207,40 32.007,41 34.388,42 36.757,43 4.38,44 3.984,45 17.796,46 18.505,47 0.64,48 4.351,49 4.503,50 4.503,51 7.503,52 4.503,53 6.39,54 4.4,55 17.773,56 20.245,57 22.52,58 24.929,59 27.262,60 29.65,61 8.074,62 -0.194,63 3.353,64 15.638,65 3,66 12.997,67 5}
{0 CHEMBL475251,1 0.665,3 1.888,4 1.666,5 2,6 3.975,7 1.867,8 2.747,9 1.577,10 0.706,11 -0.338,12 4.106,14 1.823,15 1.706,16 2,18 4.074,19 4.006,20 4.021,22 4.042,23 4.11,24 16.704,25 9.243,26 12.273,27 13.362,28 14.505,29 15.627,30 16.772,31 3.879,32 8.513,33 0.915,34 1.215,35 1.631,36 2.068,37 3.843,39 1.673,40 32.797,41 35.293,42 37.787,43 3.982,44 3.856,45 17.912,46 18.583,47 0.646,48 4.096,49 4.111,50 4.111,51 7.111,52 4.111,53 6.144,54 8.8,55 17.977,56 20.489,57 22.885,58 25.374,59 27.828,60 30.317,61 8.127,62 -0.029,63 3.144,64 15.716,66 13.092,67 6.328}
{0 CHEMBL477772,1 0.775,3 1.98,4 1.686,5 1,6 4.73,7 1.982,8 1.662,9 1.599,10 0.661,12 4.121,14 1.837,15 1.732,16 4,18 4.009,19 4.133,20 3.953,22 4.171,23 4.214,24 16.706,25 8.58,26 12.207,27 13.268,28 14.389,29 15.48,30 16.596,31 4.035,32 6.991,33 0.907,34 1.118,35 1.46,36 2.073,37 3.896,39 1.676,40 32.706,41 35.182,42 37.655,43 3.865,44 4.071,45 17.701,46 18.589,47 0.648,48 4.116,49 4.71,50 4.71,51 7.71,52 4.71,53 6.109,54 3.7,55 17.963,56 20.477,57 22.858,58 25.337,59 27.773,60 30.246,61 8.091,62 -0.091,63 3.109,64 15.71,65 2,66 13.073,67 5}
{0 CHEMBL485053,1 0.726,2 1,3 1.891,4 1.352,6 3.958,7 1.876,8 0.613,9 1.576,10 0.708,11 0.297,12 3.246,13 2,14 1.52,15 1.422,17 1,18 3.034,19 3.995,20 2.926,21 1.667,22 4.014,23 3.298,24 15.803,25 2.883,26 11.411,27 12.428,28 13.522,29 14.57,30 15.653,31 3.906,32 2.475,33 0.585,34 0.469,35 0.468,36 1.97,37 3.379,38 2,39 0.549,40 30.445,41 32.757,42 35.051,43 2.931,44 3.896,45 16.717,46 17.618,47 0.666,48 3.082,49 3.985,50 3.985,51 6.985,52 3.985,53 5.074,54 10.3,55 16.64,56 19.059,57 21.244,58 23.593,59 25.843,60 28.165,61 7.2,62 -0.162,63 2.707,64 14.6,65 1,66 12,67 5.762}
{0 CHEMBL486817,1 0.682,3 1.97,4 1.159,5 2,6 4.182,7 1.953,8 0.862,9 1.601,10 0.65,12 3.25,14 1.538,15 1.222,16 4,18 2.921,19 4.21,20 2.641,22 4.24,23 3.343,24 15.815,25 2.963,26 11.725,27 12.827,28 13.992,29 15.126,30 16.285,31 4.138,32 2.044,33 0.606,34 0.341,35 0.382,36 2.039,37 3.269,39 0.552,40 31.642,41 34.078,42 36.505,43 2.5,44 4.128,45 17.432,46 17.669,47 0.675,48 3.063,49 4.847,50 4.847,51 7.847,52 4.847,53 4.831,54 4,55 17.07,56 19.585,57 21.927,58 24.386,59 26.783,60 29.224,61 7.195,62 0.033,63 2.287,64 14.869,65 2,66 12.194,67 5.824}
{0 CHEMBL491473,1 0.842,3 1.997,4 1.595,5 5,6 4.114,7 1.982,8 2.107,9 1.526,10 0.682,12 4.1,14 1.901,15 1.663,16 6,18 4.047,19 4.143,20 4.078,22 4.172,23 4.152,24 16.335,25 11.127,26 11.912,27 12.94,28 14.056,29 15.124,30 16.229,31 4.056,32 9.673,33 1.165,34 0.941,35 1.671,36 2.119,37 3.932,39 1.649,40 31.425,41 33.788,42 36.134,43 4.026,44 4.043,45 17.316,46 18.156,47 0.632,48 4.104,49 4.569,50 4.569,51 7.569,52 4.569,53 6.004,54 5,55 17.332,56 19.789,57 22.025,58 24.419,59 26.721,60 29.092,61 7.756,62 -0.065,63 3.286,64 15.246,65 2,66 12.618,67 5}
{0 CHEMBL494089,1 0.755,3 1.902,4 1.642,6 4.134,7 1.876,8 2.016,9 1.549,10 0.685,12 4.073,14 1.883,15 1.687,18 4.086,19 4.147,20 4.179,22 4.185,23 4.13,24 16.563,25 8.874,26 12.212,27 13.285,28 14.414,29 15.517,30 16.643,31 4.026,32 9.718,33 1.001,34 1.49,35 1.685,36 2.053,37 3.815,39 1.531,40 32.728,41 35.217,42 37.703,43 4.151,44 3.996,45 17.762,46 18.43,47 0.613,48 4.107,49 4.775,50 4.775,51 7.775,52 4.775,53 5.923,54 5.2,55 17.931,56 20.451,57 22.837,58 25.327,59 27.77,60 30.256,61 8.034,62 0.007,63 3.175,64 15.672,66 13.036,67 5}
{0 CHEMBL509032,1 0.824,3 1.997,4 1.773,5 7,6 4.748,7 2.011,8 2.471,9 1.566,10 0.679,12 4.55,14 1.976,15 1.829,16 6,18 4.527,19 4.117,20 4.606,22 4.11,23 4.679,24 16.975,25 18.696,26 11.949,27 12.934,28 14.021,29 15.05,30 16.127,31 4.025,32 16.151,33 1.24,34 1.722,35 2.492,36 2.098,37 3.934,39 2.642,40 33.977,41 36.584,42 39.189,43 4.475,44 4.123,45 17.179,46 18.894,47 0.613,48 4.659,49 4.789,50 4.789,51 7.789,52 4.789,53 6.41,54 3.7,55 18.478,56 21.081,57 23.605,58 26.201,59 28.778,60 31.38,61 8.31,62 -0.058,63 3.548,64 16.09,66 13.41,67 5}
{0 CHEMBL513909,1 0.894,3 1.925,4 1.755,5 8,6 4.002,7 1.899,8 3.186,9 1.575,10 0.691,11 -0.007,12 4.474,14 1.967,15 1.815,16 4,18 4.487,19 4.048,20 4.546,22 4.097,23 4.554,24 16.638,25 15.848,26 12.192,27 13.239,28 14.362,29 15.45,30 16.572,31 3.918,32 14.967,33 1.211,34 1.576,35 2.419,36 2.096,37 3.904,39 2.478,40 32.648,41 35.146,42 37.636,43 4.44,44 3.903,45 17.682,46 18.484,47 0.594,48 4.572,49 4.074,50 4.074,51 7.074,52 4.074,53 6.485,54 3.9,55 17.843,56 20.386,57 22.741,58 25.245,59 27.68,60 30.176,61 8.03,62 -0.064,63 3.332,64 15.661,65 1,66 12.979,67 5}
{0 CHEMBL521851,1 0.947,3 1.975,4 1.757,5 3,6 4.722,7 1.952,8 1.501,9 1.54,10 0.7,12 4.302,14 1.928,15 1.791,16 1,18 4.26,19 4.155,20 4.365,22 4.188,23 4.418,24 16.782,25 13.99,26 12.308,27 13.372,28 14.497,29 15.591,30 16.709,31 4.073,32 12.865,33 1.168,34 1.421,35 1.937,36 2.077,37 3.989,39 2.089,40 32.593,41 35.025,42 37.452,43 4.246,44 4.094,45 17.816,46 18.661,47 0.644,48 4.396,49 4.618,50 4.618,51 7.618,52 4.618,53 6.121,54 4.8,55 18.05,56 20.542,57 22.894,58 25.342,59 27.74,60 30.175,61 8.184,62 -0.034,63 3.417,64 15.815,65 2,66 13.186,67 5.119}
{0 CHEMBL522892,1 0.767,3 1.959,4 1.645,5 2,6 4.114,7 1.938,8 2.049,9 1.6,10 0.698,11 -0.168,12 4.082,14 1.909,15 1.716,16 4,18 3.953,19 4.142,20 3.876,22 4.182,23 4.149,24 16.5,25 7.844,26 12.238,27 13.32,28 14.472,29 15.591,30 16.739,31 4.041,32 6.256,33 1.081,34 1.487,35 1.369,36 2.078,37 3.884,38 1,39 1.665,40 32.273,41 34.725,42 37.169,43 3.823,44 4.023,45 17.877,46 18.351,47 0.649,48 4.015,49 4.499,50 4.499,51 7.499,52 4.499,53 6.03,54 2,55 17.7,56 20.213,57 22.539,58 25.002,59 27.396,60 29.847,61 7.883,62 -0.115,63 3.042,64 15.525,65 1,66 12.854,67 5.222}
{0 CHEMBL525191,1 0.878,3 1.945,4 1.525,5 7,6 4.058,7 1.927,8 1.429,9 1.551,10 0.64,11 0.742,12 3.874,13 1,14 1.806,15 1.592,16 9,18 3.828,19 4.096,20 3.879,22 4.131,23 3.935,24 16.139,25 7.899,26 12.064,27 13.138,28 14.286,29 15.394,30 16.531,31 4.023,32 8.453,33 1.036,34 0.771,35 1.135,36 2.007,37 3.796,39 1.234,40 31.556,41 33.943,42 36.32,43 3.791,44 4.02,45 17.654,46 17.978,47 0.656,48 3.9,49 4.287,50 4.287,51 7.287,52 4.287,53 5.678,54 4.7,55 17.286,56 19.757,57 22.043,58 24.456,59 26.797,60 29.19,61 7.545,62 0.043,63 2.935,64 15.137,65 5,66 12.499,67 5}
{0 CHEMBL535,1 0.753,3 1.891,4 1.627,5 5,6 4.05,7 1.872,8 1.503,9 1.607,10 0.638,11 -0.06,12 4.077,14 1.845,15 1.685,16 8,18 3.994,19 4.085,20 4.029,21 1.676,22 4.115,23 4.168,24 16.35,25 10.532,26 12.309,27 13.42,28 14.58,29 15.718,30 16.874,31 4.001,32 9.612,33 1.005,34 1.07,35 1.535,36 1.971,37 3.837,38 1,39 1.689,40 31.982,41 34.395,42 36.799,43 3.935,44 3.991,45 18.022,46 18.199,47 0.611,48 4.095,49 4.332,50 4.332,51 7.332,52 4.332,53 6.164,54 3.6,55 17.53,56 20.027,57 22.35,58 24.79,59 27.166,60 29.586,61 7.735,62 0.081,63 3.04,64 15.345,65 3,66 12.69,67 6.167}
{0 CHEMBL553,1 1.004,3 2.008,4 1.471,5 5,6 4.053,7 1.986,8 1.56,9 1.479,10 0.655,12 3.933,13 1,14 1.763,15 1.514,16 4,18 3.949,19 4.079,20 4.017,22 4.107,23 3.987,24 15.837,25 9.121,26 11.458,27 12.452,28 13.561,29 14.604,30 15.699,31 3.993,32 9.44,33 0.979,34 0.792,35 1.309,36 2.127,37 3.652,39 1.335,40 30.715,41 33.061,42 35.394,43 3.974,44 3.979,45 16.767,46 17.637,47 0.638,48 3.993,49 4.513,50 4.513,51 7.513,52 4.513,53 5.841,54 7.7,55 16.752,56 19.187,57 21.394,58 23.766,59 26.047,60 28.399,61 7.298,62 -0.023,63 3.173,64 14.709,65 2,66 12.095,67 5.886}
{0 CHEMBL554,1 0.966,3 2.024,4 1.86,5 10,6 4.721,7 2,8 2.117,9 1.509,10 0.65,12 4.234,14 1.925,15 1.845,16 8,18 4.221,19 4.112,20 4.311,22 4.135,23 4.305,24 16.405,25 12.198,26 11.952,27 12.927,28 14.023,29 15.048,30 16.131,31 4.029,32 12.827,33 1.131,34 1.153,35 1.655,36 2.128,37 3.959,39 1.805,40 31.077,41 33.39,42 35.693,43 4.24,44 4.031,45 17.184,46 18.204,47 0.677,48 4.306,49 4.484,50 4.484,51 7.484,52 4.484,53 6.114,54 6.1,55 17.304,56 19.683,57 21.884,58 24.214,59 26.473,60 28.789,61 7.978,62 -0.09,63 3.396,64 15.235,65 3,66 12.71,67 5}
{0 CHEMBL558752,1 0.574,3 1.926,4 1.778,5 2,6 4.105,7 1.904,8 2.003,9 1.561,10 0.696,12 4.074,13 1,14 1.898,15 1.812,16 4,18 3.997,19 4.133,20 4.003,22 4.174,23 4.037,24 16.954,25 8.595,26 12.054,27 13.056,28 14.142,29 15.179,30 16.254,31 4.02,32 9.059,33 0.956,34 1.518,35 1.738,36 2.047,37 3.946,39 1.796,40 32.837,41 35.282,42 37.724,43 3.988,44 4,45 17.308,46 18.848,47 0.705,48 4.001,49 4.586,50 4.586,51 7.586,52 4.586,53 6.06,54 1.9,55 18.224,56 20.709,57 23.087,58 25.54,59 27.957,60 30.403,61 8.37,62 -0.074,63 3.311,64 15.949,65 1,66 13.352,67 5}
{0 CHEMBL572878,1 0.835,3 1.896,4 1.601,5 6,6 4.088,7 1.872,8 1.293,9 1.518,10 0.689,11 0.114,12 4.072,14 1.81,15 1.662,16 4,18 4.06,19 4.008,20 4.193,22 4.06,23 4.196,24 15.97,25 10.442,26 11.519,27 12.457,28 13.516,29 14.502,30 15.546,31 3.894,32 10.82,33 0.897,34 1.042,35 1.694,36 2.049,37 3.934,39 1.668,40 29.673,41 31.892,42 34.087,43 4.088,44 3.907,45 16.558,46 17.714,47 0.629,48 4.155,49 3.915,50 3.915,51 6.915,52 3.915,53 5.872,54 1.6,55 16.504,56 18.844,57 20.885,58 23.146,59 25.272,60 27.502,61 7.564,62 0.003,63 3.346,64 14.633,66 12.103,67 5}
{0 CHEMBL572881,1 0.839,3 1.925,4 1.771,5 6,6 3.994,7 1.899,8 1.062,9 1.52,10 0.652,11 -0.192,12 3.953,14 1.914,15 1.804,16 7,18 3.819,19 4.048,20 3.836,22 4.084,23 4.072,24 16.542,25 7.743,26 12.641,27 13.812,28 15.025,29 16.225,30 17.442,31 3.966,32 6.735,33 1.022,34 0.934,35 1.179,36 2.044,37 3.875,39 1.36,40 33.302,41 35.854,42 38.406,43 3.762,44 3.963,45 18.656,46 18.458,47 0.638,48 3.926,49 4.097,50 4.097,51 7.097,52 4.097,53 5.79,54 2,55 18.071,56 20.641,57 23.128,58 25.679,59 28.207,60 30.757,61 7.921,62 -0.317,63 3.116,64 15.695,65 3,66 13.033,67 5}
{0 CHEMBL573339,1 0.844,3 1.956,4 1.71,5 3,6 4.171,7 1.93,8 1.275,9 1.546,10 0.712,12 3.843,14 1.917,15 1.749,16 1,18 3.845,19 4.183,20 3.915,22 4.2,23 3.856,24 16.277,25 6.549,26 12.04,27 13.12,28 14.278,29 15.399,30 16.552,31 4.074,32 7.482,33 1.026,34 1.146,35 1.193,36 2.081,37 3.822,39 1.162,40 32.13,41 34.584,42 37.03,43 3.901,44 4.047,45 17.693,46 18.127,47 0.676,48 3.85,49 4.866,50 4.866,51 7.866,52 4.866,53 5.691,54 7.1,55 17.525,56 20.041,57 22.378,58 24.844,59 27.245,60 29.699,61 7.662,62 -0.071,63 2.866,64 15.339,65 2,66 12.661,67 5.387}
{0 CHEMBL574738,1 0.789,3 1.944,4 1.697,5 2,6 3.967,7 1.917,8 2.258,9 1.506,10 0.684,11 -0.662,12 4.256,14 1.959,15 1.768,16 2,18 4.203,19 4.013,20 4.184,22 4.052,23 4.321,24 16.447,25 11.876,26 11.691,27 12.669,28 13.77,29 14.807,30 15.901,31 3.918,32 11.753,33 1.062,34 1.354,35 2.16,36 2.075,37 3.887,39 2.318,40 32.614,41 35.121,42 37.624,43 4.15,44 3.912,45 16.97,46 18.306,47 0.626,48 4.258,49 4.067,50 4.067,51 7.067,52 4.067,53 6.458,54 2.9,55 17.684,56 20.21,57 22.628,58 25.136,59 27.611,60 30.118,61 7.934,62 -0.071,63 3.304,64 15.421,65 2,66 12.807,67 6.678}
{0 CHEMBL576982,1 0.791,3 1.946,4 1.739,5 3,6 4.429,7 1.926,8 1.772,9 1.525,10 0.688,11 -0.389,12 4.304,13 1,14 1.982,15 1.78,16 2,18 4.156,19 4.216,20 4.153,22 4.242,23 4.417,24 16.703,25 10.925,26 12.528,27 13.635,28 14.799,29 15.941,30 17.108,31 4.129,32 10.999,33 1.161,34 1.424,35 1.571,36 2.045,37 3.921,39 1.921,40 32.475,41 34.917,42 37.355,43 4.067,44 4.155,45 18.27,46 18.564,47 0.639,48 4.254,49 4.85,50 4.85,51 7.85,52 4.85,53 6.148,54 5.6,55 17.905,56 20.389,57 22.746,58 25.196,59 27.604,60 30.046,61 8.143,62 -0.022,63 3.462,64 15.68,65 1,66 13.072,67 5}
{0 CHEMBL601719,1 0.64,3 1.91,4 1.758,5 5,6 4.126,7 1.897,8 1.829,9 1.565,10 0.658,12 4.081,13 1,14 1.903,15 1.815,16 9,18 3.981,19 4.05,20 3.993,22 4.098,23 4.168,24 16.317,25 9.144,26 11.697,27 12.681,28 13.767,29 14.791,30 15.862,31 3.938,32 9.058,33 1.02,34 1.039,35 1.357,36 2.04,37 3.875,39 1.468,40 31.358,41 33.727,42 36.084,43 3.908,44 3.928,45 16.905,46 18.144,47 0.656,48 4.074,49 4.165,50 4.165,51 7.165,52 4.165,53 6.038,54 1.9,55 17.27,56 19.721,57 21.955,58 24.345,59 26.648,60 29.02,61 7.711,62 -0.002,63 3.258,64 15.186,65 3,66 12.566,67 5.398}
{0 CHEMBL608154,1 0.624,3 1.97,4 1.775,5 2,6 4.223,7 1.958,8 1.675,9 1.61,10 0.673,11 -0.283,12 3.923,14 1.886,15 1.811,16 2,18 3.857,19 4.216,20 3.825,22 4.243,23 3.954,24 16.418,25 7.658,26 12.192,27 13.287,28 14.443,29 15.57,30 16.721,31 4.143,32 6.735,33 0.976,34 1.198,35 1.034,36 2.053,37 3.721,39 1.141,40 32.311,41 34.77,42 37.22,43 3.79,44 4.132,45 17.863,46 18.28,47 0.695,48 3.912,49 4.884,50 4.884,51 7.884,52 4.884,53 5.908,54 4.9,55 17.676,56 20.199,57 22.54,58 25.013,59 27.417,60 29.876,61 7.774,62 -0.006,63 3.078,64 15.476,65 3,66 12.797,67 5}
{0 CHEMBL81714,1 0.679,3 2.035,4 1.537,5 2,6 4.06,7 2.019,8 1.671,9 1.587,10 0.635,11 -1.872,12 3.749,14 1.656,15 1.555,16 2,18 3.577,19 4.087,20 3.446,22 4.106,23 3.734,24 16.143,25 5.554,26 11.884,27 12.912,28 14.025,29 15.091,30 16.196,31 4.019,32 4.693,33 0.718,34 1.097,35 0.767,36 2.127,37 3.649,39 0.959,40 31.074,41 33.443,42 35.795,43 3.464,44 4.01,45 17.282,46 17.962,47 0.687,48 3.581,49 4.543,50 4.543,51 7.543,52 4.543,53 5.883,54 15,55 17.025,56 19.474,57 21.689,58 24.079,59 26.371,60 28.743,61 7.554,62 -0.179,63 2.941,64 14.965,65 3,66 12.354,67 5.201}
{0 CHEMBL91829,1 0.874,3 1.964,4 1.746,5 12,6 4.179,7 1.946,8 1.994,9 1.594,10 0.679,11 0.201,12 4.488,13 2,14 1.959,15 1.787,16 13,18 4.562,19 4.209,20 4.699,22 4.237,23 4.561,24 16.797,25 19.102,26 12.765,27 13.911,28 15.108,29 16.284,30 17.48,31 4.136,32 19.81,33 1.173,34 1.779,35 2.715,36 2.05,37 3.831,39 2.511,40 33.259,41 35.772,42 38.282,43 4.634,44 4.127,45 18.671,46 18.678,47 0.644,48 4.626,49 4.714,50 4.714,51 7.714,52 4.714,53 6.383,54 4.8,55 18.269,56 20.836,57 23.254,58 25.777,59 28.249,60 30.762,61 8.146,62 0.029,63 3.361,64 15.986,65 4,66 13.272,67 5}
{0 CHEMBL939,1 0.792,3 2.005,4 1.691,5 5,6 4.073,7 1.984,8 1.782,9 1.5,10 0.685,12 4.01,14 1.923,15 1.754,16 4,18 3.975,19 4.079,20 4.022,22 4.107,23 4.094,24 16.017,25 10.185,26 11.463,27 12.442,28 13.549,29 14.583,30 15.677,31 3.991,32 9.526,33 1.069,34 0.736,35 1.383,36 2.126,37 3.884,39 1.436,40 30.734,41 33.076,42 35.404,43 3.955,44 3.977,45 16.741,46 17.81,47 0.641,48 4.066,49 4.513,50 4.513,51 7.513,52 4.513,53 5.867,54 5.5,55 16.84,56 19.264,57 21.451,58 23.814,59 26.082,60 28.427,61 7.476,62 -0.043,63 3.276,64 14.822,65 1,66 12.224,67 5}
{0 CHEMBL941,1 0.919,3 1.957,4 1.846,5 5,6 3.978,7 1.929,8 1.791,9 1.504,10 0.669,11 -0.143,12 4.247,14 1.979,15 1.877,16 3,18 4.196,19 4.028,20 4.268,22 4.068,23 4.367,24 16.03,25 11.142,26 11.714,27 12.648,28 13.725,29 14.711,30 15.765,31 3.936,32 12.405,33 1.125,34 0.938,35 1.798,36 2.075,37 3.932,39 1.949,40 29.696,41 31.904,42 34.085,43 4.179,44 3.932,45 16.777,46 17.781,47 0.635,48 4.291,49 3.96,50 3.96,51 6.96,52 3.96,53 6.073,54 1.5,55 16.554,56 18.895,57 20.936,58 23.192,59 25.314,60 27.535,61 7.554,62 -0.145,63 3.335,64 14.679,65 4,66 12.137,67 5}
