{
  "data_set_description": {
    "collection_date": "November 2013",
    "creator": "Dr Jeremy Besnard, Dr Ivan Olier, Dr Noureddin Sadawi, Dr Larisa Soldatova, Dr Crina Grosan, Prof Ross King, Dr Richard Bickerton, Prof Andrew Hopkins and Dr Willem van Hoorn",
    "default_target_attribute": "pXC50",
    "description": "This dataset contains QSAR data (from ChEMBL version 17) showing activity values (unit is pseudo-pCI50) of several compounds on drug target ChEMBL_ID: CHEMBL5582 (TID: 101242), and it has 124 rows and 1232 features (not including molecule IDs and class feature: molecule_id and pXC50). The features represent Molecular Descriptors which were generated from SMILES strings. Missing value imputation was applied to this dataset (By choosing the Median).",
    "description_version": "1",
    "file_id": "3441363",
    "format": "ARFF",
    "id": "31183",
    "licence": "Public",
    "md5_checksum": "5a261cc19da91250dc570f6e7e5d24a9",
    "minio_url": "https://data.openml.org/datasets/0003/31183/dataset_31183.pq",
    "name": "QSAR-DATASET-FOR-DRUG-TARGET-CHEMBL5582",
    "original_data_url": "https://www.ebi.ac.uk/chembl/target/inspect/CHEMBL5582",
    "parquet_url": "https://data.openml.org/datasets/0003/31183/dataset_31183.pq",
    "processing_date": "2018-10-04 02:15:52",
    "row_id_attribute": "molecule_id",
    "status": "deactivated",
    "tag": [
      "MetaQSAR",
      "study_13"
    ],
    "upload_date": "2016-07-15T06:55:10",
    "url": "https://api.openml.org/data/v1/download/3441363/QSAR-DATASET-FOR-DRUG-TARGET-CHEMBL5582.arff",
    "version": "8",
    "visibility": "public"
  }
}