"molecule_id","AMW","C.","H.","Me","Mi","Mp","Mv","MW","N.","nAB","nAT","nB","nBM","nBO","nBR","nBT","nC","nCL","nCsp","nCsp2","nCsp3","nDB","nF","nH","nHet","nHM","nI","nN","nO","nP","nS","nSK","nTB","nX","O.","RBF","RBN","SCBO","Se","Si","Sp","Sv","X.","pXC50"
{1 7.838,2 36.2,3 44.7,4 1.032,5 1.144,6 0.623,7 0.617,8 368.4,9 4.3,10 6,11 47,13 10,14 26,16 47,17 17,20 10,21 7,22 4,23 1,24 21,25 9,28 2,29 6,32 26,34 1,35 12.8,36 0.191,37 9,38 33,39 48.516,40 53.745,41 29.29,42 28.983,43 2.1,44 7.523}
{0 CHEMBL185356,1 9.026,2 36,3 42,4 1.041,5 1.141,6 0.655,7 0.643,8 451.31,9 4,10 6,11 50,13 10,14 29,16 50,17 18,18 2,20 10,21 8,22 4,23 1,24 21,25 11,26 2,28 2,29 6,32 29,34 3,35 12,36 0.2,37 10,38 36,39 52.047,40 57.048,41 32.767,42 32.165,43 6,44 8.046}
{0 CHEMBL1907830,1 8.38,2 41.3,3 41.3,4 1.017,5 1.121,6 0.686,7 0.659,8 385.48,9 6.5,10 12,11 46,13 16,14 30,16 49,17 19,20 14,21 5,22 4,24 19,25 8,26 1,28 3,29 4,31 1,32 27,35 8.7,36 0.102,37 5,38 40,39 46.76,40 51.574,41 31.574,42 30.325,44 6.071}
{0 CHEMBL23226,1 7.649,2 36,3 46,4 1.028,5 1.143,6 0.621,7 0.61,8 382.43,9 4,10 6,11 50,13 10,14 27,16 50,17 18,20 10,21 8,22 4,23 1,24 23,25 9,28 2,29 6,32 27,34 1,35 12,36 0.2,37 10,38 34,39 51.4,40 57.16,41 31.051,42 30.51,43 2,44 8.301}
{0 CHEMBL2323966,1 7.959,2 34.3,3 47.1,4 1.019,5 1.136,6 0.645,7 0.614,8 557.13,9 5.7,10 6,11 70,13 13,14 38,16 71,17 24,18 1,20 12,21 12,22 7,24 33,25 13,26 2,28 4,29 7,31 1,32 37,34 1,35 10,36 0.141,37 10,38 48,39 71.352,40 79.551,41 45.131,42 43.006,43 1.4,44 5.638}
{0 CHEMBL2323967,1 7.79,2 34.1,3 46.3,4 1.026,5 1.138,6 0.629,7 0.611,8 638.77,9 4.9,10 6,11 82,13 15,14 45,16 83,17 28,20 14,21 14,22 9,24 38,25 16,26 1,28 4,29 11,31 1,32 44,35 13.4,36 0.193,37 16,38 57,39 84.105,40 93.275,41 51.614,42 50.091,44 5.959}
{0 CHEMBL2324339,1 7.339,2 33,3 49.5,4 1.017,5 1.141,6 0.62,7 0.593,8 667.87,9 5.5,10 6,11 91,13 15,14 46,16 91,17 30,20 14,21 16,22 9,24 45,25 16,26 1,28 5,29 10,31 1,32 46,35 11,36 0.22,37 20,38 58,39 92.53,40 103.81,41 56.449,42 53.978,44 6.097}
{0 CHEMBL2324340,1 7.626,2 36.4,3 46.5,4 1.016,5 1.134,6 0.641,7 0.616,8 754.95,9 6.1,10 16,11 99,13 25,14 55,16 101,17 36,20 22,21 14,22 9,24 46,25 17,26 1,28 6,29 10,31 1,32 53,35 10.1,36 0.208,37 21,38 72,39 100.632,40 112.308,41 63.455,42 60.999,44 5.759}
{0 CHEMBL2324341,1 7.6,2 37.5,3 45.5,4 1.022,5 1.134,6 0.633,7 0.619,8 668.77,9 4.5,10 12,11 88,13 20,14 49,16 89,17 33,20 21,21 12,22 8,24 40,25 15,28 4,29 11,32 48,35 12.5,36 0.225,37 20,38 63,39 89.912,40 99.77,41 55.727,42 54.431,44 6}
{0 CHEMBL237310,1 7.992,2 39.3,3 42.6,4 1.028,5 1.136,6 0.644,7 0.636,8 487.53,9 4.9,10 12,11 61,13 17,14 36,16 62,17 24,20 17,21 7,22 5,23 1,24 26,25 11,28 3,29 7,32 35,34 1,35 11.5,36 0.177,37 11,38 47,39 62.712,40 69.283,41 39.273,42 38.773,43 1.6,44 8.222}
{0 CHEMBL293622,1 9.818,2 42.9,3 28.6,4 1.061,5 1.127,6 0.683,7 0.712,8 206.17,9 9.5,10 6,11 21,13 10,14 16,16 22,17 9,20 8,21 1,22 4,24 6,25 6,28 2,29 4,32 15,35 19,36 0.045,37 1,38 23,39 22.28,40 23.665,41 14.352,42 14.956,44 5.143}
{0 CHEMBL305545,1 9.043,2 38.7,3 38.7,4 1.032,5 1.124,6 0.687,7 0.668,8 280.33,9 6.5,10 6,11 31,13 10,14 21,16 33,17 12,20 8,21 4,22 4,24 12,25 7,26 1,28 2,29 4,31 1,32 19,35 12.9,36 0.061,37 2,38 28,39 32.007,40 34.83,41 21.284,42 20.723,44 4.921}
{0 CHEMBL330535,1 7.402,2 39.3,3 46.4,4 1.014,5 1.129,6 0.641,7 0.619,8 414.5,9 3.6,10 11,11 56,13 15,14 31,16 57,17 22,20 14,21 8,22 4,24 26,25 8,28 2,29 6,32 30,35 10.7,36 0.193,37 11,38 40.5,39 56.771,40 63.235,41 35.875,42 34.653,44 5.565}
{0 CHEMBL439753,1 8.217,2 44.8,3 41.4,4 1.011,5 1.113,6 0.695,7 0.665,8 476.59,9 3.4,10 18,11 58,13 22,14 38,16 62,17 26,20 20,21 6,22 4,24 24,25 8,26 1,28 2,29 5,31 1,32 34,35 8.6,36 0.113,37 7,38 51,39 58.636,40 64.531,41 40.307,42 38.599,44 6.921}
{0 CHEMBL479009,1 8.294,2 42.9,3 40,4 1.033,5 1.119,6 0.659,7 0.656,8 290.29,10 11,11 35,13 13,14 22,16 36,17 15,20 12,21 3,22 2,24 14,25 6,29 6,32 21,35 17.1,36 0.167,37 6,38 29.5,39 36.149,40 39.163,41 23.057,42 22.976,44 4.032}
{0 CHEMBL567893,1 6.599,2 32.6,3 53.4,4 1.006,5 1.144,6 0.601,7 0.569,8 1174.62,9 5.1,10 6,11 178,13 17,14 84,16 179,17 58,20 17,21 41,22 11,24 95,25 25,28 9,29 16,32 83,35 9,36 0.201,37 36,38 98,39 179.148,40 203.689,41 107.064,42 101.282,44 5.301}
{0 CHEMBL60190,1 8.537,2 36.8,3 42.1,4 1.029,5 1.128,6 0.665,7 0.645,8 324.39,9 5.3,10 6,11 38,13 10,14 24,16 40,17 14,20 8,21 6,22 4,24 16,25 8,26 1,28 2,29 5,31 1,32 22,35 13.2,36 0.1,37 4,38 31,39 39.102,40 42.87,41 25.261,42 24.492,44 5.959}
{0 CHEMBL60306,1 9.105,2 48.4,3 32.3,4 1.034,5 1.113,6 0.706,7 0.71,8 282.27,9 6.5,10 12,11 31,13 16,14 23,16 33,17 15,20 14,21 1,22 4,24 10,25 6,28 2,29 4,32 21,35 12.9,36 0.091,37 3,38 33,39 32.047,40 34.495,41 21.875,42 22.009,44 5.301}
{0 CHEMBL62187,1 8.153,2 40.8,3 42.9,4 1.013,5 1.122,6 0.68,7 0.65,8 399.51,9 6.1,10 12,11 49,13 16,14 31,16 52,17 20,20 14,21 6,22 4,24 21,25 8,26 1,28 3,29 4,31 1,32 28,35 8.2,36 0.096,37 5,38 41,39 49.643,40 54.989,41 33.335,42 31.852,44 4.301}
{0 CHEMBL62993,1 8.588,2 42.2,3 40,4 1.022,5 1.117,6 0.689,7 0.667,8 386.46,9 4.4,10 12,11 45,13 16,14 30,16 48,17 19,20 14,21 5,22 4,24 18,25 8,26 1,28 2,29 5,31 1,32 27,35 11.1,36 0.104,37 5,38 40,39 45.985,40 50.285,41 31.023,42 30.018,44 5.921}
{0 CHEMBL90224,1 7.255,2 38.6,3 47.4,4 1.01,5 1.132,6 0.639,7 0.613,8 413.52,9 5.3,10 11,11 57,13 15,14 31,16 58,17 22,20 14,21 8,22 4,24 27,25 8,28 3,29 5,32 30,35 8.8,36 0.19,37 11,38 40.5,39 57.545,40 64.524,41 36.426,42 34.96,44 6.796}
{0 CHEMBL90307,1 7.634,2 39.3,3 44.6,4 1.018,5 1.131,6 0.645,7 0.628,8 427.5,9 5.4,10 11,11 56,13 16,14 32,16 57,17 22,20 15,21 7,22 5,24 25,25 9,28 3,29 6,32 31,35 10.7,36 0.175,37 10,38 42.5,39 56.989,40 63.319,41 36.12,42 35.148,44 6.638}
