{
  "data_features": {
    "feature": [
      {
        "data_type": "nominal",
        "index": "0",
        "is_ignore": "false",
        "is_row_identifier": "true",
        "is_target": "false",
        "name": "molecule_id",
        "nominal_value": [
          "CHEMBL1630180",
          "CHEMBL1630181",
          "CHEMBL1630182",
          "CHEMBL1630183",
          "CHEMBL1630184",
          "CHEMBL1630185",
          "CHEMBL1630186",
          "CHEMBL1630187",
          "CHEMBL1630188",
          "CHEMBL1630189",
          "CHEMBL1630190",
          "CHEMBL1630191",
          "CHEMBL1630192",
          "CHEMBL1630193",
          "CHEMBL1630194",
          "CHEMBL1630195",
          "CHEMBL1630196",
          "CHEMBL1630197",
          "CHEMBL1630198",
          "CHEMBL1630199",
          "CHEMBL1630200",
          "CHEMBL1630201",
          "CHEMBL1630202",
          "CHEMBL1630526",
          "CHEMBL1630527",
          "CHEMBL1630528",
          "CHEMBL1630529",
          "CHEMBL1631105",
          "CHEMBL1631106",
          "CHEMBL1631677",
          "CHEMBL1631678",
          "CHEMBL1631679",
          "CHEMBL1631680",
          "CHEMBL1631681",
          "CHEMBL1632419",
          "CHEMBL1632420",
          "CHEMBL1632422",
          "CHEMBL1632423",
          "CHEMBL1632424",
          "CHEMBL1632425",
          "CHEMBL1632426",
          "CHEMBL1632427",
          "CHEMBL1632428",
          "CHEMBL1632429",
          "CHEMBL1632430",
          "CHEMBL1632431",
          "CHEMBL1632432",
          "CHEMBL1632433",
          "CHEMBL1632434",
          "CHEMBL1632435",
          "CHEMBL1632436",
          "CHEMBL1632437",
          "CHEMBL1632438",
          "CHEMBL1632439",
          "CHEMBL1632440",
          "CHEMBL1632441"
        ],
        "number_of_missing_values": "0"
      },
      {
        "data_type": "numeric",
        "index": "1",
        "is_ignore": "false",
        "is_row_identifier": "false",
        "is_target": "false",
        "name": "ATSC5e",
        "number_of_missing_values": "0"
      },
      {
        "data_type": "numeric",
        "index": "2",
        "is_ignore": "false",
        "is_row_identifier": "false",
        "is_target": "false",
        "name": "SsssCH",
        "number_of_missing_values": "0"
      },
      {
        "data_type": "numeric",
        "index": "3",
        "is_ignore": "false",
        "is_row_identifier": "false",
        "is_target": "false",
        "name": "ATSC2s",
        "number_of_missing_values": "0"
      },
      {
        "data_type": "numeric",
        "index": "4",
        "is_ignore": "false",
        "is_row_identifier": "false",
        "is_target": "false",
        "name": "ATSC3s",
        "number_of_missing_values": "0"
      },
      {
        "data_type": "numeric",
        "index": "5",
        "is_ignore": "false",
        "is_row_identifier": "false",
        "is_target": "false",
        "name": "ATSC7s",
        "number_of_missing_values": "0"
      },
      {
        "data_type": "numeric",
        "index": "6",
        "is_ignore": "false",
        "is_row_identifier": "false",
        "is_target": "false",
        "name": "ATSC8s",
        "number_of_missing_values": "0"
      },
      {
        "data_type": "numeric",
        "index": "7",
        "is_ignore": "false",
        "is_row_identifier": "false",
        "is_target": "false",
        "name": "C.040",
        "number_of_missing_values": "0"
      },
      {
        "data_type": "numeric",
        "index": "8",
        "is_ignore": "false",
        "is_row_identifier": "false",
        "is_target": "false",
        "name": "CATS2D_01_AN",
        "number_of_missing_values": "0"
      },
      {
        "data_type": "numeric",
        "index": "9",
        "is_ignore": "false",
        "is_row_identifier": "false",
        "is_target": "false",
        "name": "CATS2D_01_DN",
        "number_of_missing_values": "0"
      },
      {
        "data_type": "numeric",
        "index": "10",
        "is_ignore": "false",
        "is_row_identifier": "false",
        "is_target": "false",
        "name": "CATS2D_01_NL",
        "number_of_missing_values": "0"
      },
      {
        "data_type": "numeric",
        "index": "11",
        "is_ignore": "false",
        "is_row_identifier": "false",
        "is_target": "false",
        "name": "CATS2D_02_AL",
        "number_of_missing_values": "0"
      },
      {
        "data_type": "numeric",
        "index": "12",
        "is_ignore": "false",
        "is_row_identifier": "false",
        "is_target": "false",
        "name": "CATS2D_02_DA",
        "number_of_missing_values": "0"
      },
      {
        "data_type": "numeric",
        "index": "13",
        "is_ignore": "false",
        "is_row_identifier": "false",
        "is_target": "false",
        "name": "CATS2D_04_DN",
        "number_of_missing_values": "0"
      },
      {
        "data_type": "numeric",
        "index": "14",
        "is_ignore": "false",
        "is_row_identifier": "false",
        "is_target": "false",
        "name": "CATS2D_05_AN",
        "number_of_missing_values": "0"
      },
      {
        "data_type": "numeric",
        "index": "15",
        "is_ignore": "false",
        "is_row_identifier": "false",
        "is_target": "false",
        "name": "CATS2D_05_DA",
        "number_of_missing_values": "0"
      },
      {
        "data_type": "numeric",
        "index": "16",
        "is_ignore": "false",
        "is_row_identifier": "false",
        "is_target": "false",
        "name": "CATS2D_05_DD",
        "number_of_missing_values": "0"
      },
      {
        "data_type": "numeric",
        "index": "17",
        "is_ignore": "false",
        "is_row_identifier": "false",
        "is_target": "false",
        "name": "CATS2D_06_AA",
        "number_of_missing_values": "0"
      },
      {
        "data_type": "numeric",
        "index": "18",
        "is_ignore": "false",
        "is_row_identifier": "false",
        "is_target": "false",
        "name": "CATS2D_06_DA",
        "number_of_missing_values": "0"
      },
      {
        "data_type": "numeric",
        "index": "19",
        "is_ignore": "false",
        "is_row_identifier": "false",
        "is_target": "false",
        "name": "CATS2D_07_DN",
        "number_of_missing_values": "0"
      },
      {
        "data_type": "numeric",
        "index": "20",
        "is_ignore": "false",
        "is_row_identifier": "false",
        "is_target": "false",
        "name": "CATS2D_07_NL",
        "number_of_missing_values": "0"
      },
      {
        "data_type": "numeric",
        "index": "21",
        "is_ignore": "false",
        "is_row_identifier": "false",
        "is_target": "false",
        "name": "CATS2D_08_AN",
        "number_of_missing_values": "0"
      },
      {
        "data_type": "numeric",
        "index": "22",
        "is_ignore": "false",
        "is_row_identifier": "false",
        "is_target": "false",
        "name": "CATS2D_08_DD",
        "number_of_missing_values": "0"
      },
      {
        "data_type": "numeric",
        "index": "23",
        "is_ignore": "false",
        "is_row_identifier": "false",
        "is_target": "false",
        "name": "CATS2D_09_AA",
        "number_of_missing_values": "0"
      },
      {
        "data_type": "numeric",
        "index": "24",
        "is_ignore": "false",
        "is_row_identifier": "false",
        "is_target": "false",
        "name": "CATS2D_09_AN",
        "number_of_missing_values": "0"
      },
      {
        "data_type": "numeric",
        "index": "25",
        "is_ignore": "false",
        "is_row_identifier": "false",
        "is_target": "false",
        "name": "CATS2D_09_DA",
        "number_of_missing_values": "0"
      },
      {
        "data_type": "numeric",
        "index": "26",
        "is_ignore": "false",
        "is_row_identifier": "false",
        "is_target": "false",
        "name": "DELS",
        "number_of_missing_values": "0"
      },
      {
        "data_type": "numeric",
        "index": "27",
        "is_ignore": "false",
        "is_row_identifier": "false",
        "is_target": "false",
        "name": "Eig06_EA.dm.",
        "number_of_missing_values": "0"
      },
      {
        "data_type": "numeric",
        "index": "28",
        "is_ignore": "false",
        "is_row_identifier": "false",
        "is_target": "false",
        "name": "Eig07_EA.dm.",
        "number_of_missing_values": "0"
      },
      {
        "data_type": "numeric",
        "index": "29",
        "is_ignore": "false",
        "is_row_identifier": "false",
        "is_target": "false",
        "name": "Eig08_EA.dm.",
        "number_of_missing_values": "0"
      },
      {
        "data_type": "numeric",
        "index": "30",
        "is_ignore": "false",
        "is_row_identifier": "false",
        "is_target": "false",
        "name": "Eig09_EA.dm.",
        "number_of_missing_values": "0"
      },
      {
        "data_type": "numeric",
        "index": "31",
        "is_ignore": "false",
        "is_row_identifier": "false",
        "is_target": "false",
        "name": "Eig10_EA.dm.",
        "number_of_missing_values": "0"
      },
      {
        "data_type": "numeric",
        "index": "32",
        "is_ignore": "false",
        "is_row_identifier": "false",
        "is_target": "false",
        "name": "Eig11_EA.dm.",
        "number_of_missing_values": "0"
      },
      {
        "data_type": "numeric",
        "index": "33",
        "is_ignore": "false",
        "is_row_identifier": "false",
        "is_target": "false",
        "name": "Eig12_EA.dm.",
        "number_of_missing_values": "0"
      },
      {
        "data_type": "numeric",
        "index": "34",
        "is_ignore": "false",
        "is_row_identifier": "false",
        "is_target": "false",
        "name": "Eig13_EA.dm.",
        "number_of_missing_values": "0"
      },
      {
        "data_type": "numeric",
        "index": "35",
        "is_ignore": "false",
        "is_row_identifier": "false",
        "is_target": "false",
        "name": "Eig14_EA.dm.",
        "number_of_missing_values": "0"
      },
      {
        "data_type": "numeric",
        "index": "36",
        "is_ignore": "false",
        "is_row_identifier": "false",
        "is_target": "false",
        "name": "Eig15_EA.dm.",
        "number_of_missing_values": "0"
      },
      {
        "data_type": "numeric",
        "index": "37",
        "is_ignore": "false",
        "is_row_identifier": "false",
        "is_target": "false",
        "name": "GATS6e",
        "number_of_missing_values": "0"
      },
      {
        "data_type": "numeric",
        "index": "38",
        "is_ignore": "false",
        "is_row_identifier": "false",
        "is_target": "false",
        "name": "GATS6m",
        "number_of_missing_values": "0"
      },
      {
        "data_type": "numeric",
        "index": "39",
        "is_ignore": "false",
        "is_row_identifier": "false",
        "is_target": "false",
        "name": "GATS6s",
        "number_of_missing_values": "0"
      },
      {
        "data_type": "numeric",
        "index": "40",
        "is_ignore": "false",
        "is_row_identifier": "false",
        "is_target": "false",
        "name": "GATS7e",
        "number_of_missing_values": "0"
      },
      {
        "data_type": "numeric",
        "index": "41",
        "is_ignore": "false",
        "is_row_identifier": "false",
        "is_target": "false",
        "name": "GATS7m",
        "number_of_missing_values": "0"
      },
      {
        "data_type": "numeric",
        "index": "42",
        "is_ignore": "false",
        "is_row_identifier": "false",
        "is_target": "false",
        "name": "H.051",
        "number_of_missing_values": "0"
      },
      {
        "data_type": "numeric",
        "index": "43",
        "is_ignore": "false",
        "is_row_identifier": "false",
        "is_target": "false",
        "name": "MATS2s",
        "number_of_missing_values": "0"
      },
      {
        "data_type": "numeric",
        "index": "44",
        "is_ignore": "false",
        "is_row_identifier": "false",
        "is_target": "false",
        "name": "MAXDN",
        "number_of_missing_values": "0"
      },
      {
        "data_type": "numeric",
        "index": "45",
        "is_ignore": "false",
        "is_row_identifier": "false",
        "is_target": "false",
        "name": "NdO",
        "number_of_missing_values": "0"
      },
      {
        "data_type": "numeric",
        "index": "46",
        "is_ignore": "false",
        "is_row_identifier": "false",
        "is_target": "false",
        "name": "NdssC",
        "number_of_missing_values": "0"
      },
      {
        "data_type": "numeric",
        "index": "47",
        "is_ignore": "false",
        "is_row_identifier": "false",
        "is_target": "false",
        "name": "nHAcc",
        "number_of_missing_values": "0"
      },
      {
        "data_type": "numeric",
        "index": "48",
        "is_ignore": "false",
        "is_row_identifier": "false",
        "is_target": "false",
        "name": "nHet",
        "number_of_missing_values": "0"
      },
      {
        "data_type": "numeric",
        "index": "49",
        "is_ignore": "false",
        "is_row_identifier": "false",
        "is_target": "false",
        "name": "nO",
        "number_of_missing_values": "0"
      },
      {
        "data_type": "numeric",
        "index": "50",
        "is_ignore": "false",
        "is_row_identifier": "false",
        "is_target": "false",
        "name": "nRCOOH",
        "number_of_missing_values": "0"
      },
      {
        "data_type": "numeric",
        "index": "51",
        "is_ignore": "false",
        "is_row_identifier": "false",
        "is_target": "false",
        "name": "nROH",
        "number_of_missing_values": "0"
      },
      {
        "data_type": "numeric",
        "index": "52",
        "is_ignore": "false",
        "is_row_identifier": "false",
        "is_target": "false",
        "name": "NsOH",
        "number_of_missing_values": "0"
      },
      {
        "data_type": "numeric",
        "index": "53",
        "is_ignore": "false",
        "is_row_identifier": "false",
        "is_target": "false",
        "name": "O.",
        "number_of_missing_values": "0"
      },
      {
        "data_type": "numeric",
        "index": "54",
        "is_ignore": "false",
        "is_row_identifier": "false",
        "is_target": "true",
        "name": "pXC50",
        "number_of_missing_values": "0"
      }
    ]
  }
}