{
  "data_set_description": {
    "collection_date": "November 2013",
    "creator": "Dr Jeremy Besnard, Dr Ivan Olier, Dr Noureddin Sadawi, Dr Larisa Soldatova, Dr Crina Grosan, Prof Ross King, Dr Richard Bickerton, Prof Andrew Hopkins and Dr Willem van Hoorn",
    "default_target_attribute": "pXC50",
    "description": "This dataset contains QSAR data (from ChEMBL version 17) showing activity values (unit is pseudo-pCI50) of several compounds on drug target ChEMBL_ID: CHEMBL3738 (TID: 11866), and it has 47 rows and 43 features (not including molecule IDs and class feature: molecule_id and pXC50). The features represent Basic Molecular Descriptors which were generated from SMILES strings.  Missing value imputation was applied to this dataset (By choosing the Median).",
    "description_version": "1",
    "file_id": "3438457",
    "format": "ARFF",
    "id": "31095",
    "licence": "Public",
    "md5_checksum": "0c37211cf72f7efee5ab44faf97bda6f",
    "minio_url": "https://data.openml.org/datasets/0003/31095/dataset_31095.pq",
    "name": "QSAR-DATASET-FOR-DRUG-TARGET-CHEMBL3738",
    "original_data_url": "https://www.ebi.ac.uk/chembl/target/inspect/CHEMBL3738",
    "parquet_url": "https://data.openml.org/datasets/0003/31095/dataset_31095.pq",
    "processing_date": "2018-10-04 02:24:31",
    "row_id_attribute": "molecule_id",
    "status": "deactivated",
    "tag": [
      "MetaQSAR",
      "study_13"
    ],
    "upload_date": "2016-07-15T06:41:05",
    "url": "https://api.openml.org/data/v1/download/3438457/QSAR-DATASET-FOR-DRUG-TARGET-CHEMBL3738.arff",
    "version": "10",
    "visibility": "public"
  }
}