{
  "data_set_description": {
    "collection_date": "November 2013",
    "creator": "Dr Jeremy Besnard, Dr Ivan Olier, Dr Noureddin Sadawi, Dr Larisa Soldatova, Dr Crina Grosan, Prof Ross King, Dr Richard Bickerton, Prof Andrew Hopkins and Dr Willem van Hoorn",
    "default_target_attribute": "pXC50",
    "description": "This dataset contains QSAR data (from ChEMBL version 17) showing activity values (unit is pseudo-pCI50) of several compounds on drug target ChEMBL_ID: CHEMBL2508 (TID: 10480), and it has 21 rows and 1225 features (not including molecule IDs and class feature: molecule_id and pXC50). The features represent Molecular Descriptors which were generated from SMILES strings. Missing value imputation was applied to this dataset (By choosing the Median).",
    "description_version": "1",
    "file_id": "3436264",
    "format": "ARFF",
    "id": "31018",
    "licence": "Public",
    "md5_checksum": "b8c5badcd84164c0906c2d9c45d28727",
    "minio_url": "https://data.openml.org/datasets/0003/31018/dataset_31018.pq",
    "name": "QSAR-DATASET-FOR-DRUG-TARGET-CHEMBL2508",
    "original_data_url": "https://www.ebi.ac.uk/chembl/target/inspect/CHEMBL2508",
    "parquet_url": "https://data.openml.org/datasets/0003/31018/dataset_31018.pq",
    "processing_date": "2018-10-04 02:09:39",
    "row_id_attribute": "molecule_id",
    "status": "deactivated",
    "tag": [
      "MetaQSAR",
      "study_13"
    ],
    "upload_date": "2016-07-15T06:29:13",
    "url": "https://api.openml.org/data/v1/download/3436264/QSAR-DATASET-FOR-DRUG-TARGET-CHEMBL2508.arff",
    "version": "10",
    "visibility": "public"
  }
}