{
  "data_features": {
    "feature": [
      {
        "data_type": "nominal",
        "index": "0",
        "is_ignore": "false",
        "is_row_identifier": "true",
        "is_target": "false",
        "name": "molecule_id",
        "nominal_value": [
          "CHEMBL108142",
          "CHEMBL108748",
          "CHEMBL109242",
          "CHEMBL109408",
          "CHEMBL109644",
          "CHEMBL109736",
          "CHEMBL109765",
          "CHEMBL110305",
          "CHEMBL110366",
          "CHEMBL110700",
          "CHEMBL110794",
          "CHEMBL110899",
          "CHEMBL111010",
          "CHEMBL111277",
          "CHEMBL111355",
          "CHEMBL111517",
          "CHEMBL111712",
          "CHEMBL111728",
          "CHEMBL111769",
          "CHEMBL111783",
          "CHEMBL112325",
          "CHEMBL112347",
          "CHEMBL112685",
          "CHEMBL112832",
          "CHEMBL113087",
          "CHEMBL113184",
          "CHEMBL113379",
          "CHEMBL113400",
          "CHEMBL113494",
          "CHEMBL113529",
          "CHEMBL113611",
          "CHEMBL114084",
          "CHEMBL1269102",
          "CHEMBL133257",
          "CHEMBL151064",
          "CHEMBL152001",
          "CHEMBL152014",
          "CHEMBL152017",
          "CHEMBL152034",
          "CHEMBL152065",
          "CHEMBL152091",
          "CHEMBL152098",
          "CHEMBL152654",
          "CHEMBL152713",
          "CHEMBL171855",
          "CHEMBL171910",
          "CHEMBL172178",
          "CHEMBL172506",
          "CHEMBL172543",
          "CHEMBL172760",
          "CHEMBL173181",
          "CHEMBL173666",
          "CHEMBL173826",
          "CHEMBL173833",
          "CHEMBL174000",
          "CHEMBL174171",
          "CHEMBL1744023",
          "CHEMBL174448",
          "CHEMBL174635",
          "CHEMBL174658",
          "CHEMBL174686",
          "CHEMBL174818",
          "CHEMBL175066",
          "CHEMBL175103",
          "CHEMBL175277",
          "CHEMBL175924",
          "CHEMBL176093",
          "CHEMBL176152",
          "CHEMBL176420",
          "CHEMBL176430",
          "CHEMBL176513",
          "CHEMBL176514",
          "CHEMBL176565",
          "CHEMBL176653",
          "CHEMBL176794",
          "CHEMBL176913",
          "CHEMBL176992",
          "CHEMBL177023",
          "CHEMBL177195",
          "CHEMBL177261",
          "CHEMBL177431",
          "CHEMBL177502",
          "CHEMBL177602",
          "CHEMBL179138",
          "CHEMBL216772",
          "CHEMBL2304005",
          "CHEMBL2304006",
          "CHEMBL2304007",
          "CHEMBL2304008",
          "CHEMBL2304009",
          "CHEMBL2304010",
          "CHEMBL2304011",
          "CHEMBL2304012",
          "CHEMBL2304013",
          "CHEMBL2304014",
          "CHEMBL2304015",
          "CHEMBL2304016",
          "CHEMBL2304017",
          "CHEMBL2304018",
          "CHEMBL25438",
          "CHEMBL262000",
          "CHEMBL264543",
          "CHEMBL266143",
          "CHEMBL266144",
          "CHEMBL266336",
          "CHEMBL266337",
          "CHEMBL266354",
          "CHEMBL266594",
          "CHEMBL266996",
          "CHEMBL267279",
          "CHEMBL267483",
          "CHEMBL267695",
          "CHEMBL267761",
          "CHEMBL268432",
          "CHEMBL268433",
          "CHEMBL268864",
          "CHEMBL268902",
          "CHEMBL269108",
          "CHEMBL269140",
          "CHEMBL269141",
          "CHEMBL273476",
          "CHEMBL273583",
          "CHEMBL275306",
          "CHEMBL276362",
          "CHEMBL284250",
          "CHEMBL287888",
          "CHEMBL289349",
          "CHEMBL289410",
          "CHEMBL291841",
          "CHEMBL292041",
          "CHEMBL293012",
          "CHEMBL293161",
          "CHEMBL293192",
          "CHEMBL293702",
          "CHEMBL294123",
          "CHEMBL294127",
          "CHEMBL294496",
          "CHEMBL294787",
          "CHEMBL294793",
          "CHEMBL295483",
          "CHEMBL298340",
          "CHEMBL298395",
          "CHEMBL298725",
          "CHEMBL299328",
          "CHEMBL299521",
          "CHEMBL299572",
          "CHEMBL300066",
          "CHEMBL300201",
          "CHEMBL301577",
          "CHEMBL301971",
          "CHEMBL302189",
          "CHEMBL302659",
          "CHEMBL303531",
          "CHEMBL304202",
          "CHEMBL304875",
          "CHEMBL305117",
          "CHEMBL305149",
          "CHEMBL305524",
          "CHEMBL305577",
          "CHEMBL305615",
          "CHEMBL305650",
          "CHEMBL306123",
          "CHEMBL306171",
          "CHEMBL306977",
          "CHEMBL307077",
          "CHEMBL307903",
          "CHEMBL307936",
          "CHEMBL308383",
          "CHEMBL308403",
          "CHEMBL308584",
          "CHEMBL308621",
          "CHEMBL308815",
          "CHEMBL309003",
          "CHEMBL310111",
          "CHEMBL311134",
          "CHEMBL311384",
          "CHEMBL311422",
          "CHEMBL313871",
          "CHEMBL318017",
          "CHEMBL319743",
          "CHEMBL321035",
          "CHEMBL321673",
          "CHEMBL321852",
          "CHEMBL322297",
          "CHEMBL322935",
          "CHEMBL323055",
          "CHEMBL323464",
          "CHEMBL323789",
          "CHEMBL324214",
          "CHEMBL324301",
          "CHEMBL324639",
          "CHEMBL325418",
          "CHEMBL325444",
          "CHEMBL325581",
          "CHEMBL326191",
          "CHEMBL326690",
          "CHEMBL326719",
          "CHEMBL326861",
          "CHEMBL326951",
          "CHEMBL328311",
          "CHEMBL328683",
          "CHEMBL330424",
          "CHEMBL331375",
          "CHEMBL331577",
          "CHEMBL336033",
          "CHEMBL342615",
          "CHEMBL343379",
          "CHEMBL356916",
          "CHEMBL357978",
          "CHEMBL358444",
          "CHEMBL366387",
          "CHEMBL366391",
          "CHEMBL366544",
          "CHEMBL366745",
          "CHEMBL366911",
          "CHEMBL367176",
          "CHEMBL367208",
          "CHEMBL367313",
          "CHEMBL367551",
          "CHEMBL367989",
          "CHEMBL368255",
          "CHEMBL368286",
          "CHEMBL368339",
          "CHEMBL368360",
          "CHEMBL368461",
          "CHEMBL368641",
          "CHEMBL368711",
          "CHEMBL368788",
          "CHEMBL368847",
          "CHEMBL368853",
          "CHEMBL368854",
          "CHEMBL369202",
          "CHEMBL369257",
          "CHEMBL369386",
          "CHEMBL369420",
          "CHEMBL369610",
          "CHEMBL369874",
          "CHEMBL37807",
          "CHEMBL405377",
          "CHEMBL405724",
          "CHEMBL405753",
          "CHEMBL405796",
          "CHEMBL407559",
          "CHEMBL411399",
          "CHEMBL412002",
          "CHEMBL412003",
          "CHEMBL412065",
          "CHEMBL412602",
          "CHEMBL412865",
          "CHEMBL413604",
          "CHEMBL414165",
          "CHEMBL414175",
          "CHEMBL415762",
          "CHEMBL415942",
          "CHEMBL416675",
          "CHEMBL417050",
          "CHEMBL417413",
          "CHEMBL417555",
          "CHEMBL417595",
          "CHEMBL417971",
          "CHEMBL417972",
          "CHEMBL418473",
          "CHEMBL418667",
          "CHEMBL418898",
          "CHEMBL419211",
          "CHEMBL419367",
          "CHEMBL419383",
          "CHEMBL419749",
          "CHEMBL421563",
          "CHEMBL424422",
          "CHEMBL424764",
          "CHEMBL426413",
          "CHEMBL426589",
          "CHEMBL427778",
          "CHEMBL427935",
          "CHEMBL428298",
          "CHEMBL428504",
          "CHEMBL428644",
          "CHEMBL431124",
          "CHEMBL431160",
          "CHEMBL432489",
          "CHEMBL432683",
          "CHEMBL433090",
          "CHEMBL433373",
          "CHEMBL433842",
          "CHEMBL435156",
          "CHEMBL435537",
          "CHEMBL435773",
          "CHEMBL435894",
          "CHEMBL435901",
          "CHEMBL439759",
          "CHEMBL441112",
          "CHEMBL444061",
          "CHEMBL445076",
          "CHEMBL449962",
          "CHEMBL48315",
          "CHEMBL48411",
          "CHEMBL48881",
          "CHEMBL48907",
          "CHEMBL49675",
          "CHEMBL51030",
          "CHEMBL51234",
          "CHEMBL51530",
          "CHEMBL51890",
          "CHEMBL52338",
          "CHEMBL52535",
          "CHEMBL53097",
          "CHEMBL53168",
          "CHEMBL54057",
          "CHEMBL54274",
          "CHEMBL54703",
          "CHEMBL54770",
          "CHEMBL54773",
          "CHEMBL54998",
          "CHEMBL55664",
          "CHEMBL558148",
          "CHEMBL55876",
          "CHEMBL55909",
          "CHEMBL59425",
          "CHEMBL61211",
          "CHEMBL61406",
          "CHEMBL61460",
          "CHEMBL62264",
          "CHEMBL62277",
          "CHEMBL62348",
          "CHEMBL62363",
          "CHEMBL62374",
          "CHEMBL62376",
          "CHEMBL62395",
          "CHEMBL62425",
          "CHEMBL62450",
          "CHEMBL62465",
          "CHEMBL62585",
          "CHEMBL62586",
          "CHEMBL62659",
          "CHEMBL62669",
          "CHEMBL62719",
          "CHEMBL62759",
          "CHEMBL62762",
          "CHEMBL62780",
          "CHEMBL62814",
          "CHEMBL62951",
          "CHEMBL62962",
          "CHEMBL62976",
          "CHEMBL63000",
          "CHEMBL63057",
          "CHEMBL63058",
          "CHEMBL63067",
          "CHEMBL63099",
          "CHEMBL63113",
          "CHEMBL63121",
          "CHEMBL63267",
          "CHEMBL64039",
          "CHEMBL64244",
          "CHEMBL64266",
          "CHEMBL64282",
          "CHEMBL64340",
          "CHEMBL64398",
          "CHEMBL64447",
          "CHEMBL64536",
          "CHEMBL64632",
          "CHEMBL64726",
          "CHEMBL64832",
          "CHEMBL64851",
          "CHEMBL65070",
          "CHEMBL65201",
          "CHEMBL65292",
          "CHEMBL65337",
          "CHEMBL65353",
          "CHEMBL65494",
          "CHEMBL65599",
          "CHEMBL65619",
          "CHEMBL65658",
          "CHEMBL66094",
          "CHEMBL66246",
          "CHEMBL66264",
          "CHEMBL66426",
          "CHEMBL72410",
          "CHEMBL72891",
          "CHEMBL73925",
          "CHEMBL74000",
          "CHEMBL74471",
          "CHEMBL74837",
          "CHEMBL76735",
          "CHEMBL77033",
          "CHEMBL77083",
          "CHEMBL77468",
          "CHEMBL77853",
          "CHEMBL78023",
          "CHEMBL78230",
          "CHEMBL8671",
          "CHEMBL8677",
          "CHEMBL8736",
          "CHEMBL8776",
          "CHEMBL8878",
          "CHEMBL8911",
          "CHEMBL8923",
          "CHEMBL8925",
          "CHEMBL9012",
          "CHEMBL9040",
          "CHEMBL9050",
          "CHEMBL9082",
          "CHEMBL9084",
          "CHEMBL9119",
          "CHEMBL9132",
          "CHEMBL9139",
          "CHEMBL9141",
          "CHEMBL9147",
          "CHEMBL9162",
          "CHEMBL9168",
          "CHEMBL9183",
          "CHEMBL9189",
          "CHEMBL9194",
          "CHEMBL9212",
          "CHEMBL9223",
          "CHEMBL9228",
          "CHEMBL9283",
          "CHEMBL9313",
          "CHEMBL9334",
          "CHEMBL9342",
          "CHEMBL94102",
          "CHEMBL94216",
          "CHEMBL94426",
          "CHEMBL94654",
          "CHEMBL94720",
          "CHEMBL94732",
          "CHEMBL9488",
          "CHEMBL94918",
          "CHEMBL94929",
          "CHEMBL9495",
          "CHEMBL9502",
          "CHEMBL96234",
          "CHEMBL96644",
          "CHEMBL96662",
          "CHEMBL96762",
          "CHEMBL96847",
          "CHEMBL96931",
          "CHEMBL96935",
          "CHEMBL97595",
          "CHEMBL97851"
        ],
        "number_of_missing_values": "0"
      },
      {
        "data_type": "numeric",
        "index": "1",
        "is_ignore": "false",
        "is_row_identifier": "false",
        "is_target": "false",
        "name": "ARR",
        "number_of_missing_values": "0"
      },
      {
        "data_type": "numeric",
        "index": "2",
        "is_ignore": "false",
        "is_row_identifier": "false",
        "is_target": "false",
        "name": "C.043",
        "number_of_missing_values": "0"
      },
      {
        "data_type": "numeric",
        "index": "3",
        "is_ignore": "false",
        "is_row_identifier": "false",
        "is_target": "false",
        "name": "CATS2D_02_AN",
        "number_of_missing_values": "0"
      },
      {
        "data_type": "numeric",
        "index": "4",
        "is_ignore": "false",
        "is_row_identifier": "false",
        "is_target": "false",
        "name": "ATSC4p",
        "number_of_missing_values": "0"
      },
      {
        "data_type": "numeric",
        "index": "5",
        "is_ignore": "false",
        "is_row_identifier": "false",
        "is_target": "false",
        "name": "ATS4v",
        "number_of_missing_values": "0"
      },
      {
        "data_type": "numeric",
        "index": "6",
        "is_ignore": "false",
        "is_row_identifier": "false",
        "is_target": "false",
        "name": "nArCOOH",
        "number_of_missing_values": "0"
      },
      {
        "data_type": "numeric",
        "index": "7",
        "is_ignore": "false",
        "is_row_identifier": "false",
        "is_target": "false",
        "name": "SpMax2_Bh.s.",
        "number_of_missing_values": "0"
      },
      {
        "data_type": "numeric",
        "index": "8",
        "is_ignore": "false",
        "is_row_identifier": "false",
        "is_target": "false",
        "name": "GGI10",
        "number_of_missing_values": "0"
      },
      {
        "data_type": "numeric",
        "index": "9",
        "is_ignore": "false",
        "is_row_identifier": "false",
        "is_target": "false",
        "name": "ATS5p",
        "number_of_missing_values": "0"
      },
      {
        "data_type": "numeric",
        "index": "10",
        "is_ignore": "false",
        "is_row_identifier": "false",
        "is_target": "false",
        "name": "ATSC1i",
        "number_of_missing_values": "0"
      },
      {
        "data_type": "numeric",
        "index": "11",
        "is_ignore": "false",
        "is_row_identifier": "false",
        "is_target": "false",
        "name": "X3v",
        "number_of_missing_values": "0"
      },
      {
        "data_type": "numeric",
        "index": "12",
        "is_ignore": "false",
        "is_row_identifier": "false",
        "is_target": "false",
        "name": "SpMin8_Bh.i.",
        "number_of_missing_values": "0"
      },
      {
        "data_type": "numeric",
        "index": "13",
        "is_ignore": "false",
        "is_row_identifier": "false",
        "is_target": "false",
        "name": "ATSC3i",
        "number_of_missing_values": "0"
      },
      {
        "data_type": "numeric",
        "index": "14",
        "is_ignore": "false",
        "is_row_identifier": "false",
        "is_target": "false",
        "name": "CATS2D_03_DD",
        "number_of_missing_values": "0"
      },
      {
        "data_type": "numeric",
        "index": "15",
        "is_ignore": "false",
        "is_row_identifier": "false",
        "is_target": "false",
        "name": "SpMin8_Bh.e.",
        "number_of_missing_values": "0"
      },
      {
        "data_type": "numeric",
        "index": "16",
        "is_ignore": "false",
        "is_row_identifier": "false",
        "is_target": "false",
        "name": "ATSC2i",
        "number_of_missing_values": "0"
      },
      {
        "data_type": "numeric",
        "index": "17",
        "is_ignore": "false",
        "is_row_identifier": "false",
        "is_target": "false",
        "name": "ATS6p",
        "number_of_missing_values": "0"
      },
      {
        "data_type": "numeric",
        "index": "18",
        "is_ignore": "false",
        "is_row_identifier": "false",
        "is_target": "false",
        "name": "ATS6v",
        "number_of_missing_values": "0"
      },
      {
        "data_type": "numeric",
        "index": "19",
        "is_ignore": "false",
        "is_row_identifier": "false",
        "is_target": "false",
        "name": "VvdwMG",
        "number_of_missing_values": "0"
      },
      {
        "data_type": "numeric",
        "index": "20",
        "is_ignore": "false",
        "is_row_identifier": "false",
        "is_target": "false",
        "name": "Vx",
        "number_of_missing_values": "0"
      },
      {
        "data_type": "numeric",
        "index": "21",
        "is_ignore": "false",
        "is_row_identifier": "false",
        "is_target": "false",
        "name": "ATS5v",
        "number_of_missing_values": "0"
      },
      {
        "data_type": "numeric",
        "index": "22",
        "is_ignore": "false",
        "is_row_identifier": "false",
        "is_target": "false",
        "name": "SpMin7_Bh.e.",
        "number_of_missing_values": "0"
      },
      {
        "data_type": "numeric",
        "index": "23",
        "is_ignore": "false",
        "is_row_identifier": "false",
        "is_target": "false",
        "name": "ATS4m",
        "number_of_missing_values": "0"
      },
      {
        "data_type": "numeric",
        "index": "24",
        "is_ignore": "false",
        "is_row_identifier": "false",
        "is_target": "false",
        "name": "ATSC5m",
        "number_of_missing_values": "0"
      },
      {
        "data_type": "numeric",
        "index": "25",
        "is_ignore": "false",
        "is_row_identifier": "false",
        "is_target": "false",
        "name": "ATS3p",
        "number_of_missing_values": "0"
      },
      {
        "data_type": "numeric",
        "index": "26",
        "is_ignore": "false",
        "is_row_identifier": "false",
        "is_target": "false",
        "name": "IC3",
        "number_of_missing_values": "0"
      },
      {
        "data_type": "numeric",
        "index": "27",
        "is_ignore": "false",
        "is_row_identifier": "false",
        "is_target": "false",
        "name": "ATS5m",
        "number_of_missing_values": "0"
      },
      {
        "data_type": "numeric",
        "index": "28",
        "is_ignore": "false",
        "is_row_identifier": "false",
        "is_target": "false",
        "name": "ATS3v",
        "number_of_missing_values": "0"
      },
      {
        "data_type": "numeric",
        "index": "29",
        "is_ignore": "false",
        "is_row_identifier": "false",
        "is_target": "false",
        "name": "TIE",
        "number_of_missing_values": "0"
      },
      {
        "data_type": "numeric",
        "index": "30",
        "is_ignore": "false",
        "is_row_identifier": "false",
        "is_target": "false",
        "name": "ATSC6m",
        "number_of_missing_values": "0"
      },
      {
        "data_type": "numeric",
        "index": "31",
        "is_ignore": "false",
        "is_row_identifier": "false",
        "is_target": "false",
        "name": "X4v",
        "number_of_missing_values": "0"
      },
      {
        "data_type": "numeric",
        "index": "32",
        "is_ignore": "false",
        "is_row_identifier": "false",
        "is_target": "false",
        "name": "ATSC7p",
        "number_of_missing_values": "0"
      },
      {
        "data_type": "numeric",
        "index": "33",
        "is_ignore": "false",
        "is_row_identifier": "false",
        "is_target": "false",
        "name": "Psi_i_1",
        "number_of_missing_values": "0"
      },
      {
        "data_type": "numeric",
        "index": "34",
        "is_ignore": "false",
        "is_row_identifier": "false",
        "is_target": "false",
        "name": "nRCOOH",
        "number_of_missing_values": "0"
      },
      {
        "data_type": "numeric",
        "index": "35",
        "is_ignore": "false",
        "is_row_identifier": "false",
        "is_target": "false",
        "name": "SpMin7_Bh.p.",
        "number_of_missing_values": "0"
      },
      {
        "data_type": "numeric",
        "index": "36",
        "is_ignore": "false",
        "is_row_identifier": "false",
        "is_target": "false",
        "name": "ATS2v",
        "number_of_missing_values": "0"
      },
      {
        "data_type": "numeric",
        "index": "37",
        "is_ignore": "false",
        "is_row_identifier": "false",
        "is_target": "false",
        "name": "nCconj",
        "number_of_missing_values": "0"
      },
      {
        "data_type": "numeric",
        "index": "38",
        "is_ignore": "false",
        "is_row_identifier": "false",
        "is_target": "false",
        "name": "ATS2p",
        "number_of_missing_values": "0"
      },
      {
        "data_type": "numeric",
        "index": "39",
        "is_ignore": "false",
        "is_row_identifier": "false",
        "is_target": "false",
        "name": "ATSC3s",
        "number_of_missing_values": "0"
      },
      {
        "data_type": "numeric",
        "index": "40",
        "is_ignore": "false",
        "is_row_identifier": "false",
        "is_target": "false",
        "name": "SpAD_AEA.ri.",
        "number_of_missing_values": "0"
      },
      {
        "data_type": "numeric",
        "index": "41",
        "is_ignore": "false",
        "is_row_identifier": "false",
        "is_target": "false",
        "name": "ATS8v",
        "number_of_missing_values": "0"
      },
      {
        "data_type": "numeric",
        "index": "42",
        "is_ignore": "false",
        "is_row_identifier": "false",
        "is_target": "false",
        "name": "MATS3s",
        "number_of_missing_values": "0"
      },
      {
        "data_type": "numeric",
        "index": "43",
        "is_ignore": "false",
        "is_row_identifier": "false",
        "is_target": "false",
        "name": "ATS6i",
        "number_of_missing_values": "0"
      },
      {
        "data_type": "numeric",
        "index": "44",
        "is_ignore": "false",
        "is_row_identifier": "false",
        "is_target": "false",
        "name": "ATS6e",
        "number_of_missing_values": "0"
      },
      {
        "data_type": "numeric",
        "index": "45",
        "is_ignore": "false",
        "is_row_identifier": "false",
        "is_target": "false",
        "name": "Eig03_EA.dm.",
        "number_of_missing_values": "0"
      },
      {
        "data_type": "numeric",
        "index": "46",
        "is_ignore": "false",
        "is_row_identifier": "false",
        "is_target": "false",
        "name": "CIC1",
        "number_of_missing_values": "0"
      },
      {
        "data_type": "numeric",
        "index": "47",
        "is_ignore": "false",
        "is_row_identifier": "false",
        "is_target": "false",
        "name": "ATSC6p",
        "number_of_missing_values": "0"
      },
      {
        "data_type": "numeric",
        "index": "48",
        "is_ignore": "false",
        "is_row_identifier": "false",
        "is_target": "false",
        "name": "D.Dtr07",
        "number_of_missing_values": "0"
      },
      {
        "data_type": "numeric",
        "index": "49",
        "is_ignore": "false",
        "is_row_identifier": "false",
        "is_target": "false",
        "name": "nR07",
        "number_of_missing_values": "0"
      },
      {
        "data_type": "numeric",
        "index": "50",
        "is_ignore": "false",
        "is_row_identifier": "false",
        "is_target": "false",
        "name": "SpAD_EA",
        "number_of_missing_values": "0"
      },
      {
        "data_type": "numeric",
        "index": "51",
        "is_ignore": "false",
        "is_row_identifier": "false",
        "is_target": "false",
        "name": "ATSC5p",
        "number_of_missing_values": "0"
      },
      {
        "data_type": "numeric",
        "index": "52",
        "is_ignore": "false",
        "is_row_identifier": "false",
        "is_target": "false",
        "name": "SpAD_AEA.bo.",
        "number_of_missing_values": "0"
      },
      {
        "data_type": "numeric",
        "index": "53",
        "is_ignore": "false",
        "is_row_identifier": "false",
        "is_target": "false",
        "name": "SpAD_AEA.dm.",
        "number_of_missing_values": "0"
      },
      {
        "data_type": "numeric",
        "index": "54",
        "is_ignore": "false",
        "is_row_identifier": "false",
        "is_target": "false",
        "name": "Eta_alpha",
        "number_of_missing_values": "0"
      },
      {
        "data_type": "numeric",
        "index": "55",
        "is_ignore": "false",
        "is_row_identifier": "false",
        "is_target": "false",
        "name": "ATS3m",
        "number_of_missing_values": "0"
      },
      {
        "data_type": "numeric",
        "index": "56",
        "is_ignore": "false",
        "is_row_identifier": "false",
        "is_target": "false",
        "name": "SaaaC",
        "number_of_missing_values": "0"
      },
      {
        "data_type": "numeric",
        "index": "57",
        "is_ignore": "false",
        "is_row_identifier": "false",
        "is_target": "false",
        "name": "ATS6m",
        "number_of_missing_values": "0"
      },
      {
        "data_type": "numeric",
        "index": "58",
        "is_ignore": "false",
        "is_row_identifier": "false",
        "is_target": "false",
        "name": "CATS2D_05_DA",
        "number_of_missing_values": "0"
      },
      {
        "data_type": "numeric",
        "index": "59",
        "is_ignore": "false",
        "is_row_identifier": "false",
        "is_target": "false",
        "name": "IC4",
        "number_of_missing_values": "0"
      },
      {
        "data_type": "numeric",
        "index": "60",
        "is_ignore": "false",
        "is_row_identifier": "false",
        "is_target": "false",
        "name": "Chi1_AEA.bo.",
        "number_of_missing_values": "0"
      },
      {
        "data_type": "numeric",
        "index": "61",
        "is_ignore": "false",
        "is_row_identifier": "false",
        "is_target": "false",
        "name": "Chi1_AEA.dm.",
        "number_of_missing_values": "0"
      },
      {
        "data_type": "numeric",
        "index": "62",
        "is_ignore": "false",
        "is_row_identifier": "false",
        "is_target": "false",
        "name": "Chi1_AEA.ed.",
        "number_of_missing_values": "0"
      },
      {
        "data_type": "numeric",
        "index": "63",
        "is_ignore": "false",
        "is_row_identifier": "false",
        "is_target": "false",
        "name": "Chi1_AEA.ri.",
        "number_of_missing_values": "0"
      },
      {
        "data_type": "numeric",
        "index": "64",
        "is_ignore": "false",
        "is_row_identifier": "false",
        "is_target": "false",
        "name": "Chi1_EA",
        "number_of_missing_values": "0"
      },
      {
        "data_type": "numeric",
        "index": "65",
        "is_ignore": "false",
        "is_row_identifier": "false",
        "is_target": "false",
        "name": "P_VSA_LogP_2",
        "number_of_missing_values": "0"
      },
      {
        "data_type": "numeric",
        "index": "66",
        "is_ignore": "false",
        "is_row_identifier": "false",
        "is_target": "true",
        "name": "pXC50",
        "number_of_missing_values": "0"
      }
    ]
  }
}