{
  "data_features": {
    "feature": [
      {
        "data_type": "nominal",
        "index": "0",
        "is_ignore": "false",
        "is_row_identifier": "true",
        "is_target": "false",
        "name": "molecule_id",
        "nominal_value": [
          "CHEMBL128358",
          "CHEMBL134607",
          "CHEMBL138900",
          "CHEMBL139848",
          "CHEMBL140287",
          "CHEMBL190883",
          "CHEMBL1929275",
          "CHEMBL1929277",
          "CHEMBL1929278",
          "CHEMBL1929279",
          "CHEMBL1929280",
          "CHEMBL1929281",
          "CHEMBL1929282",
          "CHEMBL1929287",
          "CHEMBL1929288",
          "CHEMBL1929289",
          "CHEMBL1929428",
          "CHEMBL1929429",
          "CHEMBL1929430",
          "CHEMBL282433",
          "CHEMBL305187",
          "CHEMBL456435",
          "CHEMBL456437",
          "CHEMBL457508",
          "CHEMBL457720",
          "CHEMBL457721",
          "CHEMBL457722",
          "CHEMBL457731",
          "CHEMBL458361",
          "CHEMBL458553",
          "CHEMBL458802",
          "CHEMBL485728",
          "CHEMBL485729",
          "CHEMBL485929",
          "CHEMBL486136",
          "CHEMBL487359",
          "CHEMBL487360",
          "CHEMBL50079",
          "CHEMBL511507",
          "CHEMBL511680",
          "CHEMBL511857",
          "CHEMBL513936",
          "CHEMBL521350",
          "CHEMBL53325",
          "CHEMBL534695",
          "CHEMBL535363",
          "CHEMBL535366",
          "CHEMBL535410",
          "CHEMBL535634",
          "CHEMBL535636",
          "CHEMBL535856",
          "CHEMBL535857",
          "CHEMBL536305",
          "CHEMBL536483",
          "CHEMBL536759",
          "CHEMBL537177",
          "CHEMBL537399",
          "CHEMBL537696",
          "CHEMBL537842",
          "CHEMBL538089",
          "CHEMBL538091",
          "CHEMBL538566",
          "CHEMBL538772",
          "CHEMBL539333",
          "CHEMBL539545",
          "CHEMBL539776",
          "CHEMBL540289",
          "CHEMBL540361",
          "CHEMBL540563",
          "CHEMBL540573",
          "CHEMBL540818",
          "CHEMBL541390",
          "CHEMBL542392",
          "CHEMBL542701",
          "CHEMBL542873",
          "CHEMBL543105",
          "CHEMBL543581",
          "CHEMBL543821",
          "CHEMBL544343",
          "CHEMBL544524",
          "CHEMBL545278",
          "CHEMBL545451",
          "CHEMBL545508",
          "CHEMBL545691",
          "CHEMBL552542",
          "CHEMBL553091",
          "CHEMBL554450",
          "CHEMBL554663",
          "CHEMBL555090",
          "CHEMBL555790",
          "CHEMBL555969",
          "CHEMBL558572",
          "CHEMBL558980",
          "CHEMBL559178",
          "CHEMBL559377",
          "CHEMBL573234",
          "CHEMBL573248",
          "CHEMBL573461",
          "CHEMBL573695",
          "CHEMBL573703",
          "CHEMBL573704",
          "CHEMBL573932",
          "CHEMBL574165",
          "CHEMBL574182",
          "CHEMBL574598",
          "CHEMBL574821",
          "CHEMBL575238",
          "CHEMBL575239",
          "CHEMBL575253",
          "CHEMBL575262",
          "CHEMBL582875",
          "CHEMBL583580",
          "CHEMBL584767",
          "CHEMBL60542",
          "CHEMBL75228"
        ],
        "number_of_missing_values": "0"
      },
      {
        "data_type": "numeric",
        "index": "1",
        "is_ignore": "false",
        "is_row_identifier": "false",
        "is_target": "false",
        "name": "FCFP4_1024b1",
        "number_of_missing_values": "0"
      },
      {
        "data_type": "numeric",
        "index": "2",
        "is_ignore": "false",
        "is_row_identifier": "false",
        "is_target": "false",
        "name": "FCFP4_1024b10",
        "number_of_missing_values": "0"
      },
      {
        "data_type": "numeric",
        "index": "3",
        "is_ignore": "false",
        "is_row_identifier": "false",
        "is_target": "false",
        "name": "FCFP4_1024b100",
        "number_of_missing_values": "0"
      },
      {
        "data_type": "numeric",
        "index": "4",
        "is_ignore": "false",
        "is_row_identifier": "false",
        "is_target": "false",
        "name": "FCFP4_1024b1000",
        "number_of_missing_values": "0"
      },
      {
        "data_type": "numeric",
        "index": "5",
        "is_ignore": "false",
        "is_row_identifier": "false",
        "is_target": "false",
        "name": "FCFP4_1024b1001",
        "number_of_missing_values": "0"
      },
      {
        "data_type": "numeric",
        "index": "6",
        "is_ignore": "false",
        "is_row_identifier": "false",
        "is_target": "false",
        "name": "FCFP4_1024b1002",
        "number_of_missing_values": "0"
      },
      {
        "data_type": "numeric",
        "index": "7",
        "is_ignore": "false",
        "is_row_identifier": "false",
        "is_target": "false",
        "name": "FCFP4_1024b1003",
        "number_of_missing_values": "0"
      },
      {
        "data_type": "numeric",
        "index": "8",
        "is_ignore": "false",
        "is_row_identifier": "false",
        "is_target": "false",
        "name": "FCFP4_1024b1004",
        "number_of_missing_values": "0"
      },
      {
        "data_type": "numeric",
        "index": "9",
        "is_ignore": "false",
        "is_row_identifier": "false",
        "is_target": "false",
        "name": "FCFP4_1024b1005",
        "number_of_missing_values": "0"
      },
      {
        "data_type": "numeric",
        "index": "10",
        "is_ignore": "false",
        "is_row_identifier": "false",
        "is_target": "false",
        "name": "FCFP4_1024b1006",
        "number_of_missing_values": "0"
      },
      {
        "data_type": "numeric",
        "index": "11",
        "is_ignore": "false",
        "is_row_identifier": "false",
        "is_target": "false",
        "name": "FCFP4_1024b1007",
        "number_of_missing_values": "0"
      },
      {
        "data_type": "numeric",
        "index": "12",
        "is_ignore": "false",
        "is_row_identifier": "false",
        "is_target": "false",
        "name": "FCFP4_1024b1008",
        "number_of_missing_values": "0"
      },
      {
        "data_type": "numeric",
        "index": "13",
        "is_ignore": "false",
        "is_row_identifier": "false",
        "is_target": "false",
        "name": "FCFP4_1024b1009",
        "number_of_missing_values": "0"
      },
      {
        "data_type": "numeric",
        "index": "14",
        "is_ignore": "false",
        "is_row_identifier": "false",
        "is_target": "false",
        "name": "FCFP4_1024b101",
        "number_of_missing_values": "0"
      },
      {
        "data_type": "numeric",
        "index": "15",
        "is_ignore": "false",
        "is_row_identifier": "false",
        "is_target": "false",
        "name": "FCFP4_1024b1010",
        "number_of_missing_values": "0"
      },
      {
        "data_type": "numeric",
        "index": "16",
        "is_ignore": "false",
        "is_row_identifier": "false",
        "is_target": "false",
        "name": "FCFP4_1024b1011",
        "number_of_missing_values": "0"
      },
      {
        "data_type": "numeric",
        "index": "17",
        "is_ignore": "false",
        "is_row_identifier": "false",
        "is_target": "false",
        "name": "FCFP4_1024b1012",
        "number_of_missing_values": "0"
      },
      {
        "data_type": "numeric",
        "index": "18",
        "is_ignore": "false",
        "is_row_identifier": "false",
        "is_target": "false",
        "name": "FCFP4_1024b1013",
        "number_of_missing_values": "0"
      },
      {
        "data_type": "numeric",
        "index": "19",
        "is_ignore": "false",
        "is_row_identifier": "false",
        "is_target": "false",
        "name": "FCFP4_1024b1014",
        "number_of_missing_values": "0"
      },
      {
        "data_type": "numeric",
        "index": "20",
        "is_ignore": "false",
        "is_row_identifier": "false",
        "is_target": "false",
        "name": "FCFP4_1024b1015",
        "number_of_missing_values": "0"
      },
      {
        "data_type": "numeric",
        "index": "21",
        "is_ignore": "false",
        "is_row_identifier": "false",
        "is_target": "false",
        "name": "FCFP4_1024b1016",
        "number_of_missing_values": "0"
      },
      {
        "data_type": "numeric",
        "index": "22",
        "is_ignore": "false",
        "is_row_identifier": "false",
        "is_target": "false",
        "name": "FCFP4_1024b1017",
        "number_of_missing_values": "0"
      },
      {
        "data_type": "numeric",
        "index": "23",
        "is_ignore": "false",
        "is_row_identifier": "false",
        "is_target": "false",
        "name": "FCFP4_1024b1018",
        "number_of_missing_values": "0"
      },
      {
        "data_type": "numeric",
        "index": "24",
        "is_ignore": "false",
        "is_row_identifier": "false",
        "is_target": "false",
        "name": "FCFP4_1024b1019",
        "number_of_missing_values": "0"
      },
      {
        "data_type": "numeric",
        "index": "25",
        "is_ignore": "false",
        "is_row_identifier": "false",
        "is_target": "false",
        "name": "FCFP4_1024b102",
        "number_of_missing_values": "0"
      },
      {
        "data_type": "numeric",
        "index": "26",
        "is_ignore": "false",
        "is_row_identifier": "false",
        "is_target": "false",
        "name": "FCFP4_1024b1020",
        "number_of_missing_values": "0"
      },
      {
        "data_type": "numeric",
        "index": "27",
        "is_ignore": "false",
        "is_row_identifier": "false",
        "is_target": "false",
        "name": "FCFP4_1024b1021",
        "number_of_missing_values": "0"
      },
      {
        "data_type": "numeric",
        "index": "28",
        "is_ignore": "false",
        "is_row_identifier": "false",
        "is_target": "false",
        "name": "FCFP4_1024b1022",
        "number_of_missing_values": "0"
      },
      {
        "data_type": "numeric",
        "index": "29",
        "is_ignore": "false",
        "is_row_identifier": "false",
        "is_target": "false",
        "name": "FCFP4_1024b1023",
        "number_of_missing_values": "0"
      },
      {
        "data_type": "numeric",
        "index": "30",
        "is_ignore": "false",
        "is_row_identifier": "false",
        "is_target": "false",
        "name": "FCFP4_1024b1024",
        "number_of_missing_values": "0"
      },
      {
        "data_type": "numeric",
        "index": "31",
        "is_ignore": "false",
        "is_row_identifier": "false",
        "is_target": "false",
        "name": "FCFP4_1024b103",
        "number_of_missing_values": "0"
      },
      {
        "data_type": "numeric",
        "index": "32",
        "is_ignore": "false",
        "is_row_identifier": "false",
        "is_target": "false",
        "name": "FCFP4_1024b104",
        "number_of_missing_values": "0"
      },
      {
        "data_type": "numeric",
        "index": "33",
        "is_ignore": "false",
        "is_row_identifier": "false",
        "is_target": "false",
        "name": "FCFP4_1024b105",
        "number_of_missing_values": "0"
      },
      {
        "data_type": "numeric",
        "index": "34",
        "is_ignore": "false",
        "is_row_identifier": "false",
        "is_target": "false",
        "name": "FCFP4_1024b106",
        "number_of_missing_values": "0"
      },
      {
        "data_type": "numeric",
        "index": "35",
        "is_ignore": "false",
        "is_row_identifier": "false",
        "is_target": "false",
        "name": "FCFP4_1024b107",
        "number_of_missing_values": "0"
      },
      {
        "data_type": "numeric",
        "index": "36",
        "is_ignore": "false",
        "is_row_identifier": "false",
        "is_target": "false",
        "name": "FCFP4_1024b108",
        "number_of_missing_values": "0"
      },
      {
        "data_type": "numeric",
        "index": "37",
        "is_ignore": "false",
        "is_row_identifier": "false",
        "is_target": "false",
        "name": "FCFP4_1024b109",
        "number_of_missing_values": "0"
      },
      {
        "data_type": "numeric",
        "index": "38",
        "is_ignore": "false",
        "is_row_identifier": "false",
        "is_target": "false",
        "name": "FCFP4_1024b11",
        "number_of_missing_values": "0"
      },
      {
        "data_type": "numeric",
        "index": "39",
        "is_ignore": "false",
        "is_row_identifier": "false",
        "is_target": "false",
        "name": "FCFP4_1024b110",
        "number_of_missing_values": "0"
      },
      {
        "data_type": "numeric",
        "index": "40",
        "is_ignore": "false",
        "is_row_identifier": "false",
        "is_target": "false",
        "name": "FCFP4_1024b111",
        "number_of_missing_values": "0"
      },
      {
        "data_type": "numeric",
        "index": "41",
        "is_ignore": "false",
        "is_row_identifier": "false",
        "is_target": "false",
        "name": "FCFP4_1024b112",
        "number_of_missing_values": "0"
      },
      {
        "data_type": "numeric",
        "index": "42",
        "is_ignore": "false",
        "is_row_identifier": "false",
        "is_target": "false",
        "name": "FCFP4_1024b113",
        "number_of_missing_values": "0"
      },
      {
        "data_type": "numeric",
        "index": "43",
        "is_ignore": "false",
        "is_row_identifier": "false",
        "is_target": "false",
        "name": "FCFP4_1024b114",
        "number_of_missing_values": "0"
      },
      {
        "data_type": "numeric",
        "index": "44",
        "is_ignore": "false",
        "is_row_identifier": "false",
        "is_target": "false",
        "name": "FCFP4_1024b115",
        "number_of_missing_values": "0"
      },
      {
        "data_type": "numeric",
        "index": "45",
        "is_ignore": "false",
        "is_row_identifier": "false",
        "is_target": "false",
        "name": "FCFP4_1024b116",
        "number_of_missing_values": "0"
      },
      {
        "data_type": "numeric",
        "index": "46",
        "is_ignore": "false",
        "is_row_identifier": "false",
        "is_target": "false",
        "name": "FCFP4_1024b117",
        "number_of_missing_values": "0"
      },
      {
        "data_type": "numeric",
        "index": "47",
        "is_ignore": "false",
        "is_row_identifier": "false",
        "is_target": "false",
        "name": "FCFP4_1024b118",
        "number_of_missing_values": "0"
      },
      {
        "data_type": "numeric",
        "index": "48",
        "is_ignore": "false",
        "is_row_identifier": "false",
        "is_target": "false",
        "name": "FCFP4_1024b119",
        "number_of_missing_values": "0"
      },
      {
        "data_type": "numeric",
        "index": "49",
        "is_ignore": "false",
        "is_row_identifier": "false",
        "is_target": "false",
        "name": "FCFP4_1024b12",
        "number_of_missing_values": "0"
      },
      {
        "data_type": "numeric",
        "index": "50",
        "is_ignore": "false",
        "is_row_identifier": "false",
        "is_target": "false",
        "name": "FCFP4_1024b120",
        "number_of_missing_values": "0"
      },
      {
        "data_type": "numeric",
        "index": "51",
        "is_ignore": "false",
        "is_row_identifier": "false",
        "is_target": "false",
        "name": "FCFP4_1024b121",
        "number_of_missing_values": "0"
      },
      {
        "data_type": "numeric",
        "index": "52",
        "is_ignore": "false",
        "is_row_identifier": "false",
        "is_target": "false",
        "name": "FCFP4_1024b122",
        "number_of_missing_values": "0"
      },
      {
        "data_type": "numeric",
        "index": "53",
        "is_ignore": "false",
        "is_row_identifier": "false",
        "is_target": "false",
        "name": "FCFP4_1024b123",
        "number_of_missing_values": "0"
      },
      {
        "data_type": "numeric",
        "index": "54",
        "is_ignore": "false",
        "is_row_identifier": "false",
        "is_target": "false",
        "name": "FCFP4_1024b124",
        "number_of_missing_values": "0"
      },
      {
        "data_type": "numeric",
        "index": "55",
        "is_ignore": "false",
        "is_row_identifier": "false",
        "is_target": "false",
        "name": "FCFP4_1024b125",
        "number_of_missing_values": "0"
      },
      {
        "data_type": "numeric",
        "index": "56",
        "is_ignore": "false",
        "is_row_identifier": "false",
        "is_target": "false",
        "name": "FCFP4_1024b126",
        "number_of_missing_values": "0"
      },
      {
        "data_type": "numeric",
        "index": "57",
        "is_ignore": "false",
        "is_row_identifier": "false",
        "is_target": "false",
        "name": "FCFP4_1024b127",
        "number_of_missing_values": "0"
      },
      {
        "data_type": "numeric",
        "index": "58",
        "is_ignore": "false",
        "is_row_identifier": "false",
        "is_target": "false",
        "name": "FCFP4_1024b128",
        "number_of_missing_values": "0"
      },
      {
        "data_type": "numeric",
        "index": "59",
        "is_ignore": "false",
        "is_row_identifier": "false",
        "is_target": "false",
        "name": "FCFP4_1024b129",
        "number_of_missing_values": "0"
      },
      {
        "data_type": "numeric",
        "index": "60",
        "is_ignore": "false",
        "is_row_identifier": "false",
        "is_target": "false",
        "name": "FCFP4_1024b13",
        "number_of_missing_values": "0"
      },
      {
        "data_type": "numeric",
        "index": "61",
        "is_ignore": "false",
        "is_row_identifier": "false",
        "is_target": "false",
        "name": "FCFP4_1024b130",
        "number_of_missing_values": "0"
      },
      {
        "data_type": "numeric",
        "index": "62",
        "is_ignore": "false",
        "is_row_identifier": "false",
        "is_target": "false",
        "name": "FCFP4_1024b131",
        "number_of_missing_values": "0"
      },
      {
        "data_type": "numeric",
        "index": "63",
        "is_ignore": "false",
        "is_row_identifier": "false",
        "is_target": "false",
        "name": "FCFP4_1024b132",
        "number_of_missing_values": "0"
      },
      {
        "data_type": "numeric",
        "index": "64",
        "is_ignore": "false",
        "is_row_identifier": "false",
        "is_target": "false",
        "name": "FCFP4_1024b133",
        "number_of_missing_values": "0"
      },
      {
        "data_type": "numeric",
        "index": "65",
        "is_ignore": "false",
        "is_row_identifier": "false",
        "is_target": "false",
        "name": "FCFP4_1024b134",
        "number_of_missing_values": "0"
      },
      {
        "data_type": "numeric",
        "index": "66",
        "is_ignore": "false",
        "is_row_identifier": "false",
        "is_target": "false",
        "name": "FCFP4_1024b135",
        "number_of_missing_values": "0"
      },
      {
        "data_type": "numeric",
        "index": "67",
        "is_ignore": "false",
        "is_row_identifier": "false",
        "is_target": "false",
        "name": "FCFP4_1024b136",
        "number_of_missing_values": "0"
      },
      {
        "data_type": "numeric",
        "index": "68",
        "is_ignore": "false",
        "is_row_identifier": "false",
        "is_target": "false",
        "name": "FCFP4_1024b137",
        "number_of_missing_values": "0"
      },
      {
        "data_type": "numeric",
        "index": "69",
        "is_ignore": "false",
        "is_row_identifier": "false",
        "is_target": "false",
        "name": "FCFP4_1024b138",
        "number_of_missing_values": "0"
      },
      {
        "data_type": "numeric",
        "index": "70",
        "is_ignore": "false",
        "is_row_identifier": "false",
        "is_target": "false",
        "name": "FCFP4_1024b139",
        "number_of_missing_values": "0"
      },
      {
        "data_type": "numeric",
        "index": "71",
        "is_ignore": "false",
        "is_row_identifier": "false",
        "is_target": "false",
        "name": "FCFP4_1024b14",
        "number_of_missing_values": "0"
      },
      {
        "data_type": "numeric",
        "index": "72",
        "is_ignore": "false",
        "is_row_identifier": "false",
        "is_target": "false",
        "name": "FCFP4_1024b140",
        "number_of_missing_values": "0"
      },
      {
        "data_type": "numeric",
        "index": "73",
        "is_ignore": "false",
        "is_row_identifier": "false",
        "is_target": "false",
        "name": "FCFP4_1024b141",
        "number_of_missing_values": "0"
      },
      {
        "data_type": "numeric",
        "index": "74",
        "is_ignore": "false",
        "is_row_identifier": "false",
        "is_target": "false",
        "name": "FCFP4_1024b142",
        "number_of_missing_values": "0"
      },
      {
        "data_type": "numeric",
        "index": "75",
        "is_ignore": "false",
        "is_row_identifier": "false",
        "is_target": "false",
        "name": "FCFP4_1024b143",
        "number_of_missing_values": "0"
      },
      {
        "data_type": "numeric",
        "index": "76",
        "is_ignore": "false",
        "is_row_identifier": "false",
        "is_target": "false",
        "name": "FCFP4_1024b144",
        "number_of_missing_values": "0"
      },
      {
        "data_type": "numeric",
        "index": "77",
        "is_ignore": "false",
        "is_row_identifier": "false",
        "is_target": "false",
        "name": "FCFP4_1024b145",
        "number_of_missing_values": "0"
      },
      {
        "data_type": "numeric",
        "index": "78",
        "is_ignore": "false",
        "is_row_identifier": "false",
        "is_target": "false",
        "name": "FCFP4_1024b146",
        "number_of_missing_values": "0"
      },
      {
        "data_type": "numeric",
        "index": "79",
        "is_ignore": "false",
        "is_row_identifier": "false",
        "is_target": "false",
        "name": "FCFP4_1024b147",
        "number_of_missing_values": "0"
      },
      {
        "data_type": "numeric",
        "index": "80",
        "is_ignore": "false",
        "is_row_identifier": "false",
        "is_target": "false",
        "name": "FCFP4_1024b148",
        "number_of_missing_values": "0"
      },
      {
        "data_type": "numeric",
        "index": "81",
        "is_ignore": "false",
        "is_row_identifier": "false",
        "is_target": "false",
        "name": "FCFP4_1024b149",
        "number_of_missing_values": "0"
      },
      {
        "data_type": "numeric",
        "index": "82",
        "is_ignore": "false",
        "is_row_identifier": "false",
        "is_target": "false",
        "name": "FCFP4_1024b15",
        "number_of_missing_values": "0"
      },
      {
        "data_type": "numeric",
        "index": "83",
        "is_ignore": "false",
        "is_row_identifier": "false",
        "is_target": "false",
        "name": "FCFP4_1024b150",
        "number_of_missing_values": "0"
      },
      {
        "data_type": "numeric",
        "index": "84",
        "is_ignore": "false",
        "is_row_identifier": "false",
        "is_target": "false",
        "name": "FCFP4_1024b151",
        "number_of_missing_values": "0"
      },
      {
        "data_type": "numeric",
        "index": "85",
        "is_ignore": "false",
        "is_row_identifier": "false",
        "is_target": "false",
        "name": "FCFP4_1024b152",
        "number_of_missing_values": "0"
      },
      {
        "data_type": "numeric",
        "index": "86",
        "is_ignore": "false",
        "is_row_identifier": "false",
        "is_target": "false",
        "name": "FCFP4_1024b153",
        "number_of_missing_values": "0"
      },
      {
        "data_type": "numeric",
        "index": "87",
        "is_ignore": "false",
        "is_row_identifier": "false",
        "is_target": "false",
        "name": "FCFP4_1024b154",
        "number_of_missing_values": "0"
      },
      {
        "data_type": "numeric",
        "index": "88",
        "is_ignore": "false",
        "is_row_identifier": "false",
        "is_target": "false",
        "name": "FCFP4_1024b155",
        "number_of_missing_values": "0"
      },
      {
        "data_type": "numeric",
        "index": "89",
        "is_ignore": "false",
        "is_row_identifier": "false",
        "is_target": "false",
        "name": "FCFP4_1024b156",
        "number_of_missing_values": "0"
      },
      {
        "data_type": "numeric",
        "index": "90",
        "is_ignore": "false",
        "is_row_identifier": "false",
        "is_target": "false",
        "name": "FCFP4_1024b157",
        "number_of_missing_values": "0"
      },
      {
        "data_type": "numeric",
        "index": "91",
        "is_ignore": "false",
        "is_row_identifier": "false",
        "is_target": "false",
        "name": "FCFP4_1024b158",
        "number_of_missing_values": "0"
      },
      {
        "data_type": "numeric",
        "index": "92",
        "is_ignore": "false",
        "is_row_identifier": "false",
        "is_target": "false",
        "name": "FCFP4_1024b159",
        "number_of_missing_values": "0"
      },
      {
        "data_type": "numeric",
        "index": "93",
        "is_ignore": "false",
        "is_row_identifier": "false",
        "is_target": "false",
        "name": "FCFP4_1024b16",
        "number_of_missing_values": "0"
      },
      {
        "data_type": "numeric",
        "index": "94",
        "is_ignore": "false",
        "is_row_identifier": "false",
        "is_target": "false",
        "name": "FCFP4_1024b160",
        "number_of_missing_values": "0"
      },
      {
        "data_type": "numeric",
        "index": "95",
        "is_ignore": "false",
        "is_row_identifier": "false",
        "is_target": "false",
        "name": "FCFP4_1024b161",
        "number_of_missing_values": "0"
      },
      {
        "data_type": "numeric",
        "index": "96",
        "is_ignore": "false",
        "is_row_identifier": "false",
        "is_target": "false",
        "name": "FCFP4_1024b162",
        "number_of_missing_values": "0"
      },
      {
        "data_type": "numeric",
        "index": "97",
        "is_ignore": "false",
        "is_row_identifier": "false",
        "is_target": "false",
        "name": "FCFP4_1024b163",
        "number_of_missing_values": "0"
      },
      {
        "data_type": "numeric",
        "index": "98",
        "is_ignore": "false",
        "is_row_identifier": "false",
        "is_target": "false",
        "name": "FCFP4_1024b164",
        "number_of_missing_values": "0"
      },
      {
        "data_type": "numeric",
        "index": "99",
        "is_ignore": "false",
        "is_row_identifier": "false",
        "is_target": "false",
        "name": "FCFP4_1024b165",
        "number_of_missing_values": "0"
      },
      {
        "data_type": "numeric",
        "index": "100",
        "is_ignore": "false",
        "is_row_identifier": "false",
        "is_target": "false",
        "name": "FCFP4_1024b166",
        "number_of_missing_values": "0"
      },
      {
        "data_type": "numeric",
        "index": "101",
        "is_ignore": "false",
        "is_row_identifier": "false",
        "is_target": "false",
        "name": "FCFP4_1024b167",
        "number_of_missing_values": "0"
      },
      {
        "data_type": "numeric",
        "index": "102",
        "is_ignore": "false",
        "is_row_identifier": "false",
        "is_target": "false",
        "name": "FCFP4_1024b168",
        "number_of_missing_values": "0"
      },
      {
        "data_type": "numeric",
        "index": "103",
        "is_ignore": "false",
        "is_row_identifier": "false",
        "is_target": "false",
        "name": "FCFP4_1024b169",
        "number_of_missing_values": "0"
      },
      {
        "data_type": "numeric",
        "index": "104",
        "is_ignore": "false",
        "is_row_identifier": "false",
        "is_target": "false",
        "name": "FCFP4_1024b17",
        "number_of_missing_values": "0"
      },
      {
        "data_type": "numeric",
        "index": "105",
        "is_ignore": "false",
        "is_row_identifier": "false",
        "is_target": "false",
        "name": "FCFP4_1024b170",
        "number_of_missing_values": "0"
      },
      {
        "data_type": "numeric",
        "index": "106",
        "is_ignore": "false",
        "is_row_identifier": "false",
        "is_target": "false",
        "name": "FCFP4_1024b171",
        "number_of_missing_values": "0"
      },
      {
        "data_type": "numeric",
        "index": "107",
        "is_ignore": "false",
        "is_row_identifier": "false",
        "is_target": "false",
        "name": "FCFP4_1024b172",
        "number_of_missing_values": "0"
      },
      {
        "data_type": "numeric",
        "index": "108",
        "is_ignore": "false",
        "is_row_identifier": "false",
        "is_target": "false",
        "name": "FCFP4_1024b173",
        "number_of_missing_values": "0"
      },
      {
        "data_type": "numeric",
        "index": "109",
        "is_ignore": "false",
        "is_row_identifier": "false",
        "is_target": "false",
        "name": "FCFP4_1024b174",
        "number_of_missing_values": "0"
      },
      {
        "data_type": "numeric",
        "index": "110",
        "is_ignore": "false",
        "is_row_identifier": "false",
        "is_target": "false",
        "name": "FCFP4_1024b175",
        "number_of_missing_values": "0"
      },
      {
        "data_type": "numeric",
        "index": "111",
        "is_ignore": "false",
        "is_row_identifier": "false",
        "is_target": "false",
        "name": "FCFP4_1024b176",
        "number_of_missing_values": "0"
      },
      {
        "data_type": "numeric",
        "index": "112",
        "is_ignore": "false",
        "is_row_identifier": "false",
        "is_target": "false",
        "name": "FCFP4_1024b177",
        "number_of_missing_values": "0"
      },
      {
        "data_type": "numeric",
        "index": "113",
        "is_ignore": "false",
        "is_row_identifier": "false",
        "is_target": "false",
        "name": "FCFP4_1024b178",
        "number_of_missing_values": "0"
      },
      {
        "data_type": "numeric",
        "index": "114",
        "is_ignore": "false",
        "is_row_identifier": "false",
        "is_target": "false",
        "name": "FCFP4_1024b179",
        "number_of_missing_values": "0"
      },
      {
        "data_type": "numeric",
        "index": "115",
        "is_ignore": "false",
        "is_row_identifier": "false",
        "is_target": "false",
        "name": "FCFP4_1024b18",
        "number_of_missing_values": "0"
      },
      {
        "data_type": "numeric",
        "index": "116",
        "is_ignore": "false",
        "is_row_identifier": "false",
        "is_target": "false",
        "name": "FCFP4_1024b180",
        "number_of_missing_values": "0"
      },
      {
        "data_type": "numeric",
        "index": "117",
        "is_ignore": "false",
        "is_row_identifier": "false",
        "is_target": "false",
        "name": "FCFP4_1024b181",
        "number_of_missing_values": "0"
      },
      {
        "data_type": "numeric",
        "index": "118",
        "is_ignore": "false",
        "is_row_identifier": "false",
        "is_target": "false",
        "name": "FCFP4_1024b182",
        "number_of_missing_values": "0"
      },
      {
        "data_type": "numeric",
        "index": "119",
        "is_ignore": "false",
        "is_row_identifier": "false",
        "is_target": "false",
        "name": "FCFP4_1024b183",
        "number_of_missing_values": "0"
      },
      {
        "data_type": "numeric",
        "index": "120",
        "is_ignore": "false",
        "is_row_identifier": "false",
        "is_target": "false",
        "name": "FCFP4_1024b184",
        "number_of_missing_values": "0"
      },
      {
        "data_type": "numeric",
        "index": "121",
        "is_ignore": "false",
        "is_row_identifier": "false",
        "is_target": "false",
        "name": "FCFP4_1024b185",
        "number_of_missing_values": "0"
      },
      {
        "data_type": "numeric",
        "index": "122",
        "is_ignore": "false",
        "is_row_identifier": "false",
        "is_target": "false",
        "name": "FCFP4_1024b186",
        "number_of_missing_values": "0"
      },
      {
        "data_type": "numeric",
        "index": "123",
        "is_ignore": "false",
        "is_row_identifier": "false",
        "is_target": "false",
        "name": "FCFP4_1024b187",
        "number_of_missing_values": "0"
      },
      {
        "data_type": "numeric",
        "index": "124",
        "is_ignore": "false",
        "is_row_identifier": "false",
        "is_target": "false",
        "name": "FCFP4_1024b188",
        "number_of_missing_values": "0"
      },
      {
        "data_type": "numeric",
        "index": "125",
        "is_ignore": "false",
        "is_row_identifier": "false",
        "is_target": "false",
        "name": "FCFP4_1024b189",
        "number_of_missing_values": "0"
      },
      {
        "data_type": "numeric",
        "index": "126",
        "is_ignore": "false",
        "is_row_identifier": "false",
        "is_target": "false",
        "name": "FCFP4_1024b19",
        "number_of_missing_values": "0"
      },
      {
        "data_type": "numeric",
        "index": "127",
        "is_ignore": "false",
        "is_row_identifier": "false",
        "is_target": "false",
        "name": "FCFP4_1024b190",
        "number_of_missing_values": "0"
      },
      {
        "data_type": "numeric",
        "index": "128",
        "is_ignore": "false",
        "is_row_identifier": "false",
        "is_target": "false",
        "name": "FCFP4_1024b191",
        "number_of_missing_values": "0"
      },
      {
        "data_type": "numeric",
        "index": "129",
        "is_ignore": "false",
        "is_row_identifier": "false",
        "is_target": "false",
        "name": "FCFP4_1024b192",
        "number_of_missing_values": "0"
      },
      {
        "data_type": "numeric",
        "index": "130",
        "is_ignore": "false",
        "is_row_identifier": "false",
        "is_target": "false",
        "name": "FCFP4_1024b193",
        "number_of_missing_values": "0"
      },
      {
        "data_type": "numeric",
        "index": "131",
        "is_ignore": "false",
        "is_row_identifier": "false",
        "is_target": "false",
        "name": "FCFP4_1024b194",
        "number_of_missing_values": "0"
      },
      {
        "data_type": "numeric",
        "index": "132",
        "is_ignore": "false",
        "is_row_identifier": "false",
        "is_target": "false",
        "name": "FCFP4_1024b195",
        "number_of_missing_values": "0"
      },
      {
        "data_type": "numeric",
        "index": "133",
        "is_ignore": "false",
        "is_row_identifier": "false",
        "is_target": "false",
        "name": "FCFP4_1024b196",
        "number_of_missing_values": "0"
      },
      {
        "data_type": "numeric",
        "index": "134",
        "is_ignore": "false",
        "is_row_identifier": "false",
        "is_target": "false",
        "name": "FCFP4_1024b197",
        "number_of_missing_values": "0"
      },
      {
        "data_type": "numeric",
        "index": "135",
        "is_ignore": "false",
        "is_row_identifier": "false",
        "is_target": "false",
        "name": "FCFP4_1024b198",
        "number_of_missing_values": "0"
      },
      {
        "data_type": "numeric",
        "index": "136",
        "is_ignore": "false",
        "is_row_identifier": "false",
        "is_target": "false",
        "name": "FCFP4_1024b199",
        "number_of_missing_values": "0"
      },
      {
        "data_type": "numeric",
        "index": "137",
        "is_ignore": "false",
        "is_row_identifier": "false",
        "is_target": "false",
        "name": "FCFP4_1024b2",
        "number_of_missing_values": "0"
      },
      {
        "data_type": "numeric",
        "index": "138",
        "is_ignore": "false",
        "is_row_identifier": "false",
        "is_target": "false",
        "name": "FCFP4_1024b20",
        "number_of_missing_values": "0"
      },
      {
        "data_type": "numeric",
        "index": "139",
        "is_ignore": "false",
        "is_row_identifier": "false",
        "is_target": "false",
        "name": "FCFP4_1024b200",
        "number_of_missing_values": "0"
      },
      {
        "data_type": "numeric",
        "index": "140",
        "is_ignore": "false",
        "is_row_identifier": "false",
        "is_target": "false",
        "name": "FCFP4_1024b201",
        "number_of_missing_values": "0"
      },
      {
        "data_type": "numeric",
        "index": "141",
        "is_ignore": "false",
        "is_row_identifier": "false",
        "is_target": "false",
        "name": "FCFP4_1024b202",
        "number_of_missing_values": "0"
      },
      {
        "data_type": "numeric",
        "index": "142",
        "is_ignore": "false",
        "is_row_identifier": "false",
        "is_target": "false",
        "name": "FCFP4_1024b203",
        "number_of_missing_values": "0"
      },
      {
        "data_type": "numeric",
        "index": "143",
        "is_ignore": "false",
        "is_row_identifier": "false",
        "is_target": "false",
        "name": "FCFP4_1024b204",
        "number_of_missing_values": "0"
      },
      {
        "data_type": "numeric",
        "index": "144",
        "is_ignore": "false",
        "is_row_identifier": "false",
        "is_target": "false",
        "name": "FCFP4_1024b205",
        "number_of_missing_values": "0"
      },
      {
        "data_type": "numeric",
        "index": "145",
        "is_ignore": "false",
        "is_row_identifier": "false",
        "is_target": "false",
        "name": "FCFP4_1024b206",
        "number_of_missing_values": "0"
      },
      {
        "data_type": "numeric",
        "index": "146",
        "is_ignore": "false",
        "is_row_identifier": "false",
        "is_target": "false",
        "name": "FCFP4_1024b207",
        "number_of_missing_values": "0"
      },
      {
        "data_type": "numeric",
        "index": "147",
        "is_ignore": "false",
        "is_row_identifier": "false",
        "is_target": "false",
        "name": "FCFP4_1024b208",
        "number_of_missing_values": "0"
      },
      {
        "data_type": "numeric",
        "index": "148",
        "is_ignore": "false",
        "is_row_identifier": "false",
        "is_target": "false",
        "name": "FCFP4_1024b209",
        "number_of_missing_values": "0"
      },
      {
        "data_type": "numeric",
        "index": "149",
        "is_ignore": "false",
        "is_row_identifier": "false",
        "is_target": "false",
        "name": "FCFP4_1024b21",
        "number_of_missing_values": "0"
      },
      {
        "data_type": "numeric",
        "index": "150",
        "is_ignore": "false",
        "is_row_identifier": "false",
        "is_target": "false",
        "name": "FCFP4_1024b210",
        "number_of_missing_values": "0"
      },
      {
        "data_type": "numeric",
        "index": "151",
        "is_ignore": "false",
        "is_row_identifier": "false",
        "is_target": "false",
        "name": "FCFP4_1024b211",
        "number_of_missing_values": "0"
      },
      {
        "data_type": "numeric",
        "index": "152",
        "is_ignore": "false",
        "is_row_identifier": "false",
        "is_target": "false",
        "name": "FCFP4_1024b212",
        "number_of_missing_values": "0"
      },
      {
        "data_type": "numeric",
        "index": "153",
        "is_ignore": "false",
        "is_row_identifier": "false",
        "is_target": "false",
        "name": "FCFP4_1024b213",
        "number_of_missing_values": "0"
      },
      {
        "data_type": "numeric",
        "index": "154",
        "is_ignore": "false",
        "is_row_identifier": "false",
        "is_target": "false",
        "name": "FCFP4_1024b214",
        "number_of_missing_values": "0"
      },
      {
        "data_type": "numeric",
        "index": "155",
        "is_ignore": "false",
        "is_row_identifier": "false",
        "is_target": "true",
        "name": "pXC50",
        "number_of_missing_values": "0"
      }
    ]
  }
}