{
  "data_set_description": {
    "collection_date": "November 2013",
    "creator": "Dr Jeremy Besnard, Dr Ivan Olier, Dr Noureddin Sadawi, Dr Larisa Soldatova, Dr Crina Grosan, Prof Ross King, Dr Richard Bickerton, Prof Andrew Hopkins and Dr Willem van Hoorn",
    "default_target_attribute": "pXC50",
    "description": "This dataset contains QSAR data (from ChEMBL version 17) showing activity values (unit is pseudo-pCI50) of several compounds on drug target ChEMBL_ID: CHEMBL1075155 (TID: 103095), and it has 73 rows and 43 features (not including molecule IDs and class feature: molecule_id and pXC50). The features represent Basic Molecular Descriptors which were generated from SMILES strings.  Missing value imputation was applied to this dataset (By choosing the Median).",
    "description_version": "1",
    "file_id": "3433744",
    "format": "ARFF",
    "id": "30940",
    "licence": "Public",
    "md5_checksum": "ad4ebc8c01237c72f5757c6de920040e",
    "minio_url": "https://data.openml.org/datasets/0003/30940/dataset_30940.pq",
    "name": "QSAR-DATASET-FOR-DRUG-TARGET-CHEMBL1075155",
    "original_data_url": "https://www.ebi.ac.uk/chembl/target/inspect/CHEMBL1075155",
    "parquet_url": "https://data.openml.org/datasets/0003/30940/dataset_30940.pq",
    "processing_date": "2018-10-04 02:05:18",
    "row_id_attribute": "molecule_id",
    "status": "deactivated",
    "tag": [
      "MetaQSAR",
      "study_13"
    ],
    "upload_date": "2016-07-15T06:17:10",
    "url": "https://api.openml.org/data/v1/download/3433744/QSAR-DATASET-FOR-DRUG-TARGET-CHEMBL1075155.arff",
    "version": "8",
    "visibility": "public"
  }
}