{
  "data_set_description": {
    "collection_date": "November 2013",
    "creator": "Dr Jeremy Besnard, Dr Ivan Olier, Dr Noureddin Sadawi, Dr Larisa Soldatova, Dr Crina Grosan, Prof Ross King, Dr Richard Bickerton, Prof Andrew Hopkins and Dr Willem van Hoorn",
    "default_target_attribute": "MEDIAN_PXC50",
    "description": "**Author**: Dr Ivan Olier, Dr Jeremy Besnard, Dr Noureddin Sadawi, Dr Larisa Soldatova, Dr Crina Grosan, Prof Ross King, Dr Richard Bickerton, Prof Andrew Hopkins and Dr Willem van Hoorn  \n**Source**: MetaQSAR project - September 2015  \n**Please cite**:   \n\nThis dataset contains QSAR data (from ChEMBL version 17) showing activity values (unit is pseudo-pCI50) of several compounds on drug target TID: 10051, and it has 1007 rows and 1026 features (including IDs and class feature: MOLECULE_CHEMBL_ID and MEDIAN_PXC50). The features represent FCFP 1024bit Molecular Fingerprints which were generated from SMILES strings. They were obtained using the Pipeline Pilot program, Dassault Systèmes BIOVIA. Generating Fingerprints does not usually require missing value imputation as all bits are generated.",
    "description_version": "1",
    "file_id": "1674887",
    "format": "Sparse_ARFF",
    "id": "3089",
    "licence": "Public",
    "md5_checksum": "4f143abd3da19065ab970ca07bef2018",
    "name": "QSAR-TID-10051",
    "original_data_url": "https://www.ebi.ac.uk/chembl/target/inspect/CHEMBL2468",
    "processing_date": "2018-10-03 21:40:00",
    "row_id_attribute": "MOLECULE_CHEMBL_ID",
    "status": "active",
    "tag": [
      "Biology",
      "Chemistry",
      "Computational Science",
      "Data Science",
      "MTLQSAR",
      "Pharmacology",
      "study_3"
    ],
    "upload_date": "2015-10-06T14:55:21",
    "url": "https://api.openml.org/data/v1/download/1674887/QSAR-TID-10051.sparse_arff",
    "version": "1",
    "visibility": "public"
  }
}