"molecule_id","FCFP4_1024b1","FCFP4_1024b10","FCFP4_1024b100","FCFP4_1024b1000","FCFP4_1024b1001","FCFP4_1024b1002","FCFP4_1024b1003","FCFP4_1024b1004","FCFP4_1024b1005","FCFP4_1024b1006","FCFP4_1024b1007","FCFP4_1024b1008","FCFP4_1024b1009","FCFP4_1024b101","FCFP4_1024b1010","FCFP4_1024b1011","FCFP4_1024b1012","FCFP4_1024b1013","FCFP4_1024b1014","FCFP4_1024b1015","FCFP4_1024b1016","FCFP4_1024b1017","FCFP4_1024b1018","FCFP4_1024b1019","FCFP4_1024b102","FCFP4_1024b1020","FCFP4_1024b1021","FCFP4_1024b1022","FCFP4_1024b1023","FCFP4_1024b1024","FCFP4_1024b103","FCFP4_1024b104","FCFP4_1024b105","FCFP4_1024b106","FCFP4_1024b107","FCFP4_1024b108","FCFP4_1024b109","FCFP4_1024b11","FCFP4_1024b110","FCFP4_1024b111","FCFP4_1024b112","FCFP4_1024b113","FCFP4_1024b114","FCFP4_1024b115","FCFP4_1024b116","FCFP4_1024b117","FCFP4_1024b118","FCFP4_1024b119","FCFP4_1024b12","FCFP4_1024b120","FCFP4_1024b121","pXC50"
{1 1,26 1,35 1,52 4.387}
{0 CHEMBL1269018,1 1,26 1,52 4.824}
{0 CHEMBL1269022,1 1,4 1,35 1,52 5.301}
{0 CHEMBL1269664,1 1,26 1,52 4.409}
{0 CHEMBL1269665,1 1,15 1,24 1,26 1,49 1,52 5}
{0 CHEMBL1269666,1 1,15 1,26 1,52 4.699}
{0 CHEMBL1269667,1 1,15 1,52 4.31}
{0 CHEMBL1269668,1 1,15 1,52 4.284}
{0 CHEMBL1269669,1 1,6 1,26 1,52 4.237}
{0 CHEMBL1269670,1 1,26 1,52 4.097}
{0 CHEMBL1269845,1 1,35 1,52 5.398}
{0 CHEMBL1269846,1 1,39 1,52 4.959}
{0 CHEMBL1269954,1 1,52 5.155}
{0 CHEMBL1270061,1 1,47 1,52 5}
{0 CHEMBL1270168,1 1,26 1,52 4.398}
{0 CHEMBL1270169,1 1,52 5}
{0 CHEMBL1270266,1 1,15 1,26 1,52 5.426}
{0 CHEMBL1270267,1 1,15 1,35 1,52 4.523}
{0 CHEMBL1270364,1 1,15 1,52 4.495}
{0 CHEMBL1270365,1 1,15 1,35 1,52 4.469}
{0 CHEMBL1270562,1 1,15 1,35 1,52 4.31}
{0 CHEMBL1270660,1 1,15 1,52 4.081}
{0 CHEMBL1271272,1 1,35 1,52 5.398}
{0 CHEMBL1271378,1 1,11 1,15 1,52 4.456}
{0 CHEMBL377353,1 1,15 1,52 4.125}
{0 CHEMBL429694,1 1,26 1,52 4.481}
{0 CHEMBL471225,1 1,26 1,52 5.398}
{0 CHEMBL487046,1 1,52 5}
{0 CHEMBL512908,1 1,52 5}
{0 CHEMBL533642,1 1,11 1,15 1,52 4.347}
{0 CHEMBL611747,1 1,2 1,26 1,52 5.301}
