{
  "data_set_description": {
    "collection_date": "November 2013",
    "creator": "Dr Jeremy Besnard, Dr Ivan Olier, Dr Noureddin Sadawi, Dr Larisa Soldatova, Dr Crina Grosan, Prof Ross King, Dr Richard Bickerton, Prof Andrew Hopkins and Dr Willem van Hoorn",
    "default_target_attribute": "pXC50",
    "description": "This dataset contains QSAR data (from ChEMBL version 17) showing activity values (unit is pseudo-pCI50) of several compounds on drug target ChEMBL_ID: CHEMBL4424 (TID: 100433), and it has 11 rows and 43 features (not including molecule IDs and class feature: molecule_id and pXC50). The features represent Basic Molecular Descriptors which were generated from SMILES strings.  Missing value imputation was applied to this dataset (By choosing the Median).",
    "description_version": "1",
    "file_id": "3429827",
    "format": "ARFF",
    "id": "30809",
    "licence": "Public",
    "md5_checksum": "c2e7bb0b249ed24b1426a202b977969c",
    "minio_url": "https://data.openml.org/datasets/0003/30809/dataset_30809.pq",
    "name": "QSAR-DATASET-FOR-DRUG-TARGET-CHEMBL4424",
    "original_data_url": "https://www.ebi.ac.uk/chembl/target/inspect/CHEMBL4424",
    "parquet_url": "https://data.openml.org/datasets/0003/30809/dataset_30809.pq",
    "processing_date": "2018-10-04 02:09:56",
    "row_id_attribute": "molecule_id",
    "status": "deactivated",
    "tag": [
      "MetaQSAR",
      "study_13"
    ],
    "upload_date": "2016-07-15T05:56:55",
    "url": "https://api.openml.org/data/v1/download/3429827/QSAR-DATASET-FOR-DRUG-TARGET-CHEMBL4424.arff",
    "version": "9",
    "visibility": "public"
  }
}