"molecule_id","AMW","C.","H.","Me","Mi","Mp","Mv","MW","N.","nAB","nAT","nB","nBM","nBO","nBR","nBT","nC","nCL","nCsp","nCsp2","nCsp3","nDB","nF","nH","nHet","nHM","nI","nN","nO","nP","nS","nSK","nTB","nX","O.","RBF","RBN","SCBO","Se","Si","Sp","Sv","X.","pXC50"
{1 7.286,2 36.2,3 49.3,4 1.005,5 1.133,6 0.643,7 0.605,8 502.7,9 5.8,10 12,11 69,13 16,14 37,16 71,17 25,20 14,21 11,22 4,24 34,25 10,26 1,28 4,29 5,31 1,32 35,35 7.2,36 0.155,37 11,38 47,39 69.374,40 78.188,41 44.364,42 41.749,44 9.5}
{0 CHEMBL1777958,1 7.089,2 38.2,3 50,4 0.998,5 1.129,6 0.65,7 0.606,8 538.78,9 5.3,10 12,11 76,13 16,14 42,16 80,17 29,20 14,21 15,22 4,24 38,25 9,26 1,28 4,29 4,31 1,32 38,35 5.3,36 0.088,37 7,38 52,39 75.814,40 85.809,41 49.432,42 46.087,44 8.387}
{0 CHEMBL1834616,1 7.516,2 44.4,3 45.8,4 0.995,5 1.119,6 0.683,7 0.642,8 541.14,9 5.6,10 18,11 72,13 21,14 44,16 77,17 32,18 1,20 21,21 11,22 3,24 33,25 7,26 1,28 4,29 2,32 39,34 1,35 2.8,36 0.065,37 5,38 56,39 71.64,40 80.584,41 49.211,42 46.245,43 1.4,44 7.67}
{0 CHEMBL1834619,1 7.636,2 43.7,3 45.1,4 0.998,5 1.122,6 0.682,7 0.644,8 542.13,9 7,10 18,11 71,13 21,14 44,16 76,17 31,18 1,20 20,21 11,22 3,24 32,25 8,26 1,28 5,29 2,32 39,34 1,35 2.8,36 0.066,37 5,38 56,39 70.858,40 79.667,41 48.455,42 45.739,43 1.4,44 8.959}
{0 CHEMBL1834620,1 7.636,2 43.7,3 45.1,4 0.998,5 1.122,6 0.682,7 0.644,8 542.13,9 7,10 18,11 71,13 21,14 44,16 76,17 31,18 1,20 20,21 11,22 3,24 32,25 8,26 1,28 5,29 2,32 39,34 1,35 2.8,36 0.066,37 5,38 56,39 70.858,40 79.667,41 48.455,42 45.739,43 1.4,44 7.507}
{0 CHEMBL1834749,1 7.151,2 43.7,3 46.5,4 0.993,5 1.123,6 0.67,7 0.633,8 507.69,9 7,10 18,11 71,13 21,14 43,16 76,17 31,20 20,21 11,22 3,24 33,25 7,28 5,29 2,32 38,35 2.8,36 0.066,37 5,38 55,39 70.534,40 79.723,41 47.597,42 44.912,44 6.466}
{0 CHEMBL1834750,1 7.759,2 44.3,3 44.3,4 1.001,5 1.12,6 0.684,7 0.649,8 543.11,9 5.7,10 18,11 70,13 21,14 44,16 75,17 31,18 1,20 21,21 10,22 3,24 31,25 8,26 1,28 4,29 3,32 39,34 1,35 4.3,36 0.067,37 5,38 56,39 70.083,40 78.378,41 47.904,42 45.433,43 1.4,44 7.757}
{0 CHEMBL1834751,1 7.657,2 43.7,3 43.7,4 1.008,5 1.132,6 0.669,7 0.643,8 543.67,9 7,10 18,11 71,13 21,14 45,16 76,17 31,20 20,21 11,22 3,23 2,24 31,25 9,28 5,29 2,32 40,34 2,35 2.8,36 0.066,37 5,38 57,39 71.559,40 80.403,41 47.472,42 45.678,43 2.8,44 8.658}
{0 CHEMBL1834752,1 7.404,2 43.7,3 45.1,4 1.001,5 1.128,6 0.67,7 0.638,8 525.68,9 7,10 18,11 71,13 21,14 44,16 76,17 31,20 20,21 11,22 3,23 1,24 32,25 8,28 5,29 2,32 39,34 1,35 2.8,36 0.066,37 5,38 56,39 71.047,40 80.063,41 47.535,42 45.295,43 1.4,44 9.222}
{0 CHEMBL1835756,1 7.14,2 46.4,3 46.4,4 0.992,5 1.114,6 0.678,7 0.639,8 492.66,9 2.9,10 18,11 69,13 21,14 42,16 74,17 32,20 22,21 10,22 3,24 32,25 5,28 2,29 3,32 37,35 4.3,36 0.068,37 5,38 54,39 68.44,40 76.853,41 46.796,42 44.089,44 6.322}
{0 CHEMBL1835762,1 7.037,2 44.4,3 47.2,4 0.99,5 1.12,6 0.672,7 0.631,8 506.7,9 5.6,10 18,11 72,13 21,14 43,16 77,17 32,20 21,21 11,22 3,24 34,25 6,28 4,29 2,32 38,35 2.8,36 0.065,37 5,38 55,39 71.316,40 80.64,41 48.353,42 45.417,44 5.189}
{0 CHEMBL189123,1 9.165,2 42.2,3 39.1,4 1.02,5 1.12,6 0.712,7 0.681,8 586.54,9 7.8,10 18,11 64,13 23,14 43,16 68,17 27,18 2,20 21,21 6,22 5,24 25,25 12,26 3,28 5,29 4,31 1,32 39,34 2,35 6.3,36 0.118,37 8,38 57,39 65.262,40 71.704,41 45.585,42 43.603,43 3.1,44 9.585}
{0 CHEMBL1934253,1 7.037,2 44.4,3 47.2,4 0.99,5 1.12,6 0.672,7 0.631,8 506.7,9 5.6,10 18,11 72,13 21,14 43,16 77,17 32,20 21,21 11,22 3,24 34,25 6,28 4,29 2,32 38,35 2.8,36 0.065,37 5,38 55,39 71.316,40 80.64,41 48.353,42 45.417,44 7.009}
{0 CHEMBL1934254,1 7.639,2 46.4,3 44.9,4 0.997,5 1.113,6 0.691,7 0.651,8 527.1,9 2.9,10 18,11 69,13 21,14 43,16 74,17 32,18 1,20 22,21 10,22 3,24 31,25 6,26 1,28 2,29 3,32 38,34 1,35 4.3,36 0.068,37 5,38 55,39 68.763,40 76.797,41 47.654,42 44.917,43 1.4,44 6.606}
{0 CHEMBL1934255,1 7.639,2 46.4,3 44.9,4 0.997,5 1.113,6 0.691,7 0.651,8 527.1,9 2.9,10 18,11 69,13 21,14 43,16 74,17 32,18 1,20 22,21 10,22 3,24 31,25 6,26 1,28 2,29 3,32 38,34 1,35 4.3,36 0.068,37 5,38 55,39 68.763,40 76.797,41 47.654,42 44.917,43 1.4,44 6.796}
{0 CHEMBL1934256,1 7.401,2 46.4,3 44.9,4 0.999,5 1.119,6 0.677,7 0.645,8 510.65,9 2.9,10 18,11 69,13 21,14 43,16 74,17 32,20 22,21 10,22 3,23 1,24 31,25 6,28 2,29 3,32 38,34 1,35 4.3,36 0.068,37 5,38 55,39 68.952,40 77.193,41 46.733,42 44.472,43 1.4,44 6.406}
{0 CHEMBL1934257,1 7.639,2 46.4,3 44.9,4 0.997,5 1.113,6 0.691,7 0.651,8 527.1,9 2.9,10 18,11 69,13 21,14 43,16 74,17 32,18 1,20 22,21 10,22 3,24 31,25 6,26 1,28 2,29 3,32 38,34 1,35 4.3,36 0.068,37 5,38 55,39 68.763,40 76.797,41 47.654,42 44.917,43 1.4,44 6.097}
{0 CHEMBL1934258,1 7.639,2 46.4,3 44.9,4 0.997,5 1.113,6 0.691,7 0.651,8 527.1,9 2.9,10 18,11 69,13 21,14 43,16 74,17 32,18 1,20 22,21 10,22 3,24 31,25 6,26 1,28 2,29 3,32 38,34 1,35 4.3,36 0.068,37 5,38 55,39 68.763,40 76.797,41 47.654,42 44.917,43 1.4,44 6.097}
{0 CHEMBL1934259,1 7.14,2 46.4,3 46.4,4 0.992,5 1.114,6 0.678,7 0.639,8 492.66,9 2.9,10 18,11 69,13 21,14 42,16 74,17 32,20 22,21 10,22 3,24 32,25 5,28 2,29 3,32 37,35 4.3,36 0.068,37 5,38 54,39 68.44,40 76.853,41 46.796,42 44.089,44 6.914}
{0 CHEMBL1934260,1 7.639,2 46.4,3 44.9,4 0.997,5 1.113,6 0.691,7 0.651,8 527.1,9 2.9,10 18,11 69,13 21,14 43,16 74,17 32,18 1,20 22,21 10,22 3,24 31,25 6,26 1,28 2,29 3,32 38,34 1,35 4.3,36 0.068,37 5,38 55,39 68.763,40 76.797,41 47.654,42 44.917,43 1.4,44 7.523}
{0 CHEMBL1934261,1 7.639,2 46.4,3 44.9,4 0.997,5 1.113,6 0.691,7 0.651,8 527.1,9 2.9,10 18,11 69,13 21,14 43,16 74,17 32,18 1,20 22,21 10,22 3,24 31,25 6,26 1,28 2,29 3,32 38,34 1,35 4.3,36 0.068,37 5,38 55,39 68.763,40 76.797,41 47.654,42 44.917,43 1.4,44 5.398}
{0 CHEMBL1934262,1 7.639,2 46.4,3 44.9,4 0.997,5 1.113,6 0.691,7 0.651,8 527.1,9 2.9,10 18,11 69,13 21,14 43,16 74,17 32,18 1,20 22,21 10,22 3,24 31,25 6,26 1,28 2,29 3,32 38,34 1,35 4.3,36 0.068,37 5,38 55,39 68.763,40 76.797,41 47.654,42 44.917,43 1.4,44 6.097}
{0 CHEMBL1934263,1 7.639,2 46.4,3 44.9,4 0.997,5 1.113,6 0.691,7 0.651,8 527.1,9 2.9,10 18,11 69,13 21,14 43,16 74,17 32,18 1,20 22,21 10,22 3,24 31,25 6,26 1,28 2,29 3,32 38,34 1,35 4.3,36 0.068,37 5,38 55,39 68.763,40 76.797,41 47.654,42 44.917,43 1.4,44 5.398}
{0 CHEMBL1934264,1 7.401,2 46.4,3 44.9,4 0.999,5 1.119,6 0.677,7 0.645,8 510.65,9 2.9,10 18,11 69,13 21,14 43,16 74,17 32,20 22,21 10,22 3,23 1,24 31,25 6,28 2,29 3,32 38,34 1,35 4.3,36 0.068,37 5,38 55,39 68.952,40 77.193,41 46.733,42 44.472,43 1.4,44 7.62}
{0 CHEMBL1934265,1 7.037,2 45.8,3 47.2,4 0.991,5 1.115,6 0.674,7 0.634,8 506.69,9 2.8,10 18,11 72,13 21,14 43,16 77,17 33,20 22,21 11,22 3,24 34,25 5,28 2,29 3,32 38,35 4.2,36 0.065,37 5,38 55,39 71.323,40 80.268,41 48.557,42 45.616,44 6.857}
{0 CHEMBL221984,1 8.927,2 43.6,3 36.4,4 1.021,5 1.134,6 0.702,7 0.687,8 490.97,9 14.5,10 23,11 55,13 25,14 38,16 58,17 24,18 1,19 1,20 19,21 4,22 1,23 1,24 20,25 11,26 1,28 8,29 1,32 35,33 1,34 2,35 1.8,36 0.121,37 7,38 52.5,39 56.163,40 62.386,41 38.625,42 37.784,43 3.6,44 7.382}
{0 CHEMBL221998,1 9.12,2 45.3,3 37.7,4 1.019,5 1.118,6 0.716,7 0.691,8 483.38,9 7.5,10 18,11 53,13 21,14 35,16 55,17 24,18 2,19 1,20 19,21 4,22 2,24 20,25 9,26 2,28 4,29 3,32 33,33 1,34 2,35 5.7,36 0.145,37 8,38 48,39 53.989,40 59.246,41 37.955,42 36.626,43 3.8,44 8.551}
{0 CHEMBL222038,1 8.927,2 45.5,3 36.4,4 1.021,5 1.128,6 0.706,7 0.691,8 490.96,9 10.9,10 23,11 55,13 25,14 38,16 58,17 25,18 1,19 1,20 20,21 4,22 1,23 1,24 20,25 10,26 1,28 6,29 2,32 35,33 1,34 2,35 3.6,36 0.121,37 7,38 52.5,39 56.171,40 62.014,41 38.83,42 37.983,43 3.6,44 7.91}
{0 CHEMBL225607,1 8.81,2 45.3,3 37.7,4 1.022,5 1.125,6 0.699,7 0.683,8 466.93,9 7.5,10 18,11 53,13 21,14 35,16 55,17 24,18 1,19 1,20 19,21 4,22 2,23 1,24 20,25 9,26 1,28 4,29 3,32 33,33 1,34 2,35 5.7,36 0.145,37 8,38 48,39 54.178,40 59.642,41 37.034,42 36.182,43 3.8,44 8.62}
{0 CHEMBL227600,1 8.297,2 41.1,3 42.5,4 1.026,5 1.14,6 0.663,7 0.645,8 605.71,9 4.1,10 18,11 73,13 21,14 46,16 77,17 30,20 19,21 11,22 3,23 4,24 31,25 12,26 1,28 3,29 4,31 1,32 42,34 4,35 5.5,36 0.117,37 9,38 58,39 74.879,40 83.255,41 48.415,42 47.072,43 5.5,44 6.346}
{0 CHEMBL227713,1 8.154,2 40.8,3 43.4,4 1.023,5 1.14,6 0.66,7 0.639,8 619.74,9 3.9,10 18,11 76,13 21,14 47,16 80,17 31,20 19,21 12,22 3,23 4,24 33,25 12,26 1,28 3,29 4,31 1,32 43,34 4,35 5.3,36 0.113,37 9,38 59,39 77.763,40 86.67,41 50.177,42 48.599,43 5.3,44 7.983}
{0 CHEMBL227870,1 8.352,2 39.7,3 42.5,4 1.03,5 1.143,6 0.656,7 0.641,8 609.7,9 4.1,10 18,11 73,13 21,14 45,16 76,17 29,20 19,21 10,22 3,23 4,24 31,25 13,26 1,28 3,29 5,31 1,32 42,34 4,35 6.8,36 0.158,37 12,38 57,39 75.207,40 83.464,41 47.87,42 46.787,43 5.5,44 5.773}
{0 CHEMBL232943,1 9.363,2 42.3,3 36.5,4 1.05,5 1.148,6 0.669,7 0.674,8 486.88,9 3.8,10 12,11 52,13 15,14 35,16 54,17 22,18 1,20 15,21 7,22 3,23 4,24 19,25 11,26 1,28 2,29 4,32 33,34 5,35 7.7,36 0.13,37 7,38 44,39 54.607,40 59.704,41 34.813,42 35.057,43 9.6,44 8.137}
{0 CHEMBL359553,1 8.11,2 44.3,3 41.4,4 1.007,5 1.118,6 0.695,7 0.664,8 567.72,9 7.1,10 23,11 70,13 28,14 46,16 75,17 31,20 25,21 6,22 5,24 29,25 10,26 1,28 5,29 4,31 1,32 41,35 5.7,36 0.107,37 8,38 62.5,39 70.498,40 78.232,41 48.631,42 46.475,44 10.301}
{0 CHEMBL387638,1 8.927,2 43.6,3 36.4,4 1.021,5 1.134,6 0.702,7 0.687,8 490.97,9 14.5,10 23,11 55,13 25,14 38,16 58,17 24,18 1,19 1,20 19,21 4,22 1,23 1,24 20,25 11,26 1,28 8,29 1,32 35,33 1,34 2,35 1.8,36 0.121,37 7,38 52.5,39 56.163,40 62.386,41 38.625,42 37.784,43 3.6,44 8.466}
{0 CHEMBL402831,1 10.017,2 40.8,3 32.7,4 1.066,5 1.163,6 0.669,7 0.688,8 490.85,9 8.2,10 17,11 49,13 18,14 35,16 51,17 20,18 1,20 14,21 6,22 1,23 5,24 16,25 13,26 1,28 4,29 3,32 33,34 6,35 6.1,36 0.098,37 5,38 44.5,39 52.229,40 57.001,41 32.784,42 33.715,43 12.2,44 7.886}
{0 CHEMBL415848,1 7.39,2 43,3 46.8,4 0.996,5 1.118,6 0.676,7 0.634,8 583.81,9 3.8,10 23,11 79,13 26,14 47,16 84,17 34,20 23,21 11,22 3,24 37,25 8,26 1,28 3,29 4,31 1,32 42,35 5.1,36 0.107,37 9,38 61.5,39 78.712,40 88.311,41 53.427,42 50.066,44 7.77}
{0 CHEMBL453339,1 7.253,2 40.5,3 48.6,4 0.999,5 1.122,6 0.66,7 0.618,8 536.75,9 2.7,10 17,11 74,13 20,14 42,16 78,17 30,20 17,21 13,22 3,24 36,25 8,26 1,28 2,29 5,31 1,32 38,35 6.8,36 0.103,37 8,38 53.5,39 73.938,40 83.022,41 48.875,42 45.759,44 7.699}
{0 CHEMBL455642,1 7.813,2 38,3 46.5,4 1.021,5 1.141,6 0.643,7 0.618,8 554.69,9 2.8,10 12,11 71,13 15,14 41,16 74,17 27,20 13,21 14,22 3,23 3,24 33,25 11,26 1,28 2,29 5,31 1,32 38,34 3,35 7,36 0.108,37 8,38 50,39 72.476,40 81.041,41 45.688,42 43.909,43 4.2,44 7.951}
{0 CHEMBL455643,1 7.813,2 38,3 46.5,4 1.021,5 1.141,6 0.643,7 0.618,8 554.69,9 2.8,10 12,11 71,13 15,14 41,16 74,17 27,20 13,21 14,22 3,23 3,24 33,25 11,26 1,28 2,29 5,31 1,32 38,34 3,35 7,36 0.108,37 8,38 50,39 72.476,40 81.041,41 45.688,42 43.909,43 4.2,44 6.678}
{0 CHEMBL486456,1 6.785,2 37.5,3 52.5,4 0.995,5 1.128,6 0.639,7 0.592,8 542.81,9 2.5,10 12,11 80,13 15,14 41,16 83,17 30,20 13,21 17,22 3,24 42,25 8,26 1,28 2,29 5,31 1,32 38,35 6.3,36 0.108,37 9,38 50,39 79.589,40 90.268,41 51.16,42 47.34,44 7.597}
{0 CHEMBL488501,1 8.17,2 38.2,3 47.1,4 1.01,5 1.125,6 0.674,7 0.631,8 555.57,9 2.9,10 12,11 68,13 15,14 39,16 71,17 26,18 2,20 13,21 13,22 3,24 32,25 10,26 3,28 2,29 5,31 1,32 36,34 2,35 7.4,36 0.113,37 8,38 48,39 68.702,40 76.495,41 45.83,42 42.888,43 2.9,44 6.851}
{0 CHEMBL507168,1 8.17,2 38.2,3 47.1,4 1.01,5 1.125,6 0.674,7 0.631,8 555.57,9 2.9,10 12,11 68,13 15,14 39,16 71,17 26,18 2,20 13,21 13,22 3,24 32,25 10,26 3,28 2,29 5,31 1,32 36,34 2,35 7.4,36 0.113,37 8,38 48,39 68.702,40 76.495,41 45.83,42 42.888,43 2.9,44 7.693}
{0 CHEMBL508632,1 7.664,2 38.2,3 48.5,4 1.006,5 1.126,6 0.661,7 0.619,8 521.13,9 2.9,10 12,11 68,13 15,14 38,16 71,17 26,18 1,20 13,21 13,22 3,24 33,25 9,26 2,28 2,29 5,31 1,32 35,34 1,35 7.4,36 0.113,37 8,38 47,39 68.378,40 76.551,41 44.972,42 42.06,43 1.5,44 7.066}
