{
  "data_set_description": {
    "collection_date": "November 2013",
    "creator": "Dr Jeremy Besnard, Dr Ivan Olier, Dr Noureddin Sadawi, Dr Larisa Soldatova, Dr Crina Grosan, Prof Ross King, Dr Richard Bickerton, Prof Andrew Hopkins and Dr Willem van Hoorn",
    "default_target_attribute": "pXC50",
    "description": "This dataset contains QSAR data (from ChEMBL version 17) showing activity values (unit is pseudo-pCI50) of several compounds on drug target ChEMBL_ID: CHEMBL5350 (TID: 101162), and it has 30 rows and 1089 features (not including molecule IDs and class feature: molecule_id and pXC50). The features represent Molecular Descriptors which were generated from SMILES strings. Missing value imputation was applied to this dataset (By choosing the Median).",
    "description_version": "1",
    "file_id": "3428445",
    "format": "ARFF",
    "id": "30763",
    "licence": "Public",
    "md5_checksum": "1dd8f4ae49261e383831128cff855c3c",
    "minio_url": "https://data.openml.org/datasets/0003/30763/dataset_30763.pq",
    "name": "QSAR-DATASET-FOR-DRUG-TARGET-CHEMBL5350",
    "original_data_url": "https://www.ebi.ac.uk/chembl/target/inspect/CHEMBL5350",
    "parquet_url": "https://data.openml.org/datasets/0003/30763/dataset_30763.pq",
    "processing_date": "2018-10-04 01:58:15",
    "row_id_attribute": "molecule_id",
    "status": "deactivated",
    "tag": [
      "MetaQSAR",
      "study_13"
    ],
    "upload_date": "2016-07-15T05:49:50",
    "url": "https://api.openml.org/data/v1/download/3428445/QSAR-DATASET-FOR-DRUG-TARGET-CHEMBL5350.arff",
    "version": "10",
    "visibility": "public"
  }
}