{
  "data_qualities": {
    "quality": [
      {
        "name": "AutoCorrelation",
        "value": "0.31931309904153315"
      },
      {
        "name": "CfsSubsetEval_DecisionStumpAUC",
        "value": []
      },
      {
        "name": "CfsSubsetEval_DecisionStumpErrRate",
        "value": []
      },
      {
        "name": "CfsSubsetEval_DecisionStumpKappa",
        "value": []
      },
      {
        "name": "CfsSubsetEval_NaiveBayesAUC",
        "value": []
      },
      {
        "name": "CfsSubsetEval_NaiveBayesErrRate",
        "value": []
      },
      {
        "name": "CfsSubsetEval_NaiveBayesKappa",
        "value": []
      },
      {
        "name": "CfsSubsetEval_kNN1NAUC",
        "value": []
      },
      {
        "name": "CfsSubsetEval_kNN1NErrRate",
        "value": []
      },
      {
        "name": "CfsSubsetEval_kNN1NKappa",
        "value": []
      },
      {
        "name": "ClassEntropy",
        "value": []
      },
      {
        "name": "DecisionStumpAUC",
        "value": []
      },
      {
        "name": "DecisionStumpErrRate",
        "value": []
      },
      {
        "name": "DecisionStumpKappa",
        "value": []
      },
      {
        "name": "Dimensionality",
        "value": "3.267515923566879"
      },
      {
        "name": "EquivalentNumberOfAtts",
        "value": []
      },
      {
        "name": "J48.00001.AUC",
        "value": []
      },
      {
        "name": "J48.00001.ErrRate",
        "value": []
      },
      {
        "name": "J48.00001.Kappa",
        "value": []
      },
      {
        "name": "J48.0001.AUC",
        "value": []
      },
      {
        "name": "J48.0001.ErrRate",
        "value": []
      },
      {
        "name": "J48.0001.Kappa",
        "value": []
      },
      {
        "name": "J48.001.AUC",
        "value": []
      },
      {
        "name": "J48.001.ErrRate",
        "value": []
      },
      {
        "name": "J48.001.Kappa",
        "value": []
      },
      {
        "name": "MajorityClassPercentage",
        "value": []
      },
      {
        "name": "MajorityClassSize",
        "value": []
      },
      {
        "name": "MaxAttributeEntropy",
        "value": []
      },
      {
        "name": "MaxKurtosisOfNumericAtts",
        "value": "314.0000000000006"
      },
      {
        "name": "MaxMeansOfNumericAtts",
        "value": "6.540175159235669"
      },
      {
        "name": "MaxMutualInformation",
        "value": []
      },
      {
        "name": "MaxNominalAttDistinctValues",
        "value": []
      },
      {
        "name": "MaxSkewnessOfNumericAtts",
        "value": "17.720045146669346"
      },
      {
        "name": "MaxStdDevOfNumericAtts",
        "value": "1.2953771199767417"
      },
      {
        "name": "MeanAttributeEntropy",
        "value": []
      },
      {
        "name": "MeanKurtosisOfNumericAtts",
        "value": "88.97344127333838"
      },
      {
        "name": "MeanMeansOfNumericAtts",
        "value": "0.06952498058101599"
      },
      {
        "name": "MeanMutualInformation",
        "value": []
      },
      {
        "name": "MeanNoiseToSignalRatio",
        "value": []
      },
      {
        "name": "MeanNominalAttDistinctValues",
        "value": []
      },
      {
        "name": "MeanSkewnessOfNumericAtts",
        "value": "7.629435512892485"
      },
      {
        "name": "MeanStdDevOfNumericAtts",
        "value": "0.14964967369459664"
      },
      {
        "name": "MinAttributeEntropy",
        "value": []
      },
      {
        "name": "MinKurtosisOfNumericAtts",
        "value": "-2.011377162829132"
      },
      {
        "name": "MinMeansOfNumericAtts",
        "value": "0.0"
      },
      {
        "name": "MinMutualInformation",
        "value": []
      },
      {
        "name": "MinNominalAttDistinctValues",
        "value": []
      },
      {
        "name": "MinSkewnessOfNumericAtts",
        "value": "-3.203755875157593"
      },
      {
        "name": "MinStdDevOfNumericAtts",
        "value": "0.0"
      },
      {
        "name": "MinorityClassPercentage",
        "value": []
      },
      {
        "name": "MinorityClassSize",
        "value": []
      },
      {
        "name": "NaiveBayesAUC",
        "value": []
      },
      {
        "name": "NaiveBayesErrRate",
        "value": []
      },
      {
        "name": "NaiveBayesKappa",
        "value": []
      },
      {
        "name": "NumberOfBinaryFeatures",
        "value": "0.0"
      },
      {
        "name": "NumberOfClasses",
        "value": "0.0"
      },
      {
        "name": "NumberOfFeatures",
        "value": "1026.0"
      },
      {
        "name": "NumberOfInstances",
        "value": "314.0"
      },
      {
        "name": "NumberOfInstancesWithMissingValues",
        "value": "0.0"
      },
      {
        "name": "NumberOfMissingValues",
        "value": "0.0"
      },
      {
        "name": "NumberOfNumericFeatures",
        "value": "1025.0"
      },
      {
        "name": "NumberOfSymbolicFeatures",
        "value": "1.0"
      },
      {
        "name": "PercentageOfBinaryFeatures",
        "value": "0.0"
      },
      {
        "name": "PercentageOfInstancesWithMissingValues",
        "value": "0.0"
      },
      {
        "name": "PercentageOfMissingValues",
        "value": "0.0"
      },
      {
        "name": "PercentageOfNumericFeatures",
        "value": "99.90253411306043"
      },
      {
        "name": "PercentageOfSymbolicFeatures",
        "value": "0.09746588693957114"
      },
      {
        "name": "Quartile1AttributeEntropy",
        "value": []
      },
      {
        "name": "Quartile1KurtosisOfNumericAtts",
        "value": "7.667273955977091"
      },
      {
        "name": "Quartile1MeansOfNumericAtts",
        "value": "0.003184713375796179"
      },
      {
        "name": "Quartile1MutualInformation",
        "value": []
      },
      {
        "name": "Quartile1SkewnessOfNumericAtts",
        "value": "3.042291137163805"
      },
      {
        "name": "Quartile1StdDevOfNumericAtts",
        "value": "0.05643326479831005"
      },
      {
        "name": "Quartile2AttributeEntropy",
        "value": []
      },
      {
        "name": "Quartile2KurtosisOfNumericAtts",
        "value": "34.84762137293692"
      },
      {
        "name": "Quartile2MeansOfNumericAtts",
        "value": "0.012738853503184716"
      },
      {
        "name": "Quartile2MutualInformation",
        "value": []
      },
      {
        "name": "Quartile2SkewnessOfNumericAtts",
        "value": "6.051916901635281"
      },
      {
        "name": "Quartile2StdDevOfNumericAtts",
        "value": "0.11232433336447627"
      },
      {
        "name": "Quartile3AttributeEntropy",
        "value": []
      },
      {
        "name": "Quartile3KurtosisOfNumericAtts",
        "value": "154.47429733727844"
      },
      {
        "name": "Quartile3MeansOfNumericAtts",
        "value": "0.06050955414012746"
      },
      {
        "name": "Quartile3MutualInformation",
        "value": []
      },
      {
        "name": "Quartile3SkewnessOfNumericAtts",
        "value": "12.469579194695376"
      },
      {
        "name": "Quartile3StdDevOfNumericAtts",
        "value": "0.23880906907804383"
      },
      {
        "name": "REPTreeDepth1AUC",
        "value": []
      },
      {
        "name": "REPTreeDepth1ErrRate",
        "value": []
      },
      {
        "name": "REPTreeDepth1Kappa",
        "value": []
      },
      {
        "name": "REPTreeDepth2AUC",
        "value": []
      },
      {
        "name": "REPTreeDepth2ErrRate",
        "value": []
      },
      {
        "name": "REPTreeDepth2Kappa",
        "value": []
      },
      {
        "name": "REPTreeDepth3AUC",
        "value": []
      },
      {
        "name": "REPTreeDepth3ErrRate",
        "value": []
      },
      {
        "name": "REPTreeDepth3Kappa",
        "value": []
      },
      {
        "name": "RandomTreeDepth1AUC",
        "value": []
      },
      {
        "name": "RandomTreeDepth1ErrRate",
        "value": []
      },
      {
        "name": "RandomTreeDepth1Kappa",
        "value": []
      },
      {
        "name": "RandomTreeDepth2AUC",
        "value": []
      },
      {
        "name": "RandomTreeDepth2ErrRate",
        "value": []
      },
      {
        "name": "RandomTreeDepth2Kappa",
        "value": []
      },
      {
        "name": "RandomTreeDepth3AUC",
        "value": []
      },
      {
        "name": "RandomTreeDepth3ErrRate",
        "value": []
      },
      {
        "name": "RandomTreeDepth3Kappa",
        "value": []
      },
      {
        "name": "StdvNominalAttDistinctValues",
        "value": []
      },
      {
        "name": "kNN1NAUC",
        "value": []
      },
      {
        "name": "kNN1NErrRate",
        "value": []
      },
      {
        "name": "kNN1NKappa",
        "value": []
      }
    ]
  }
}