{
  "data_set_description": {
    "collection_date": "November 2013",
    "creator": "Dr Jeremy Besnard, Dr Ivan Olier, Dr Noureddin Sadawi, Dr Larisa Soldatova, Dr Crina Grosan, Prof Ross King, Dr Richard Bickerton, Prof Andrew Hopkins and Dr Willem van Hoorn",
    "default_target_attribute": "pXC50",
    "description": "This dataset contains QSAR data (from ChEMBL version 17) showing activity values (unit is pseudo-pCI50) of several compounds on drug target ChEMBL_ID: CHEMBL3830 (TID: 30000), and it has 83 rows and 43 features (not including molecule IDs and class feature: molecule_id and pXC50). The features represent Basic Molecular Descriptors which were generated from SMILES strings.  Missing value imputation was applied to this dataset (By choosing the Median).",
    "description_version": "1",
    "file_id": "3427567",
    "format": "ARFF",
    "id": "30743",
    "licence": "Public",
    "md5_checksum": "f59159edb35e05476e0c60ef092cfd1c",
    "minio_url": "https://data.openml.org/datasets/0003/30743/dataset_30743.pq",
    "name": "QSAR-DATASET-FOR-DRUG-TARGET-CHEMBL3830",
    "original_data_url": "https://www.ebi.ac.uk/chembl/target/inspect/CHEMBL3830",
    "parquet_url": "https://data.openml.org/datasets/0003/30743/dataset_30743.pq",
    "processing_date": "2018-10-04 02:22:06",
    "row_id_attribute": "molecule_id",
    "status": "deactivated",
    "tag": [
      "MetaQSAR",
      "study_13"
    ],
    "upload_date": "2016-07-15T05:46:31",
    "url": "https://api.openml.org/data/v1/download/3427567/QSAR-DATASET-FOR-DRUG-TARGET-CHEMBL3830.arff",
    "version": "9",
    "visibility": "public"
  }
}