{
  "data_features": {
    "feature": [
      {
        "data_type": "nominal",
        "index": "0",
        "is_ignore": "false",
        "is_row_identifier": "true",
        "is_target": "false",
        "name": "molecule_id",
        "nominal_value": [
          "CHEMBL10",
          "CHEMBL101253",
          "CHEMBL103667",
          "CHEMBL105442",
          "CHEMBL1082440",
          "CHEMBL1082511",
          "CHEMBL1082512",
          "CHEMBL1082834",
          "CHEMBL1083175",
          "CHEMBL1083176",
          "CHEMBL1083482",
          "CHEMBL1083483",
          "CHEMBL1084088",
          "CHEMBL1084089",
          "CHEMBL1084174",
          "CHEMBL1084345",
          "CHEMBL1084346",
          "CHEMBL1084361",
          "CHEMBL1084628",
          "CHEMBL1084863",
          "CHEMBL1084970",
          "CHEMBL1085121",
          "CHEMBL1085122",
          "CHEMBL1085308",
          "CHEMBL1085309",
          "CHEMBL1085310",
          "CHEMBL1085654",
          "CHEMBL1085710",
          "CHEMBL1085880",
          "CHEMBL1085881",
          "CHEMBL1086087",
          "CHEMBL1086357",
          "CHEMBL1087397",
          "CHEMBL1087421",
          "CHEMBL1087650",
          "CHEMBL1088633",
          "CHEMBL1088704",
          "CHEMBL1089082",
          "CHEMBL1090143",
          "CHEMBL1094408",
          "CHEMBL115220",
          "CHEMBL116070",
          "CHEMBL1164106",
          "CHEMBL1164517",
          "CHEMBL1164524",
          "CHEMBL1173655",
          "CHEMBL119385",
          "CHEMBL1204404",
          "CHEMBL1221423",
          "CHEMBL1221431",
          "CHEMBL1222474",
          "CHEMBL1222475",
          "CHEMBL1222476",
          "CHEMBL1222477",
          "CHEMBL1222563",
          "CHEMBL1222564",
          "CHEMBL1222565",
          "CHEMBL1222635",
          "CHEMBL1222636",
          "CHEMBL1222637",
          "CHEMBL1222638",
          "CHEMBL1222705",
          "CHEMBL1222706",
          "CHEMBL1222707",
          "CHEMBL1222708",
          "CHEMBL1222786",
          "CHEMBL1222787",
          "CHEMBL1222788",
          "CHEMBL1222789",
          "CHEMBL1222851",
          "CHEMBL1222852",
          "CHEMBL1222853",
          "CHEMBL1222854",
          "CHEMBL1222925",
          "CHEMBL1222926",
          "CHEMBL1222927",
          "CHEMBL1222928",
          "CHEMBL1222929",
          "CHEMBL1222990",
          "CHEMBL1222991",
          "CHEMBL1222992",
          "CHEMBL1222993",
          "CHEMBL1223060",
          "CHEMBL1223061",
          "CHEMBL1223062",
          "CHEMBL1223063",
          "CHEMBL1223136",
          "CHEMBL1223137",
          "CHEMBL1223138",
          "CHEMBL1223139",
          "CHEMBL1223203",
          "CHEMBL1223204",
          "CHEMBL1223205",
          "CHEMBL1223206",
          "CHEMBL1223207",
          "CHEMBL1223286",
          "CHEMBL1223287",
          "CHEMBL1223288",
          "CHEMBL1223289",
          "CHEMBL1223355",
          "CHEMBL1223564",
          "CHEMBL1230020",
          "CHEMBL1230122",
          "CHEMBL1230607",
          "CHEMBL1236107",
          "CHEMBL1236126",
          "CHEMBL1240703",
          "CHEMBL1241473",
          "CHEMBL1241674",
          "CHEMBL124660",
          "CHEMBL1258913",
          "CHEMBL1270230",
          "CHEMBL1270399",
          "CHEMBL1270795",
          "CHEMBL1287853",
          "CHEMBL1288582",
          "CHEMBL1289926",
          "CHEMBL129857",
          "CHEMBL129981",
          "CHEMBL130511",
          "CHEMBL130631",
          "CHEMBL130866",
          "CHEMBL131693",
          "CHEMBL132416",
          "CHEMBL132942",
          "CHEMBL133471",
          "CHEMBL133548",
          "CHEMBL1336",
          "CHEMBL133823",
          "CHEMBL133928",
          "CHEMBL133941",
          "CHEMBL134010",
          "CHEMBL1381197",
          "CHEMBL1421",
          "CHEMBL142425",
          "CHEMBL1427791",
          "CHEMBL1583874",
          "CHEMBL1614701",
          "CHEMBL1614705",
          "CHEMBL1614725",
          "CHEMBL162",
          "CHEMBL1642545",
          "CHEMBL1642546",
          "CHEMBL1642547",
          "CHEMBL1642548",
          "CHEMBL1642549",
          "CHEMBL1642550",
          "CHEMBL1642551",
          "CHEMBL1642552",
          "CHEMBL1642553",
          "CHEMBL1642554",
          "CHEMBL1642555",
          "CHEMBL1642556",
          "CHEMBL1642557",
          "CHEMBL1642558",
          "CHEMBL1642559",
          "CHEMBL1642560",
          "CHEMBL1642561",
          "CHEMBL1642562",
          "CHEMBL1642563",
          "CHEMBL1642564",
          "CHEMBL1642565",
          "CHEMBL1650533",
          "CHEMBL1650545",
          "CHEMBL1650551",
          "CHEMBL1669326",
          "CHEMBL1669327",
          "CHEMBL1669328",
          "CHEMBL1669329",
          "CHEMBL1669330",
          "CHEMBL1669331",
          "CHEMBL1669332",
          "CHEMBL1669333",
          "CHEMBL1669334",
          "CHEMBL1669335",
          "CHEMBL1669336",
          "CHEMBL1669337",
          "CHEMBL1669338",
          "CHEMBL1669339",
          "CHEMBL1669340",
          "CHEMBL1669341",
          "CHEMBL1669342",
          "CHEMBL1669551",
          "CHEMBL1669552",
          "CHEMBL1669553",
          "CHEMBL1669554",
          "CHEMBL1669555",
          "CHEMBL1669556",
          "CHEMBL1669557",
          "CHEMBL1669558",
          "CHEMBL1669559",
          "CHEMBL1669560",
          "CHEMBL1669561",
          "CHEMBL1669562",
          "CHEMBL1669563",
          "CHEMBL1669564",
          "CHEMBL1669565",
          "CHEMBL1669566",
          "CHEMBL1669567",
          "CHEMBL1669568",
          "CHEMBL1669569",
          "CHEMBL1669570",
          "CHEMBL1669571",
          "CHEMBL1669572",
          "CHEMBL1669573",
          "CHEMBL1669593",
          "CHEMBL1669594",
          "CHEMBL1669595",
          "CHEMBL1669596",
          "CHEMBL1669597",
          "CHEMBL1669598",
          "CHEMBL1669599",
          "CHEMBL1669600",
          "CHEMBL1669601",
          "CHEMBL1669602",
          "CHEMBL1669603",
          "CHEMBL1669604",
          "CHEMBL1669605",
          "CHEMBL1669606",
          "CHEMBL1669607",
          "CHEMBL1669608",
          "CHEMBL1681965",
          "CHEMBL1681966",
          "CHEMBL1681967",
          "CHEMBL1681968",
          "CHEMBL1681969",
          "CHEMBL1681970",
          "CHEMBL1681971",
          "CHEMBL1681972",
          "CHEMBL1681973",
          "CHEMBL1681974",
          "CHEMBL1681975",
          "CHEMBL1681976",
          "CHEMBL1681977",
          "CHEMBL1681978",
          "CHEMBL1681979",
          "CHEMBL1681980",
          "CHEMBL1681981",
          "CHEMBL1681982",
          "CHEMBL1681983",
          "CHEMBL1681984",
          "CHEMBL1681985",
          "CHEMBL1681986",
          "CHEMBL1681987",
          "CHEMBL1681988",
          "CHEMBL1681989",
          "CHEMBL1681990",
          "CHEMBL1681991",
          "CHEMBL1682345",
          "CHEMBL1682357",
          "CHEMBL1682545",
          "CHEMBL1682546",
          "CHEMBL1682552",
          "CHEMBL1682553",
          "CHEMBL170024",
          "CHEMBL170189",
          "CHEMBL170355",
          "CHEMBL170406",
          "CHEMBL170463",
          "CHEMBL170563",
          "CHEMBL171291",
          "CHEMBL171587",
          "CHEMBL171680",
          "CHEMBL1721885",
          "CHEMBL173050",
          "CHEMBL173111",
          "CHEMBL173484",
          "CHEMBL173747",
          "CHEMBL1738710",
          "CHEMBL1738758",
          "CHEMBL174140",
          "CHEMBL174201",
          "CHEMBL174430",
          "CHEMBL1760016",
          "CHEMBL1760505",
          "CHEMBL1761499",
          "CHEMBL1761500",
          "CHEMBL1761501",
          "CHEMBL1761502",
          "CHEMBL1761503",
          "CHEMBL1761504",
          "CHEMBL1761505",
          "CHEMBL1761506",
          "CHEMBL1761508",
          "CHEMBL1761509",
          "CHEMBL1761510",
          "CHEMBL1761511",
          "CHEMBL1761512",
          "CHEMBL1761513",
          "CHEMBL1761514",
          "CHEMBL1761515",
          "CHEMBL1761516",
          "CHEMBL1761517",
          "CHEMBL1773326",
          "CHEMBL1773327",
          "CHEMBL1773328",
          "CHEMBL1773329",
          "CHEMBL1773330",
          "CHEMBL1773331",
          "CHEMBL1773333",
          "CHEMBL1773334",
          "CHEMBL1773335",
          "CHEMBL1773336",
          "CHEMBL1775219",
          "CHEMBL1775231",
          "CHEMBL1775233",
          "CHEMBL1788116",
          "CHEMBL1789941",
          "CHEMBL179997",
          "CHEMBL180022",
          "CHEMBL180452",
          "CHEMBL1806509",
          "CHEMBL1807446",
          "CHEMBL1807603",
          "CHEMBL1807604",
          "CHEMBL1807605",
          "CHEMBL1807606",
          "CHEMBL1807607",
          "CHEMBL1807608",
          "CHEMBL1807609",
          "CHEMBL1807610",
          "CHEMBL1807611",
          "CHEMBL1807612",
          "CHEMBL1807613",
          "CHEMBL1807614",
          "CHEMBL1807615",
          "CHEMBL1807616",
          "CHEMBL1807617",
          "CHEMBL1807618",
          "CHEMBL1807619",
          "CHEMBL1807620",
          "CHEMBL1807621",
          "CHEMBL1807622",
          "CHEMBL1807623",
          "CHEMBL1807624",
          "CHEMBL181334",
          "CHEMBL181358",
          "CHEMBL181434",
          "CHEMBL181495",
          "CHEMBL181756",
          "CHEMBL181914",
          "CHEMBL182012",
          "CHEMBL182173",
          "CHEMBL182282",
          "CHEMBL182312",
          "CHEMBL182315",
          "CHEMBL182358",
          "CHEMBL182407",
          "CHEMBL182417",
          "CHEMBL182722",
          "CHEMBL182749",
          "CHEMBL182966",
          "CHEMBL183009",
          "CHEMBL183024",
          "CHEMBL1831076",
          "CHEMBL1831077",
          "CHEMBL1831078",
          "CHEMBL1831079",
          "CHEMBL1831194",
          "CHEMBL1831195",
          "CHEMBL1831196",
          "CHEMBL1831197",
          "CHEMBL1831198",
          "CHEMBL1831199",
          "CHEMBL1831200",
          "CHEMBL1831201",
          "CHEMBL1831202",
          "CHEMBL1831203",
          "CHEMBL1831204",
          "CHEMBL1831205",
          "CHEMBL1831206",
          "CHEMBL1831207",
          "CHEMBL1831208",
          "CHEMBL1831209",
          "CHEMBL1831210",
          "CHEMBL1831211",
          "CHEMBL1831212",
          "CHEMBL1831213",
          "CHEMBL1831214",
          "CHEMBL1831215",
          "CHEMBL1831216",
          "CHEMBL1831225",
          "CHEMBL1831229",
          "CHEMBL183187",
          "CHEMBL183341",
          "CHEMBL183496",
          "CHEMBL183703",
          "CHEMBL184041",
          "CHEMBL184831",
          "CHEMBL184832",
          "CHEMBL185153",
          "CHEMBL185509",
          "CHEMBL185569",
          "CHEMBL189338",
          "CHEMBL1908391",
          "CHEMBL1908392",
          "CHEMBL1908393",
          "CHEMBL1908394",
          "CHEMBL1908395",
          "CHEMBL1908396",
          "CHEMBL1908397",
          "CHEMBL1916359",
          "CHEMBL1921823",
          "CHEMBL1923972",
          "CHEMBL1923973",
          "CHEMBL1923974",
          "CHEMBL1923975",
          "CHEMBL1923976",
          "CHEMBL1923977",
          "CHEMBL1923978",
          "CHEMBL1923979",
          "CHEMBL1923980",
          "CHEMBL1923981",
          "CHEMBL1923982",
          "CHEMBL1923983",
          "CHEMBL1923984",
          "CHEMBL1923985",
          "CHEMBL1923986",
          "CHEMBL1923987",
          "CHEMBL1923988",
          "CHEMBL1923989",
          "CHEMBL1923990",
          "CHEMBL1923991",
          "CHEMBL1923992",
          "CHEMBL1923993",
          "CHEMBL1923994",
          "CHEMBL1929238",
          "CHEMBL193093",
          "CHEMBL1933538",
          "CHEMBL1933550",
          "CHEMBL1933551",
          "CHEMBL1933552",
          "CHEMBL1933576",
          "CHEMBL1933582",
          "CHEMBL193551",
          "CHEMBL193601",
          "CHEMBL1938680",
          "CHEMBL193939",
          "CHEMBL193966",
          "CHEMBL194110",
          "CHEMBL194941",
          "CHEMBL1956071",
          "CHEMBL1957085",
          "CHEMBL195780",
          "CHEMBL1958314",
          "CHEMBL1958315",
          "CHEMBL1958316",
          "CHEMBL1958317",
          "CHEMBL1958318",
          "CHEMBL1958319",
          "CHEMBL1958320",
          "CHEMBL1958321",
          "CHEMBL196363",
          "CHEMBL1964241",
          "CHEMBL1964307",
          "CHEMBL1964399",
          "CHEMBL1964413",
          "CHEMBL1964687",
          "CHEMBL1965423",
          "CHEMBL1965495",
          "CHEMBL1965507",
          "CHEMBL1965631",
          "CHEMBL1965910",
          "CHEMBL1965988",
          "CHEMBL1966087",
          "CHEMBL1966514",
          "CHEMBL1966524",
          "CHEMBL196653",
          "CHEMBL196659",
          "CHEMBL1967116",
          "CHEMBL1967302",
          "CHEMBL1967564",
          "CHEMBL196783",
          "CHEMBL1968070",
          "CHEMBL1968245",
          "CHEMBL1968380",
          "CHEMBL1968791",
          "CHEMBL1968850",
          "CHEMBL1969102",
          "CHEMBL1969264",
          "CHEMBL1969523",
          "CHEMBL1969755",
          "CHEMBL1970074",
          "CHEMBL1970083",
          "CHEMBL1970104",
          "CHEMBL1970317",
          "CHEMBL1970522",
          "CHEMBL1970806",
          "CHEMBL1970879",
          "CHEMBL1970903",
          "CHEMBL1970913",
          "CHEMBL1971017",
          "CHEMBL1971029",
          "CHEMBL1971430",
          "CHEMBL1971694",
          "CHEMBL1971801",
          "CHEMBL1971947",
          "CHEMBL197207",
          "CHEMBL1972250",
          "CHEMBL1972258",
          "CHEMBL197252",
          "CHEMBL1972584",
          "CHEMBL1972659",
          "CHEMBL1972840",
          "CHEMBL1973145",
          "CHEMBL1973211",
          "CHEMBL1973395",
          "CHEMBL197358",
          "CHEMBL1973711",
          "CHEMBL1973937",
          "CHEMBL197405",
          "CHEMBL197414",
          "CHEMBL1974457",
          "CHEMBL1974803",
          "CHEMBL1974935",
          "CHEMBL1975233",
          "CHEMBL1975787",
          "CHEMBL197603",
          "CHEMBL1976090",
          "CHEMBL1976328",
          "CHEMBL1977041",
          "CHEMBL1977223",
          "CHEMBL1977814",
          "CHEMBL1979577",
          "CHEMBL1979718",
          "CHEMBL1979883",
          "CHEMBL1979970",
          "CHEMBL1980715",
          "CHEMBL1980802",
          "CHEMBL1980896",
          "CHEMBL1980995",
          "CHEMBL1981045",
          "CHEMBL1982465",
          "CHEMBL1982476",
          "CHEMBL1982506",
          "CHEMBL1983006",
          "CHEMBL1983025",
          "CHEMBL1983945",
          "CHEMBL1983963",
          "CHEMBL1984206",
          "CHEMBL1984274",
          "CHEMBL1984432",
          "CHEMBL1984711",
          "CHEMBL1985311",
          "CHEMBL1985566",
          "CHEMBL1985580",
          "CHEMBL1986186",
          "CHEMBL1986263",
          "CHEMBL1987054",
          "CHEMBL1987533",
          "CHEMBL1987679",
          "CHEMBL1987756",
          "CHEMBL1988370",
          "CHEMBL1988437",
          "CHEMBL1989265",
          "CHEMBL1989518",
          "CHEMBL1989856",
          "CHEMBL1990346",
          "CHEMBL1990482",
          "CHEMBL1990496",
          "CHEMBL1990583",
          "CHEMBL1990885",
          "CHEMBL1991138",
          "CHEMBL1991180",
          "CHEMBL1991285",
          "CHEMBL1991395",
          "CHEMBL1991434",
          "CHEMBL1991577",
          "CHEMBL1991640",
          "CHEMBL1991728",
          "CHEMBL1991846",
          "CHEMBL1992242",
          "CHEMBL1992323",
          "CHEMBL1992644",
          "CHEMBL1992645",
          "CHEMBL1992732",
          "CHEMBL1992740",
          "CHEMBL1992796",
          "CHEMBL1992922",
          "CHEMBL1992937",
          "CHEMBL1993166",
          "CHEMBL1993722",
          "CHEMBL1994241",
          "CHEMBL1994321",
          "CHEMBL1994526",
          "CHEMBL1994538",
          "CHEMBL1995592",
          "CHEMBL1996155",
          "CHEMBL1996390",
          "CHEMBL1996543",
          "CHEMBL1996780",
          "CHEMBL1996817",
          "CHEMBL1997023",
          "CHEMBL1997025",
          "CHEMBL1997129",
          "CHEMBL1997617",
          "CHEMBL1997623",
          "CHEMBL1997822",
          "CHEMBL199837",
          "CHEMBL1998545",
          "CHEMBL1998585",
          "CHEMBL1999556",
          "CHEMBL1999749",
          "CHEMBL1999774",
          "CHEMBL199980",
          "CHEMBL1999918",
          "CHEMBL2000071",
          "CHEMBL2000104",
          "CHEMBL200027",
          "CHEMBL2000271",
          "CHEMBL2000345",
          "CHEMBL2000685",
          "CHEMBL200106",
          "CHEMBL2001224",
          "CHEMBL2001239",
          "CHEMBL2001257",
          "CHEMBL2001751",
          "CHEMBL200191",
          "CHEMBL2001923",
          "CHEMBL2001998",
          "CHEMBL200229",
          "CHEMBL2002322",
          "CHEMBL2002323",
          "CHEMBL2002407",
          "CHEMBL2002446",
          "CHEMBL2002702",
          "CHEMBL2002726",
          "CHEMBL2003524",
          "CHEMBL2003657",
          "CHEMBL2003817",
          "CHEMBL2004355",
          "CHEMBL2004438",
          "CHEMBL2004447",
          "CHEMBL200462",
          "CHEMBL2004692",
          "CHEMBL2005631",
          "CHEMBL2005886",
          "CHEMBL2005899",
          "CHEMBL2006156",
          "CHEMBL2006237",
          "CHEMBL2006493",
          "CHEMBL2006567",
          "CHEMBL2006581",
          "CHEMBL2006778",
          "CHEMBL2006836",
          "CHEMBL2006933",
          "CHEMBL2007044",
          "CHEMBL2007064",
          "CHEMBL2007151",
          "CHEMBL2007592",
          "CHEMBL200832",
          "CHEMBL200860",
          "CHEMBL200892",
          "CHEMBL200946",
          "CHEMBL2036343",
          "CHEMBL2048912",
          "CHEMBL206683",
          "CHEMBL206734",
          "CHEMBL206896",
          "CHEMBL206956",
          "CHEMBL206961",
          "CHEMBL206985",
          "CHEMBL207002",
          "CHEMBL207012",
          "CHEMBL207028",
          "CHEMBL207034",
          "CHEMBL2070410",
          "CHEMBL2070411",
          "CHEMBL2070412",
          "CHEMBL2070413",
          "CHEMBL2070414",
          "CHEMBL2070415",
          "CHEMBL2070416",
          "CHEMBL2070418",
          "CHEMBL2070419",
          "CHEMBL2070424",
          "CHEMBL2070426",
          "CHEMBL2070427",
          "CHEMBL2070430",
          "CHEMBL2070432",
          "CHEMBL2070433",
          "CHEMBL2070434",
          "CHEMBL2070438",
          "CHEMBL2070439",
          "CHEMBL207071",
          "CHEMBL207113",
          "CHEMBL207114",
          "CHEMBL207173",
          "CHEMBL207204",
          "CHEMBL207205",
          "CHEMBL207238",
          "CHEMBL207250",
          "CHEMBL207297",
          "CHEMBL207400",
          "CHEMBL207404",
          "CHEMBL207409",
          "CHEMBL207609",
          "CHEMBL207619",
          "CHEMBL207663",
          "CHEMBL207664",
          "CHEMBL207940",
          "CHEMBL207987",
          "CHEMBL207995",
          "CHEMBL208331",
          "CHEMBL208516",
          "CHEMBL208637",
          "CHEMBL209148",
          "CHEMBL209534",
          "CHEMBL210032",
          "CHEMBL210618",
          "CHEMBL210928",
          "CHEMBL210963",
          "CHEMBL211002",
          "CHEMBL211378",
          "CHEMBL21156",
          "CHEMBL2148053",
          "CHEMBL215152",
          "CHEMBL2152382",
          "CHEMBL215803",
          "CHEMBL2164410",
          "CHEMBL2164411",
          "CHEMBL2164412",
          "CHEMBL2164413",
          "CHEMBL2164414",
          "CHEMBL2164415",
          "CHEMBL2164416",
          "CHEMBL2164417",
          "CHEMBL2164418",
          "CHEMBL2164419",
          "CHEMBL2164420",
          "CHEMBL2164421",
          "CHEMBL2164422",
          "CHEMBL2164423",
          "CHEMBL2164424",
          "CHEMBL2164425",
          "CHEMBL2164426",
          "CHEMBL2164427",
          "CHEMBL219722",
          "CHEMBL220057",
          "CHEMBL220241",
          "CHEMBL2204532",
          "CHEMBL2205637",
          "CHEMBL2208034",
          "CHEMBL221959",
          "CHEMBL223257",
          "CHEMBL223360",
          "CHEMBL223367",
          "CHEMBL223460",
          "CHEMBL225088",
          "CHEMBL225519",
          "CHEMBL226403",
          "CHEMBL226471",
          "CHEMBL230011",
          "CHEMBL230047",
          "CHEMBL230055",
          "CHEMBL230184",
          "CHEMBL230185",
          "CHEMBL230186",
          "CHEMBL230276",
          "CHEMBL230488",
          "CHEMBL230592",
          "CHEMBL230595",
          "CHEMBL230597",
          "CHEMBL230699",
          "CHEMBL230808",
          "CHEMBL230809",
          "CHEMBL230810",
          "CHEMBL2309006",
          "CHEMBL230911",
          "CHEMBL230912",
          "CHEMBL230913",
          "CHEMBL2309609",
          "CHEMBL231013",
          "CHEMBL231036",
          "CHEMBL231037",
          "CHEMBL231108",
          "CHEMBL231126",
          "CHEMBL231129",
          "CHEMBL231210",
          "CHEMBL231211",
          "CHEMBL2312185",
          "CHEMBL2312290",
          "CHEMBL2312301",
          "CHEMBL2312303",
          "CHEMBL2312304",
          "CHEMBL2312645",
          "CHEMBL2312646",
          "CHEMBL2312649",
          "CHEMBL2312652",
          "CHEMBL2312654",
          "CHEMBL231512",
          "CHEMBL231521",
          "CHEMBL231530",
          "CHEMBL231614",
          "CHEMBL231623",
          "CHEMBL2333365",
          "CHEMBL2338333",
          "CHEMBL2338334",
          "CHEMBL2338335",
          "CHEMBL2348417",
          "CHEMBL241517",
          "CHEMBL241682",
          "CHEMBL24828",
          "CHEMBL248757",
          "CHEMBL248899",
          "CHEMBL249073",
          "CHEMBL249102",
          "CHEMBL249103",
          "CHEMBL249104",
          "CHEMBL249279",
          "CHEMBL249280",
          "CHEMBL249282",
          "CHEMBL249480",
          "CHEMBL249481",
          "CHEMBL249482",
          "CHEMBL249508",
          "CHEMBL249515",
          "CHEMBL249516",
          "CHEMBL249681",
          "CHEMBL249682",
          "CHEMBL249683",
          "CHEMBL249697",
          "CHEMBL249719",
          "CHEMBL249720",
          "CHEMBL249721",
          "CHEMBL249886",
          "CHEMBL249887",
          "CHEMBL249899",
          "CHEMBL249900",
          "CHEMBL249901",
          "CHEMBL249902",
          "CHEMBL249929",
          "CHEMBL250105",
          "CHEMBL250106",
          "CHEMBL250107",
          "CHEMBL250131",
          "CHEMBL250335",
          "CHEMBL250336",
          "CHEMBL250337",
          "CHEMBL250539",
          "CHEMBL251724",
          "CHEMBL253969",
          "CHEMBL254556",
          "CHEMBL254793",
          "CHEMBL255436",
          "CHEMBL255863",
          "CHEMBL256148",
          "CHEMBL256285",
          "CHEMBL256347",
          "CHEMBL256523",
          "CHEMBL256524",
          "CHEMBL256835",
          "CHEMBL256940",
          "CHEMBL257167",
          "CHEMBL257189",
          "CHEMBL257402",
          "CHEMBL257769",
          "CHEMBL257805",
          "CHEMBL259060",
          "CHEMBL259084",
          "CHEMBL259850",
          "CHEMBL259922",
          "CHEMBL260092",
          "CHEMBL260135",
          "CHEMBL261849",
          "CHEMBL262056",
          "CHEMBL268885",
          "CHEMBL271190",
          "CHEMBL271381",
          "CHEMBL274064",
          "CHEMBL275224",
          "CHEMBL281957",
          "CHEMBL288441",
          "CHEMBL296468",
          "CHEMBL296586",
          "CHEMBL300138",
          "CHEMBL302449",
          "CHEMBL306380",
          "CHEMBL311108",
          "CHEMBL31965",
          "CHEMBL326282",
          "CHEMBL334506",
          "CHEMBL334758",
          "CHEMBL335949",
          "CHEMBL336594",
          "CHEMBL336961",
          "CHEMBL337236",
          "CHEMBL338848",
          "CHEMBL340921",
          "CHEMBL341432",
          "CHEMBL352549",
          "CHEMBL352957",
          "CHEMBL354947",
          "CHEMBL360077",
          "CHEMBL360196",
          "CHEMBL360337",
          "CHEMBL360691",
          "CHEMBL361171",
          "CHEMBL361233",
          "CHEMBL361548",
          "CHEMBL361652",
          "CHEMBL361841",
          "CHEMBL361862",
          "CHEMBL362249",
          "CHEMBL363226",
          "CHEMBL363648",
          "CHEMBL363706",
          "CHEMBL365281",
          "CHEMBL365367",
          "CHEMBL366530",
          "CHEMBL366730",
          "CHEMBL368427",
          "CHEMBL369306",
          "CHEMBL370166",
          "CHEMBL371543",
          "CHEMBL371911",
          "CHEMBL371967",
          "CHEMBL372160",
          "CHEMBL372345",
          "CHEMBL372736",
          "CHEMBL373598",
          "CHEMBL373751",
          "CHEMBL375284",
          "CHEMBL377085",
          "CHEMBL377300",
          "CHEMBL377383",
          "CHEMBL377408",
          "CHEMBL377928",
          "CHEMBL378627",
          "CHEMBL379218",
          "CHEMBL379327",
          "CHEMBL379835",
          "CHEMBL379849",
          "CHEMBL380073",
          "CHEMBL381041",
          "CHEMBL381193",
          "CHEMBL381518",
          "CHEMBL381907",
          "CHEMBL381932",
          "CHEMBL382421",
          "CHEMBL382565",
          "CHEMBL382752",
          "CHEMBL382765",
          "CHEMBL382945",
          "CHEMBL382993",
          "CHEMBL383061",
          "CHEMBL383482",
          "CHEMBL383620",
          "CHEMBL383723",
          "CHEMBL38380",
          "CHEMBL384304",
          "CHEMBL386051",
          "CHEMBL387971",
          "CHEMBL388033",
          "CHEMBL388646",
          "CHEMBL389086",
          "CHEMBL389745",
          "CHEMBL390201",
          "CHEMBL394619",
          "CHEMBL397008",
          "CHEMBL397009",
          "CHEMBL397668",
          "CHEMBL398253",
          "CHEMBL398511",
          "CHEMBL398512",
          "CHEMBL398513",
          "CHEMBL398514",
          "CHEMBL398951",
          "CHEMBL399368",
          "CHEMBL399383",
          "CHEMBL399486",
          "CHEMBL399688",
          "CHEMBL399689",
          "CHEMBL400077",
          "CHEMBL400078",
          "CHEMBL400389",
          "CHEMBL401301",
          "CHEMBL401919",
          "CHEMBL402041",
          "CHEMBL402314",
          "CHEMBL402548",
          "CHEMBL402628",
          "CHEMBL402846",
          "CHEMBL403615",
          "CHEMBL404367",
          "CHEMBL404609",
          "CHEMBL404630",
          "CHEMBL404688",
          "CHEMBL410643",
          "CHEMBL410659",
          "CHEMBL411659",
          "CHEMBL412142",
          "CHEMBL413779",
          "CHEMBL424000",
          "CHEMBL424069",
          "CHEMBL424766",
          "CHEMBL424872",
          "CHEMBL425346",
          "CHEMBL425883",
          "CHEMBL426403",
          "CHEMBL426532",
          "CHEMBL427008",
          "CHEMBL427363",
          "CHEMBL428424",
          "CHEMBL428690",
          "CHEMBL428754",
          "CHEMBL433565",
          "CHEMBL434691",
          "CHEMBL436817",
          "CHEMBL437586",
          "CHEMBL437747",
          "CHEMBL440200",
          "CHEMBL440404",
          "CHEMBL443571",
          "CHEMBL443962",
          "CHEMBL444345",
          "CHEMBL444884",
          "CHEMBL445813",
          "CHEMBL445931",
          "CHEMBL447603",
          "CHEMBL450786",
          "CHEMBL450835",
          "CHEMBL453707",
          "CHEMBL454470",
          "CHEMBL454973",
          "CHEMBL462120",
          "CHEMBL462134",
          "CHEMBL464552",
          "CHEMBL468280",
          "CHEMBL471496",
          "CHEMBL473080",
          "CHEMBL473619",
          "CHEMBL474389",
          "CHEMBL474432",
          "CHEMBL474802",
          "CHEMBL475251",
          "CHEMBL477772",
          "CHEMBL477817",
          "CHEMBL482538",
          "CHEMBL482539",
          "CHEMBL482540",
          "CHEMBL482553",
          "CHEMBL482557",
          "CHEMBL482746",
          "CHEMBL482747",
          "CHEMBL482769",
          "CHEMBL482770",
          "CHEMBL482944",
          "CHEMBL482945",
          "CHEMBL482946",
          "CHEMBL483150",
          "CHEMBL483151",
          "CHEMBL483165",
          "CHEMBL483166",
          "CHEMBL483359",
          "CHEMBL483557",
          "CHEMBL483747",
          "CHEMBL483748",
          "CHEMBL484012",
          "CHEMBL484966",
          "CHEMBL484967",
          "CHEMBL484968",
          "CHEMBL485008",
          "CHEMBL485014",
          "CHEMBL485015",
          "CHEMBL485026",
          "CHEMBL485145",
          "CHEMBL485539",
          "CHEMBL485556",
          "CHEMBL489058",
          "CHEMBL491473",
          "CHEMBL492331",
          "CHEMBL492332",
          "CHEMBL492527",
          "CHEMBL492754",
          "CHEMBL492755",
          "CHEMBL493161",
          "CHEMBL493745",
          "CHEMBL493940",
          "CHEMBL493974",
          "CHEMBL494089",
          "CHEMBL494153",
          "CHEMBL494154",
          "CHEMBL494162",
          "CHEMBL498233",
          "CHEMBL501601",
          "CHEMBL504261",
          "CHEMBL504547",
          "CHEMBL504727",
          "CHEMBL504950",
          "CHEMBL505756",
          "CHEMBL505943",
          "CHEMBL506895",
          "CHEMBL507249",
          "CHEMBL507333",
          "CHEMBL507936",
          "CHEMBL508928",
          "CHEMBL50894",
          "CHEMBL509032",
          "CHEMBL513909",
          "CHEMBL514334",
          "CHEMBL514499",
          "CHEMBL514582",
          "CHEMBL514980",
          "CHEMBL516203",
          "CHEMBL516640",
          "CHEMBL519028",
          "CHEMBL519360",
          "CHEMBL519693",
          "CHEMBL519965",
          "CHEMBL520308",
          "CHEMBL520316",
          "CHEMBL520473",
          "CHEMBL520655",
          "CHEMBL520954",
          "CHEMBL521130",
          "CHEMBL521643",
          "CHEMBL521679",
          "CHEMBL521851",
          "CHEMBL522011",
          "CHEMBL522014",
          "CHEMBL522171",
          "CHEMBL522318",
          "CHEMBL522331",
          "CHEMBL522892",
          "CHEMBL523002",
          "CHEMBL523189",
          "CHEMBL523692",
          "CHEMBL52387",
          "CHEMBL525191",
          "CHEMBL534462",
          "CHEMBL534692",
          "CHEMBL535",
          "CHEMBL535135",
          "CHEMBL535358",
          "CHEMBL535359",
          "CHEMBL536520",
          "CHEMBL538910",
          "CHEMBL539837",
          "CHEMBL540202",
          "CHEMBL549479",
          "CHEMBL551024",
          "CHEMBL552183",
          "CHEMBL552265",
          "CHEMBL553",
          "CHEMBL554",
          "CHEMBL555017",
          "CHEMBL558038",
          "CHEMBL558512",
          "CHEMBL558752",
          "CHEMBL560708",
          "CHEMBL561066",
          "CHEMBL562971",
          "CHEMBL564829",
          "CHEMBL565076",
          "CHEMBL565347",
          "CHEMBL565348",
          "CHEMBL568881",
          "CHEMBL568882",
          "CHEMBL568904",
          "CHEMBL568922",
          "CHEMBL568984",
          "CHEMBL569011",
          "CHEMBL569330",
          "CHEMBL569331",
          "CHEMBL569550",
          "CHEMBL569580",
          "CHEMBL569589",
          "CHEMBL569718",
          "CHEMBL569813",
          "CHEMBL569814",
          "CHEMBL569820",
          "CHEMBL569821",
          "CHEMBL569998",
          "CHEMBL570036",
          "CHEMBL570046",
          "CHEMBL570048",
          "CHEMBL570264",
          "CHEMBL570266",
          "CHEMBL570267",
          "CHEMBL570276",
          "CHEMBL570699",
          "CHEMBL570700",
          "CHEMBL570923",
          "CHEMBL571354",
          "CHEMBL571355",
          "CHEMBL571368",
          "CHEMBL571910",
          "CHEMBL572002",
          "CHEMBL572003",
          "CHEMBL572043",
          "CHEMBL572878",
          "CHEMBL572881",
          "CHEMBL573339",
          "CHEMBL574588",
          "CHEMBL574613",
          "CHEMBL574646",
          "CHEMBL574738",
          "CHEMBL576085",
          "CHEMBL576108",
          "CHEMBL576681",
          "CHEMBL576887",
          "CHEMBL576982",
          "CHEMBL576989",
          "CHEMBL578061",
          "CHEMBL578181",
          "CHEMBL578601",
          "CHEMBL578608",
          "CHEMBL579008",
          "CHEMBL579389",
          "CHEMBL583144",
          "CHEMBL584094",
          "CHEMBL585943",
          "CHEMBL588573",
          "CHEMBL589338",
          "CHEMBL589339",
          "CHEMBL589540",
          "CHEMBL589569",
          "CHEMBL589808",
          "CHEMBL590109",
          "CHEMBL590515",
          "CHEMBL590516",
          "CHEMBL590598",
          "CHEMBL590713",
          "CHEMBL590767",
          "CHEMBL590783",
          "CHEMBL590901",
          "CHEMBL590921",
          "CHEMBL590961",
          "CHEMBL591174",
          "CHEMBL591200",
          "CHEMBL591245",
          "CHEMBL591246",
          "CHEMBL591256",
          "CHEMBL591387",
          "CHEMBL591764",
          "CHEMBL592002",
          "CHEMBL592892",
          "CHEMBL592893",
          "CHEMBL597754",
          "CHEMBL599224",
          "CHEMBL599428",
          "CHEMBL600028",
          "CHEMBL600637",
          "CHEMBL601077",
          "CHEMBL601078",
          "CHEMBL601079",
          "CHEMBL601080",
          "CHEMBL601719",
          "CHEMBL601727",
          "CHEMBL601921",
          "CHEMBL602316",
          "CHEMBL602534",
          "CHEMBL603140",
          "CHEMBL603405",
          "CHEMBL604712",
          "CHEMBL606245",
          "CHEMBL608154",
          "CHEMBL610730",
          "CHEMBL75267",
          "CHEMBL79004",
          "CHEMBL91829",
          "CHEMBL939",
          "CHEMBL941",
          "CHEMBL95692",
          "CHEMBL97453"
        ],
        "number_of_missing_values": "0"
      },
      {
        "data_type": "numeric",
        "index": "1",
        "is_ignore": "false",
        "is_row_identifier": "false",
        "is_target": "false",
        "name": "AMW",
        "number_of_missing_values": "0"
      },
      {
        "data_type": "numeric",
        "index": "2",
        "is_ignore": "false",
        "is_row_identifier": "false",
        "is_target": "false",
        "name": "C.",
        "number_of_missing_values": "0"
      },
      {
        "data_type": "numeric",
        "index": "3",
        "is_ignore": "false",
        "is_row_identifier": "false",
        "is_target": "false",
        "name": "H.",
        "number_of_missing_values": "0"
      },
      {
        "data_type": "numeric",
        "index": "4",
        "is_ignore": "false",
        "is_row_identifier": "false",
        "is_target": "false",
        "name": "Me",
        "number_of_missing_values": "0"
      },
      {
        "data_type": "numeric",
        "index": "5",
        "is_ignore": "false",
        "is_row_identifier": "false",
        "is_target": "false",
        "name": "Mi",
        "number_of_missing_values": "0"
      },
      {
        "data_type": "numeric",
        "index": "6",
        "is_ignore": "false",
        "is_row_identifier": "false",
        "is_target": "false",
        "name": "Mp",
        "number_of_missing_values": "0"
      },
      {
        "data_type": "numeric",
        "index": "7",
        "is_ignore": "false",
        "is_row_identifier": "false",
        "is_target": "false",
        "name": "Mv",
        "number_of_missing_values": "0"
      },
      {
        "data_type": "numeric",
        "index": "8",
        "is_ignore": "false",
        "is_row_identifier": "false",
        "is_target": "false",
        "name": "MW",
        "number_of_missing_values": "0"
      },
      {
        "data_type": "numeric",
        "index": "9",
        "is_ignore": "false",
        "is_row_identifier": "false",
        "is_target": "false",
        "name": "N.",
        "number_of_missing_values": "0"
      },
      {
        "data_type": "numeric",
        "index": "10",
        "is_ignore": "false",
        "is_row_identifier": "false",
        "is_target": "false",
        "name": "nAB",
        "number_of_missing_values": "0"
      },
      {
        "data_type": "numeric",
        "index": "11",
        "is_ignore": "false",
        "is_row_identifier": "false",
        "is_target": "false",
        "name": "nAT",
        "number_of_missing_values": "0"
      },
      {
        "data_type": "numeric",
        "index": "12",
        "is_ignore": "false",
        "is_row_identifier": "false",
        "is_target": "false",
        "name": "nB",
        "number_of_missing_values": "0"
      },
      {
        "data_type": "numeric",
        "index": "13",
        "is_ignore": "false",
        "is_row_identifier": "false",
        "is_target": "false",
        "name": "nBM",
        "number_of_missing_values": "0"
      },
      {
        "data_type": "numeric",
        "index": "14",
        "is_ignore": "false",
        "is_row_identifier": "false",
        "is_target": "false",
        "name": "nBO",
        "number_of_missing_values": "0"
      },
      {
        "data_type": "numeric",
        "index": "15",
        "is_ignore": "false",
        "is_row_identifier": "false",
        "is_target": "false",
        "name": "nBR",
        "number_of_missing_values": "0"
      },
      {
        "data_type": "numeric",
        "index": "16",
        "is_ignore": "false",
        "is_row_identifier": "false",
        "is_target": "false",
        "name": "nBT",
        "number_of_missing_values": "0"
      },
      {
        "data_type": "numeric",
        "index": "17",
        "is_ignore": "false",
        "is_row_identifier": "false",
        "is_target": "false",
        "name": "nC",
        "number_of_missing_values": "0"
      },
      {
        "data_type": "numeric",
        "index": "18",
        "is_ignore": "false",
        "is_row_identifier": "false",
        "is_target": "false",
        "name": "nCL",
        "number_of_missing_values": "0"
      },
      {
        "data_type": "numeric",
        "index": "19",
        "is_ignore": "false",
        "is_row_identifier": "false",
        "is_target": "false",
        "name": "nCsp",
        "number_of_missing_values": "0"
      },
      {
        "data_type": "numeric",
        "index": "20",
        "is_ignore": "false",
        "is_row_identifier": "false",
        "is_target": "false",
        "name": "nCsp2",
        "number_of_missing_values": "0"
      },
      {
        "data_type": "numeric",
        "index": "21",
        "is_ignore": "false",
        "is_row_identifier": "false",
        "is_target": "false",
        "name": "nCsp3",
        "number_of_missing_values": "0"
      },
      {
        "data_type": "numeric",
        "index": "22",
        "is_ignore": "false",
        "is_row_identifier": "false",
        "is_target": "false",
        "name": "nDB",
        "number_of_missing_values": "0"
      },
      {
        "data_type": "numeric",
        "index": "23",
        "is_ignore": "false",
        "is_row_identifier": "false",
        "is_target": "false",
        "name": "nF",
        "number_of_missing_values": "0"
      },
      {
        "data_type": "numeric",
        "index": "24",
        "is_ignore": "false",
        "is_row_identifier": "false",
        "is_target": "false",
        "name": "nH",
        "number_of_missing_values": "0"
      },
      {
        "data_type": "numeric",
        "index": "25",
        "is_ignore": "false",
        "is_row_identifier": "false",
        "is_target": "false",
        "name": "nHet",
        "number_of_missing_values": "0"
      },
      {
        "data_type": "numeric",
        "index": "26",
        "is_ignore": "false",
        "is_row_identifier": "false",
        "is_target": "false",
        "name": "nHM",
        "number_of_missing_values": "0"
      },
      {
        "data_type": "numeric",
        "index": "27",
        "is_ignore": "false",
        "is_row_identifier": "false",
        "is_target": "false",
        "name": "nI",
        "number_of_missing_values": "0"
      },
      {
        "data_type": "numeric",
        "index": "28",
        "is_ignore": "false",
        "is_row_identifier": "false",
        "is_target": "false",
        "name": "nN",
        "number_of_missing_values": "0"
      },
      {
        "data_type": "numeric",
        "index": "29",
        "is_ignore": "false",
        "is_row_identifier": "false",
        "is_target": "false",
        "name": "nO",
        "number_of_missing_values": "0"
      },
      {
        "data_type": "numeric",
        "index": "30",
        "is_ignore": "false",
        "is_row_identifier": "false",
        "is_target": "false",
        "name": "nP",
        "number_of_missing_values": "0"
      },
      {
        "data_type": "numeric",
        "index": "31",
        "is_ignore": "false",
        "is_row_identifier": "false",
        "is_target": "false",
        "name": "nS",
        "number_of_missing_values": "0"
      },
      {
        "data_type": "numeric",
        "index": "32",
        "is_ignore": "false",
        "is_row_identifier": "false",
        "is_target": "false",
        "name": "nSK",
        "number_of_missing_values": "0"
      },
      {
        "data_type": "numeric",
        "index": "33",
        "is_ignore": "false",
        "is_row_identifier": "false",
        "is_target": "false",
        "name": "nTB",
        "number_of_missing_values": "0"
      },
      {
        "data_type": "numeric",
        "index": "34",
        "is_ignore": "false",
        "is_row_identifier": "false",
        "is_target": "false",
        "name": "nX",
        "number_of_missing_values": "0"
      },
      {
        "data_type": "numeric",
        "index": "35",
        "is_ignore": "false",
        "is_row_identifier": "false",
        "is_target": "false",
        "name": "O.",
        "number_of_missing_values": "0"
      },
      {
        "data_type": "numeric",
        "index": "36",
        "is_ignore": "false",
        "is_row_identifier": "false",
        "is_target": "false",
        "name": "RBF",
        "number_of_missing_values": "0"
      },
      {
        "data_type": "numeric",
        "index": "37",
        "is_ignore": "false",
        "is_row_identifier": "false",
        "is_target": "false",
        "name": "RBN",
        "number_of_missing_values": "0"
      },
      {
        "data_type": "numeric",
        "index": "38",
        "is_ignore": "false",
        "is_row_identifier": "false",
        "is_target": "false",
        "name": "SCBO",
        "number_of_missing_values": "0"
      },
      {
        "data_type": "numeric",
        "index": "39",
        "is_ignore": "false",
        "is_row_identifier": "false",
        "is_target": "false",
        "name": "Se",
        "number_of_missing_values": "0"
      },
      {
        "data_type": "numeric",
        "index": "40",
        "is_ignore": "false",
        "is_row_identifier": "false",
        "is_target": "false",
        "name": "Si",
        "number_of_missing_values": "0"
      },
      {
        "data_type": "numeric",
        "index": "41",
        "is_ignore": "false",
        "is_row_identifier": "false",
        "is_target": "false",
        "name": "Sp",
        "number_of_missing_values": "0"
      },
      {
        "data_type": "numeric",
        "index": "42",
        "is_ignore": "false",
        "is_row_identifier": "false",
        "is_target": "false",
        "name": "Sv",
        "number_of_missing_values": "0"
      },
      {
        "data_type": "numeric",
        "index": "43",
        "is_ignore": "false",
        "is_row_identifier": "false",
        "is_target": "false",
        "name": "X.",
        "number_of_missing_values": "0"
      },
      {
        "data_type": "numeric",
        "index": "44",
        "is_ignore": "false",
        "is_row_identifier": "false",
        "is_target": "true",
        "name": "pXC50",
        "number_of_missing_values": "0"
      }
    ]
  }
}