"molecule_id","FCFP4_1024b1","FCFP4_1024b10","FCFP4_1024b100","FCFP4_1024b1000","FCFP4_1024b1001","FCFP4_1024b1002","FCFP4_1024b1003","FCFP4_1024b1004","FCFP4_1024b1005","FCFP4_1024b1006","FCFP4_1024b1007","FCFP4_1024b1008","FCFP4_1024b1009","FCFP4_1024b101","FCFP4_1024b1010","FCFP4_1024b1011","FCFP4_1024b1012","FCFP4_1024b1013","FCFP4_1024b1014","FCFP4_1024b1015","FCFP4_1024b1016","FCFP4_1024b1017","FCFP4_1024b1018","FCFP4_1024b1019","FCFP4_1024b102","FCFP4_1024b1020","FCFP4_1024b1021","FCFP4_1024b1022","FCFP4_1024b1023","FCFP4_1024b1024","FCFP4_1024b103","FCFP4_1024b104","FCFP4_1024b105","FCFP4_1024b106","FCFP4_1024b107","FCFP4_1024b108","FCFP4_1024b109","FCFP4_1024b11","FCFP4_1024b110","FCFP4_1024b111","FCFP4_1024b112","FCFP4_1024b113","FCFP4_1024b114","FCFP4_1024b115","FCFP4_1024b116","FCFP4_1024b117","FCFP4_1024b118","FCFP4_1024b119","FCFP4_1024b12","FCFP4_1024b120","FCFP4_1024b121","pXC50"
{1 1,35 1,52 6.097}
{0 CHEMBL328866,1 1,2 1,35 1,52 5.398}
{0 CHEMBL39,1 1,43 1,52 5.469}
{0 CHEMBL42,1 1,2 1,6 1,52 7.495}
{0 CHEMBL54,1 1,2 1,38 1,52 5}
{0 CHEMBL563848,1 1,2 1,6 1,52 5.399}
{0 CHEMBL597241,1 1,2 1,11 1,52 5.863}
{0 CHEMBL597440,1 1,2 1,11 1,52 5.208}
{0 CHEMBL597441,1 1,2 1,52 5.279}
{0 CHEMBL597476,1 1,2 1,52 5.435}
{0 CHEMBL597537,1 1,2 1,52 5.446}
{0 CHEMBL597644,1 1,2 1,11 1,52 7.77}
{0 CHEMBL597681,1 1,2 1,52 6.9}
{0 CHEMBL597687,1 1,2 1,52 5.272}
{0 CHEMBL597688,1 1,2 1,11 1,52 6.262}
{0 CHEMBL597737,1 1,2 1,52 5.424}
{0 CHEMBL597842,1 1,2 1,52 8.469}
{0 CHEMBL597843,1 1,2 1,52 6.237}
{0 CHEMBL598045,1 1,2 1,52 6.79}
{0 CHEMBL598555,1 1,2 1,52 5.279}
{0 CHEMBL598873,1 1,2 1,11 1,52 8.409}
{0 CHEMBL599590,1 1,2 1,52 5.943}
{0 CHEMBL601899,1 1,2 1,52 6.851}
{0 CHEMBL603052,1 1,2 1,11 1,52 6.613}
{0 CHEMBL604798,1 1,2 1,52 6.57}
{0 CHEMBL605573,1 1,2 1,52 5.166}
{0 CHEMBL605715,1 1,2 1,52 7.036}
{0 CHEMBL605840,1 1,2 1,4 1,52 5.279}
{0 CHEMBL605955,1 1,2 1,50 1,52 5.146}
{0 CHEMBL606254,1 1,2 1,52 5.708}
{0 CHEMBL606383,1 1,2 1,52 5.674}
{0 CHEMBL607857,1 1,2 1,52 7.77}
{0 CHEMBL608144,1 1,2 1,52 5.674}
{0 CHEMBL608726,1 1,2 1,52 5.47}
{0 CHEMBL608735,1 1,2 1,11 1,52 8.921}
{0 CHEMBL609622,1 1,2 1,52 5.277}
{0 CHEMBL610205,1 1,2 1,52 5.277}
{0 CHEMBL610212,1 1,2 1,52 5.277}
{0 CHEMBL610228,1 1,2 1,52 5.198}
{0 CHEMBL611082,1 1,2 1,52 7.886}
{0 CHEMBL611369,1 1,2 1,11 1,52 6.033}
