{
  "data_features": {
    "feature": [
      {
        "data_type": "nominal",
        "index": "0",
        "is_ignore": "false",
        "is_row_identifier": "true",
        "is_target": "false",
        "name": "molecule_id",
        "nominal_value": [
          "CHEMBL10008",
          "CHEMBL10034",
          "CHEMBL100620",
          "CHEMBL10089",
          "CHEMBL10148",
          "CHEMBL10157",
          "CHEMBL10176",
          "CHEMBL10198",
          "CHEMBL10202",
          "CHEMBL10222",
          "CHEMBL10226",
          "CHEMBL10228",
          "CHEMBL10239",
          "CHEMBL10258",
          "CHEMBL10305",
          "CHEMBL10318",
          "CHEMBL10341",
          "CHEMBL10342",
          "CHEMBL10348",
          "CHEMBL104032",
          "CHEMBL104050",
          "CHEMBL104250",
          "CHEMBL104289",
          "CHEMBL104303",
          "CHEMBL104396",
          "CHEMBL104557",
          "CHEMBL10503",
          "CHEMBL105067",
          "CHEMBL105124",
          "CHEMBL105233",
          "CHEMBL10529",
          "CHEMBL10541",
          "CHEMBL10556",
          "CHEMBL105981",
          "CHEMBL106066",
          "CHEMBL106107",
          "CHEMBL10625",
          "CHEMBL106592",
          "CHEMBL106793",
          "CHEMBL106888",
          "CHEMBL10695",
          "CHEMBL107191",
          "CHEMBL107287",
          "CHEMBL107291",
          "CHEMBL107329",
          "CHEMBL10756",
          "CHEMBL107656",
          "CHEMBL107820",
          "CHEMBL1078411",
          "CHEMBL107869",
          "CHEMBL107936",
          "CHEMBL107966",
          "CHEMBL107993",
          "CHEMBL1083499",
          "CHEMBL108477",
          "CHEMBL1084908",
          "CHEMBL108504",
          "CHEMBL108622",
          "CHEMBL108657",
          "CHEMBL10867",
          "CHEMBL10869",
          "CHEMBL108783",
          "CHEMBL108815",
          "CHEMBL1088332",
          "CHEMBL108873",
          "CHEMBL109234",
          "CHEMBL109306",
          "CHEMBL109396",
          "CHEMBL109411",
          "CHEMBL109434",
          "CHEMBL109483",
          "CHEMBL109488",
          "CHEMBL10975",
          "CHEMBL109769",
          "CHEMBL109852",
          "CHEMBL109949",
          "CHEMBL110125",
          "CHEMBL110174",
          "CHEMBL110241",
          "CHEMBL110267",
          "CHEMBL11032",
          "CHEMBL110344",
          "CHEMBL110364",
          "CHEMBL110378",
          "CHEMBL110400",
          "CHEMBL110443",
          "CHEMBL110559",
          "CHEMBL110685",
          "CHEMBL11070",
          "CHEMBL110828",
          "CHEMBL11084",
          "CHEMBL11098",
          "CHEMBL11099",
          "CHEMBL111029",
          "CHEMBL11113",
          "CHEMBL111174",
          "CHEMBL111419",
          "CHEMBL11144",
          "CHEMBL111770",
          "CHEMBL111852",
          "CHEMBL111955",
          "CHEMBL112119",
          "CHEMBL112205",
          "CHEMBL112335",
          "CHEMBL112410",
          "CHEMBL11246",
          "CHEMBL112514",
          "CHEMBL112575",
          "CHEMBL11264",
          "CHEMBL112880",
          "CHEMBL112924",
          "CHEMBL112971",
          "CHEMBL113014",
          "CHEMBL113110",
          "CHEMBL113129",
          "CHEMBL113132",
          "CHEMBL113148",
          "CHEMBL113171",
          "CHEMBL113187",
          "CHEMBL113261",
          "CHEMBL113321",
          "CHEMBL11334",
          "CHEMBL11335",
          "CHEMBL113358",
          "CHEMBL11336",
          "CHEMBL113409",
          "CHEMBL11347",
          "CHEMBL113688",
          "CHEMBL113725",
          "CHEMBL11383",
          "CHEMBL113905",
          "CHEMBL11391",
          "CHEMBL11398",
          "CHEMBL114017",
          "CHEMBL114024",
          "CHEMBL11403",
          "CHEMBL11428",
          "CHEMBL114868",
          "CHEMBL114992",
          "CHEMBL11558",
          "CHEMBL115817",
          "CHEMBL115827",
          "CHEMBL1162477",
          "CHEMBL116606",
          "CHEMBL1172107",
          "CHEMBL1172265",
          "CHEMBL1172305",
          "CHEMBL1172306",
          "CHEMBL1172307",
          "CHEMBL1172443",
          "CHEMBL11758",
          "CHEMBL117815",
          "CHEMBL118176",
          "CHEMBL11874",
          "CHEMBL11913",
          "CHEMBL12051",
          "CHEMBL12082",
          "CHEMBL123153",
          "CHEMBL123475",
          "CHEMBL1237168",
          "CHEMBL1241348",
          "CHEMBL1243072",
          "CHEMBL125796",
          "CHEMBL126546",
          "CHEMBL127027",
          "CHEMBL127085",
          "CHEMBL12738",
          "CHEMBL127615",
          "CHEMBL127714",
          "CHEMBL127780",
          "CHEMBL128410",
          "CHEMBL128415",
          "CHEMBL128499",
          "CHEMBL128553",
          "CHEMBL129496",
          "CHEMBL130002",
          "CHEMBL130966",
          "CHEMBL131107",
          "CHEMBL131548",
          "CHEMBL131580",
          "CHEMBL13684",
          "CHEMBL13740",
          "CHEMBL13753",
          "CHEMBL13804",
          "CHEMBL138259",
          "CHEMBL13863",
          "CHEMBL138869",
          "CHEMBL13902",
          "CHEMBL13923",
          "CHEMBL13937",
          "CHEMBL13954",
          "CHEMBL139568",
          "CHEMBL140639",
          "CHEMBL14064",
          "CHEMBL140691",
          "CHEMBL140716",
          "CHEMBL140763",
          "CHEMBL140865",
          "CHEMBL14115",
          "CHEMBL14121",
          "CHEMBL14128",
          "CHEMBL141329",
          "CHEMBL141377",
          "CHEMBL141423",
          "CHEMBL141517",
          "CHEMBL141553",
          "CHEMBL14165",
          "CHEMBL141660",
          "CHEMBL141663",
          "CHEMBL141707",
          "CHEMBL14176",
          "CHEMBL14177",
          "CHEMBL141877",
          "CHEMBL141930",
          "CHEMBL142080",
          "CHEMBL142099",
          "CHEMBL142100",
          "CHEMBL142101",
          "CHEMBL142156",
          "CHEMBL142192",
          "CHEMBL14222",
          "CHEMBL14223",
          "CHEMBL142288",
          "CHEMBL142294",
          "CHEMBL142397",
          "CHEMBL142399",
          "CHEMBL142526",
          "CHEMBL142529",
          "CHEMBL142534",
          "CHEMBL142555",
          "CHEMBL142579",
          "CHEMBL142622",
          "CHEMBL142623",
          "CHEMBL142640",
          "CHEMBL142689",
          "CHEMBL142779",
          "CHEMBL142781",
          "CHEMBL14293",
          "CHEMBL142960",
          "CHEMBL142970",
          "CHEMBL143004",
          "CHEMBL143049",
          "CHEMBL143065",
          "CHEMBL143136",
          "CHEMBL143215",
          "CHEMBL143333",
          "CHEMBL143365",
          "CHEMBL143417",
          "CHEMBL143425",
          "CHEMBL143431",
          "CHEMBL143792",
          "CHEMBL143793",
          "CHEMBL143819",
          "CHEMBL143858",
          "CHEMBL143922",
          "CHEMBL144108",
          "CHEMBL144342",
          "CHEMBL144895",
          "CHEMBL144900",
          "CHEMBL144906",
          "CHEMBL144915",
          "CHEMBL144918",
          "CHEMBL144919",
          "CHEMBL144955",
          "CHEMBL144986",
          "CHEMBL144995",
          "CHEMBL145002",
          "CHEMBL145012",
          "CHEMBL145018",
          "CHEMBL145019",
          "CHEMBL145020",
          "CHEMBL145021",
          "CHEMBL145035",
          "CHEMBL145055",
          "CHEMBL145057",
          "CHEMBL145096",
          "CHEMBL145097",
          "CHEMBL145107",
          "CHEMBL145149",
          "CHEMBL145152",
          "CHEMBL145153",
          "CHEMBL145157",
          "CHEMBL14516",
          "CHEMBL145185",
          "CHEMBL145207",
          "CHEMBL145214",
          "CHEMBL145252",
          "CHEMBL145271",
          "CHEMBL145285",
          "CHEMBL145309",
          "CHEMBL145342",
          "CHEMBL145348",
          "CHEMBL145351",
          "CHEMBL145365",
          "CHEMBL145366",
          "CHEMBL145367",
          "CHEMBL145387",
          "CHEMBL145448",
          "CHEMBL145465",
          "CHEMBL145471",
          "CHEMBL145492",
          "CHEMBL145505",
          "CHEMBL145523",
          "CHEMBL145540",
          "CHEMBL145550",
          "CHEMBL145565",
          "CHEMBL145568",
          "CHEMBL145581",
          "CHEMBL145583",
          "CHEMBL145592",
          "CHEMBL145600",
          "CHEMBL145601",
          "CHEMBL145618",
          "CHEMBL145678",
          "CHEMBL145690",
          "CHEMBL145694",
          "CHEMBL145695",
          "CHEMBL145718",
          "CHEMBL145724",
          "CHEMBL145729",
          "CHEMBL145738",
          "CHEMBL145749",
          "CHEMBL145750",
          "CHEMBL145754",
          "CHEMBL145762",
          "CHEMBL145765",
          "CHEMBL145774",
          "CHEMBL145777",
          "CHEMBL145782",
          "CHEMBL145791",
          "CHEMBL145809",
          "CHEMBL145953",
          "CHEMBL146003",
          "CHEMBL146004",
          "CHEMBL146010",
          "CHEMBL146219",
          "CHEMBL14631",
          "CHEMBL146327",
          "CHEMBL146329",
          "CHEMBL146330",
          "CHEMBL146381",
          "CHEMBL147676",
          "CHEMBL150384",
          "CHEMBL150472",
          "CHEMBL151065",
          "CHEMBL151119",
          "CHEMBL151182",
          "CHEMBL151907",
          "CHEMBL152211",
          "CHEMBL152303",
          "CHEMBL152341",
          "CHEMBL152415",
          "CHEMBL152728",
          "CHEMBL152815",
          "CHEMBL152817",
          "CHEMBL152864",
          "CHEMBL153315",
          "CHEMBL153392",
          "CHEMBL153631",
          "CHEMBL153687",
          "CHEMBL153784",
          "CHEMBL157261",
          "CHEMBL158216",
          "CHEMBL158470",
          "CHEMBL158647",
          "CHEMBL158735",
          "CHEMBL158824",
          "CHEMBL159009",
          "CHEMBL159116",
          "CHEMBL160154",
          "CHEMBL160206",
          "CHEMBL160256",
          "CHEMBL160320",
          "CHEMBL160365",
          "CHEMBL160417",
          "CHEMBL160570",
          "CHEMBL160660",
          "CHEMBL160679",
          "CHEMBL160737",
          "CHEMBL160948",
          "CHEMBL162863",
          "CHEMBL1631754",
          "CHEMBL163414",
          "CHEMBL164352",
          "CHEMBL165525",
          "CHEMBL165759",
          "CHEMBL166401",
          "CHEMBL166483",
          "CHEMBL166598",
          "CHEMBL166859",
          "CHEMBL167824",
          "CHEMBL168120",
          "CHEMBL168607",
          "CHEMBL168761",
          "CHEMBL168834",
          "CHEMBL169076",
          "CHEMBL169268",
          "CHEMBL169750",
          "CHEMBL169842",
          "CHEMBL169887",
          "CHEMBL171086",
          "CHEMBL171288",
          "CHEMBL172183",
          "CHEMBL172609",
          "CHEMBL172713",
          "CHEMBL173359",
          "CHEMBL173410",
          "CHEMBL173591",
          "CHEMBL173994",
          "CHEMBL174215",
          "CHEMBL174436",
          "CHEMBL174504",
          "CHEMBL174548",
          "CHEMBL174587",
          "CHEMBL174802",
          "CHEMBL175253",
          "CHEMBL175259",
          "CHEMBL176397",
          "CHEMBL176540",
          "CHEMBL176616",
          "CHEMBL176627",
          "CHEMBL176985",
          "CHEMBL1806518",
          "CHEMBL1808476",
          "CHEMBL1808477",
          "CHEMBL1808478",
          "CHEMBL1808479",
          "CHEMBL1808481",
          "CHEMBL1808482",
          "CHEMBL1808483",
          "CHEMBL1808485",
          "CHEMBL1808486",
          "CHEMBL1808487",
          "CHEMBL1808488",
          "CHEMBL1808490",
          "CHEMBL1808491",
          "CHEMBL1808492",
          "CHEMBL1808493",
          "CHEMBL1808494",
          "CHEMBL1808495",
          "CHEMBL1808496",
          "CHEMBL1808497",
          "CHEMBL1808499",
          "CHEMBL1808500",
          "CHEMBL1808503",
          "CHEMBL1808504",
          "CHEMBL1808505",
          "CHEMBL1808507",
          "CHEMBL1808508",
          "CHEMBL1808512",
          "CHEMBL1808513",
          "CHEMBL1808514",
          "CHEMBL1808515",
          "CHEMBL1808516",
          "CHEMBL1808518",
          "CHEMBL1808519",
          "CHEMBL1808520",
          "CHEMBL1808521",
          "CHEMBL1808522",
          "CHEMBL1808523",
          "CHEMBL1808524",
          "CHEMBL1808525",
          "CHEMBL1808526",
          "CHEMBL1808527",
          "CHEMBL1808528",
          "CHEMBL1808529",
          "CHEMBL1808530",
          "CHEMBL1808531",
          "CHEMBL1808532",
          "CHEMBL1808533",
          "CHEMBL1808534",
          "CHEMBL1808535",
          "CHEMBL1808536",
          "CHEMBL1808545",
          "CHEMBL1808547",
          "CHEMBL1808549",
          "CHEMBL1835010",
          "CHEMBL1835011",
          "CHEMBL1835012",
          "CHEMBL189159",
          "CHEMBL190503",
          "CHEMBL20216",
          "CHEMBL2029554",
          "CHEMBL2029556",
          "CHEMBL2029557",
          "CHEMBL2029559",
          "CHEMBL203723",
          "CHEMBL2114137",
          "CHEMBL2114195",
          "CHEMBL2115202",
          "CHEMBL2115520",
          "CHEMBL2115521",
          "CHEMBL2115522",
          "CHEMBL2115523",
          "CHEMBL2115561",
          "CHEMBL2115562",
          "CHEMBL2115563",
          "CHEMBL212723",
          "CHEMBL212852",
          "CHEMBL213144",
          "CHEMBL213158",
          "CHEMBL21370",
          "CHEMBL213783",
          "CHEMBL215405",
          "CHEMBL215448",
          "CHEMBL215927",
          "CHEMBL216418",
          "CHEMBL216442",
          "CHEMBL216818",
          "CHEMBL21745",
          "CHEMBL217744",
          "CHEMBL2182011",
          "CHEMBL2182012",
          "CHEMBL2182013",
          "CHEMBL2182014",
          "CHEMBL2182016",
          "CHEMBL2182017",
          "CHEMBL2182018",
          "CHEMBL2182019",
          "CHEMBL2182020",
          "CHEMBL218394",
          "CHEMBL2205678",
          "CHEMBL222385",
          "CHEMBL22401",
          "CHEMBL227222",
          "CHEMBL22757",
          "CHEMBL22927",
          "CHEMBL2304292",
          "CHEMBL2304294",
          "CHEMBL2304295",
          "CHEMBL2304296",
          "CHEMBL2304304",
          "CHEMBL23080",
          "CHEMBL23100",
          "CHEMBL23104",
          "CHEMBL231813",
          "CHEMBL23234",
          "CHEMBL23263",
          "CHEMBL2338549",
          "CHEMBL2338550",
          "CHEMBL2338551",
          "CHEMBL2338552",
          "CHEMBL2338553",
          "CHEMBL2338554",
          "CHEMBL23643",
          "CHEMBL23952",
          "CHEMBL24058",
          "CHEMBL242358",
          "CHEMBL242392",
          "CHEMBL24260",
          "CHEMBL242998",
          "CHEMBL24312",
          "CHEMBL243418",
          "CHEMBL243419",
          "CHEMBL243420",
          "CHEMBL243421",
          "CHEMBL243422",
          "CHEMBL243437",
          "CHEMBL243638",
          "CHEMBL243645",
          "CHEMBL244072",
          "CHEMBL24449",
          "CHEMBL24450",
          "CHEMBL244726",
          "CHEMBL244908",
          "CHEMBL244909",
          "CHEMBL244917",
          "CHEMBL244918",
          "CHEMBL244919",
          "CHEMBL244920",
          "CHEMBL244921",
          "CHEMBL244939",
          "CHEMBL244940",
          "CHEMBL245163",
          "CHEMBL245164",
          "CHEMBL24604",
          "CHEMBL24983",
          "CHEMBL252952",
          "CHEMBL254314",
          "CHEMBL25490",
          "CHEMBL256466",
          "CHEMBL257889",
          "CHEMBL25892",
          "CHEMBL260190",
          "CHEMBL261166",
          "CHEMBL262218",
          "CHEMBL26223",
          "CHEMBL262266",
          "CHEMBL26233",
          "CHEMBL262398",
          "CHEMBL262516",
          "CHEMBL262709",
          "CHEMBL262727",
          "CHEMBL262956",
          "CHEMBL263736",
          "CHEMBL263927",
          "CHEMBL264180",
          "CHEMBL264237",
          "CHEMBL26499",
          "CHEMBL265335",
          "CHEMBL26571",
          "CHEMBL265769",
          "CHEMBL265780",
          "CHEMBL266704",
          "CHEMBL267081",
          "CHEMBL267093",
          "CHEMBL267800",
          "CHEMBL267968",
          "CHEMBL268005",
          "CHEMBL268343",
          "CHEMBL268763",
          "CHEMBL268957",
          "CHEMBL269138",
          "CHEMBL269181",
          "CHEMBL269223",
          "CHEMBL269448",
          "CHEMBL269669",
          "CHEMBL270515",
          "CHEMBL270651",
          "CHEMBL270680",
          "CHEMBL270993",
          "CHEMBL271819",
          "CHEMBL271820",
          "CHEMBL272394",
          "CHEMBL272413",
          "CHEMBL273449",
          "CHEMBL273486",
          "CHEMBL273612",
          "CHEMBL273668",
          "CHEMBL273818",
          "CHEMBL273849",
          "CHEMBL273981",
          "CHEMBL274085",
          "CHEMBL274123",
          "CHEMBL274347",
          "CHEMBL274567",
          "CHEMBL274582",
          "CHEMBL274618",
          "CHEMBL274674",
          "CHEMBL274780",
          "CHEMBL274788",
          "CHEMBL275043",
          "CHEMBL275340",
          "CHEMBL275455",
          "CHEMBL275558",
          "CHEMBL275723",
          "CHEMBL275765",
          "CHEMBL276166",
          "CHEMBL276174",
          "CHEMBL276181",
          "CHEMBL276182",
          "CHEMBL276307",
          "CHEMBL276680",
          "CHEMBL276823",
          "CHEMBL276827",
          "CHEMBL277194",
          "CHEMBL277401",
          "CHEMBL277672",
          "CHEMBL277905",
          "CHEMBL278134",
          "CHEMBL278222",
          "CHEMBL278385",
          "CHEMBL278682",
          "CHEMBL278836",
          "CHEMBL278912",
          "CHEMBL279040",
          "CHEMBL279250",
          "CHEMBL279296",
          "CHEMBL279704",
          "CHEMBL279941",
          "CHEMBL280319",
          "CHEMBL280916",
          "CHEMBL281401",
          "CHEMBL281518",
          "CHEMBL281672",
          "CHEMBL281765",
          "CHEMBL281894",
          "CHEMBL281912",
          "CHEMBL282602",
          "CHEMBL282694",
          "CHEMBL282705",
          "CHEMBL282947",
          "CHEMBL282967",
          "CHEMBL283168",
          "CHEMBL284205",
          "CHEMBL284433",
          "CHEMBL284874",
          "CHEMBL284984",
          "CHEMBL285231",
          "CHEMBL285585",
          "CHEMBL285920",
          "CHEMBL286322",
          "CHEMBL287467",
          "CHEMBL287630",
          "CHEMBL288236",
          "CHEMBL288700",
          "CHEMBL288793",
          "CHEMBL288810",
          "CHEMBL289034",
          "CHEMBL289277",
          "CHEMBL290189",
          "CHEMBL290748",
          "CHEMBL290774",
          "CHEMBL291271",
          "CHEMBL291309",
          "CHEMBL291484",
          "CHEMBL291766",
          "CHEMBL292141",
          "CHEMBL292348",
          "CHEMBL293062",
          "CHEMBL293138",
          "CHEMBL293356",
          "CHEMBL293493",
          "CHEMBL293497",
          "CHEMBL293558",
          "CHEMBL293707",
          "CHEMBL293745",
          "CHEMBL293757",
          "CHEMBL293809",
          "CHEMBL294652",
          "CHEMBL294671",
          "CHEMBL294771",
          "CHEMBL294886",
          "CHEMBL295221",
          "CHEMBL296159",
          "CHEMBL296620",
          "CHEMBL296771",
          "CHEMBL297154",
          "CHEMBL297453",
          "CHEMBL297668",
          "CHEMBL298107",
          "CHEMBL298276",
          "CHEMBL298402",
          "CHEMBL298602",
          "CHEMBL298605",
          "CHEMBL298959",
          "CHEMBL299028",
          "CHEMBL299236",
          "CHEMBL299381",
          "CHEMBL299656",
          "CHEMBL299730",
          "CHEMBL299784",
          "CHEMBL299880",
          "CHEMBL300307",
          "CHEMBL300333",
          "CHEMBL300336",
          "CHEMBL300430",
          "CHEMBL300447",
          "CHEMBL300466",
          "CHEMBL300557",
          "CHEMBL301671",
          "CHEMBL301691",
          "CHEMBL301736",
          "CHEMBL301744",
          "CHEMBL301825",
          "CHEMBL302123",
          "CHEMBL302630",
          "CHEMBL302961",
          "CHEMBL303165",
          "CHEMBL303493",
          "CHEMBL30356",
          "CHEMBL30401",
          "CHEMBL304114",
          "CHEMBL304354",
          "CHEMBL305259",
          "CHEMBL305272",
          "CHEMBL305625",
          "CHEMBL305841",
          "CHEMBL306105",
          "CHEMBL306202",
          "CHEMBL306203",
          "CHEMBL306251",
          "CHEMBL306508",
          "CHEMBL306533",
          "CHEMBL306565",
          "CHEMBL306676",
          "CHEMBL306859",
          "CHEMBL306877",
          "CHEMBL306927",
          "CHEMBL307200",
          "CHEMBL307225",
          "CHEMBL307315",
          "CHEMBL307418",
          "CHEMBL307509",
          "CHEMBL307622",
          "CHEMBL307886",
          "CHEMBL308061",
          "CHEMBL308161",
          "CHEMBL308313",
          "CHEMBL308355",
          "CHEMBL308415",
          "CHEMBL308519",
          "CHEMBL308783",
          "CHEMBL308881",
          "CHEMBL309197",
          "CHEMBL309322",
          "CHEMBL309326",
          "CHEMBL309332",
          "CHEMBL309389",
          "CHEMBL309412",
          "CHEMBL309522",
          "CHEMBL30957",
          "CHEMBL309645",
          "CHEMBL30969",
          "CHEMBL309710",
          "CHEMBL309897",
          "CHEMBL310133",
          "CHEMBL310215",
          "CHEMBL310354",
          "CHEMBL310533",
          "CHEMBL310574",
          "CHEMBL310583",
          "CHEMBL310738",
          "CHEMBL310781",
          "CHEMBL310800",
          "CHEMBL310871",
          "CHEMBL311124",
          "CHEMBL311321",
          "CHEMBL311340",
          "CHEMBL311390",
          "CHEMBL311459",
          "CHEMBL311756",
          "CHEMBL312015",
          "CHEMBL312174",
          "CHEMBL312327",
          "CHEMBL312438",
          "CHEMBL312554",
          "CHEMBL31272",
          "CHEMBL313299",
          "CHEMBL313480",
          "CHEMBL313537",
          "CHEMBL31363",
          "CHEMBL313667",
          "CHEMBL313683",
          "CHEMBL313754",
          "CHEMBL313838",
          "CHEMBL313991",
          "CHEMBL314155",
          "CHEMBL314218",
          "CHEMBL314222",
          "CHEMBL314279",
          "CHEMBL314476",
          "CHEMBL314644",
          "CHEMBL314721",
          "CHEMBL314821",
          "CHEMBL314845",
          "CHEMBL314873",
          "CHEMBL314928",
          "CHEMBL315196",
          "CHEMBL315377",
          "CHEMBL315423",
          "CHEMBL315626",
          "CHEMBL315690",
          "CHEMBL315714",
          "CHEMBL315737",
          "CHEMBL315829",
          "CHEMBL31788",
          "CHEMBL318052",
          "CHEMBL318067",
          "CHEMBL318482",
          "CHEMBL319173",
          "CHEMBL319723",
          "CHEMBL320814",
          "CHEMBL320942",
          "CHEMBL321296",
          "CHEMBL32166",
          "CHEMBL32171",
          "CHEMBL321817",
          "CHEMBL322104",
          "CHEMBL322177",
          "CHEMBL322360",
          "CHEMBL322933",
          "CHEMBL323030",
          "CHEMBL323231",
          "CHEMBL323411",
          "CHEMBL323443",
          "CHEMBL323545",
          "CHEMBL323694",
          "CHEMBL324207",
          "CHEMBL324343",
          "CHEMBL324587",
          "CHEMBL32486",
          "CHEMBL324983",
          "CHEMBL325041",
          "CHEMBL325098",
          "CHEMBL325154",
          "CHEMBL325155",
          "CHEMBL325234",
          "CHEMBL325503",
          "CHEMBL32559",
          "CHEMBL325713",
          "CHEMBL325756",
          "CHEMBL325870",
          "CHEMBL325873",
          "CHEMBL326073",
          "CHEMBL326136",
          "CHEMBL326238",
          "CHEMBL326478",
          "CHEMBL326616",
          "CHEMBL326695",
          "CHEMBL326818",
          "CHEMBL326847",
          "CHEMBL326848",
          "CHEMBL32918",
          "CHEMBL329376",
          "CHEMBL330647",
          "CHEMBL331243",
          "CHEMBL331275",
          "CHEMBL331287",
          "CHEMBL333152",
          "CHEMBL333759",
          "CHEMBL333835",
          "CHEMBL334936",
          "CHEMBL334978",
          "CHEMBL335233",
          "CHEMBL335798",
          "CHEMBL335981",
          "CHEMBL336132",
          "CHEMBL336779",
          "CHEMBL337931",
          "CHEMBL337968",
          "CHEMBL338651",
          "CHEMBL339307",
          "CHEMBL339650",
          "CHEMBL340288",
          "CHEMBL340627",
          "CHEMBL340818",
          "CHEMBL341627",
          "CHEMBL341885",
          "CHEMBL341889",
          "CHEMBL341905",
          "CHEMBL342170",
          "CHEMBL342325",
          "CHEMBL342379",
          "CHEMBL342522",
          "CHEMBL342545",
          "CHEMBL342660",
          "CHEMBL342725",
          "CHEMBL343003",
          "CHEMBL343004",
          "CHEMBL343202",
          "CHEMBL343250",
          "CHEMBL343281",
          "CHEMBL343478",
          "CHEMBL343479",
          "CHEMBL343599",
          "CHEMBL343643",
          "CHEMBL343675",
          "CHEMBL343943",
          "CHEMBL344066",
          "CHEMBL344451",
          "CHEMBL344560",
          "CHEMBL344567",
          "CHEMBL344690",
          "CHEMBL344750",
          "CHEMBL344768",
          "CHEMBL344769",
          "CHEMBL344940",
          "CHEMBL344969",
          "CHEMBL344981",
          "CHEMBL345261",
          "CHEMBL345477",
          "CHEMBL345509",
          "CHEMBL345616",
          "CHEMBL345764",
          "CHEMBL345792",
          "CHEMBL346051",
          "CHEMBL346156",
          "CHEMBL346157",
          "CHEMBL346381",
          "CHEMBL346534",
          "CHEMBL347069",
          "CHEMBL347331",
          "CHEMBL347458",
          "CHEMBL347652",
          "CHEMBL347760",
          "CHEMBL348342",
          "CHEMBL34840",
          "CHEMBL348882",
          "CHEMBL348965",
          "CHEMBL351784",
          "CHEMBL352244",
          "CHEMBL352305",
          "CHEMBL353441",
          "CHEMBL35353",
          "CHEMBL354199",
          "CHEMBL354420",
          "CHEMBL354832",
          "CHEMBL354883",
          "CHEMBL355117",
          "CHEMBL355464",
          "CHEMBL355477",
          "CHEMBL355765",
          "CHEMBL355937",
          "CHEMBL356043",
          "CHEMBL356045",
          "CHEMBL356120",
          "CHEMBL356241",
          "CHEMBL356307",
          "CHEMBL356316",
          "CHEMBL356337",
          "CHEMBL356390",
          "CHEMBL356448",
          "CHEMBL356573",
          "CHEMBL356586",
          "CHEMBL356732",
          "CHEMBL356825",
          "CHEMBL356913",
          "CHEMBL356962",
          "CHEMBL357201",
          "CHEMBL357238",
          "CHEMBL357379",
          "CHEMBL357464",
          "CHEMBL357495",
          "CHEMBL357512",
          "CHEMBL35762",
          "CHEMBL357688",
          "CHEMBL357694",
          "CHEMBL35797",
          "CHEMBL358083",
          "CHEMBL358088",
          "CHEMBL358112",
          "CHEMBL358686",
          "CHEMBL358737",
          "CHEMBL358787",
          "CHEMBL358927",
          "CHEMBL358943",
          "CHEMBL358949",
          "CHEMBL358987",
          "CHEMBL359047",
          "CHEMBL36010",
          "CHEMBL36353",
          "CHEMBL366540",
          "CHEMBL367300",
          "CHEMBL367319",
          "CHEMBL367631",
          "CHEMBL368630",
          "CHEMBL37637",
          "CHEMBL378575",
          "CHEMBL383257",
          "CHEMBL383880",
          "CHEMBL383943",
          "CHEMBL38479",
          "CHEMBL385442",
          "CHEMBL385899",
          "CHEMBL386313",
          "CHEMBL386621",
          "CHEMBL38674",
          "CHEMBL387576",
          "CHEMBL387791",
          "CHEMBL388239",
          "CHEMBL389383",
          "CHEMBL391608",
          "CHEMBL39165",
          "CHEMBL39204",
          "CHEMBL396796",
          "CHEMBL397270",
          "CHEMBL398167",
          "CHEMBL398168",
          "CHEMBL398726",
          "CHEMBL401731",
          "CHEMBL401765",
          "CHEMBL40192",
          "CHEMBL40270",
          "CHEMBL40281",
          "CHEMBL40292",
          "CHEMBL403098",
          "CHEMBL403896",
          "CHEMBL404813",
          "CHEMBL404871",
          "CHEMBL404910",
          "CHEMBL405229",
          "CHEMBL405664",
          "CHEMBL405979",
          "CHEMBL406129",
          "CHEMBL406200",
          "CHEMBL406492",
          "CHEMBL406740",
          "CHEMBL40805",
          "CHEMBL408130",
          "CHEMBL40840",
          "CHEMBL40849",
          "CHEMBL40861",
          "CHEMBL408621",
          "CHEMBL40878",
          "CHEMBL40884",
          "CHEMBL41178",
          "CHEMBL412744",
          "CHEMBL412884",
          "CHEMBL413150",
          "CHEMBL41317",
          "CHEMBL41327",
          "CHEMBL41423",
          "CHEMBL41504",
          "CHEMBL41525",
          "CHEMBL41539",
          "CHEMBL415972",
          "CHEMBL416154",
          "CHEMBL416159",
          "CHEMBL416614",
          "CHEMBL416849",
          "CHEMBL417289",
          "CHEMBL417303",
          "CHEMBL417374",
          "CHEMBL417934",
          "CHEMBL417935",
          "CHEMBL417974",
          "CHEMBL418117",
          "CHEMBL418707",
          "CHEMBL41874",
          "CHEMBL41881",
          "CHEMBL418822",
          "CHEMBL418841",
          "CHEMBL418925",
          "CHEMBL41902",
          "CHEMBL419567",
          "CHEMBL419800",
          "CHEMBL419820",
          "CHEMBL419918",
          "CHEMBL419985",
          "CHEMBL420206",
          "CHEMBL420409",
          "CHEMBL420595",
          "CHEMBL421162",
          "CHEMBL421718",
          "CHEMBL422298",
          "CHEMBL422356",
          "CHEMBL422472",
          "CHEMBL422484",
          "CHEMBL422507",
          "CHEMBL422675",
          "CHEMBL422885",
          "CHEMBL42302",
          "CHEMBL423067",
          "CHEMBL423733",
          "CHEMBL424111",
          "CHEMBL424148",
          "CHEMBL424495",
          "CHEMBL424550",
          "CHEMBL424620",
          "CHEMBL424770",
          "CHEMBL42624",
          "CHEMBL426772",
          "CHEMBL427421",
          "CHEMBL428848",
          "CHEMBL429359",
          "CHEMBL429563",
          "CHEMBL430157",
          "CHEMBL430193",
          "CHEMBL430432",
          "CHEMBL430991",
          "CHEMBL430994",
          "CHEMBL431207",
          "CHEMBL431246",
          "CHEMBL431591",
          "CHEMBL43177",
          "CHEMBL431864",
          "CHEMBL432049",
          "CHEMBL432173",
          "CHEMBL432442",
          "CHEMBL432539",
          "CHEMBL432765",
          "CHEMBL432890",
          "CHEMBL432959",
          "CHEMBL432961",
          "CHEMBL433040",
          "CHEMBL433135",
          "CHEMBL433142",
          "CHEMBL433932",
          "CHEMBL434320",
          "CHEMBL43457",
          "CHEMBL435213",
          "CHEMBL435348",
          "CHEMBL435413",
          "CHEMBL435611",
          "CHEMBL435649",
          "CHEMBL435666",
          "CHEMBL43576",
          "CHEMBL435774",
          "CHEMBL436191",
          "CHEMBL436267",
          "CHEMBL437538",
          "CHEMBL438709",
          "CHEMBL439625",
          "CHEMBL43983",
          "CHEMBL440290",
          "CHEMBL440309",
          "CHEMBL44123",
          "CHEMBL44247",
          "CHEMBL442524",
          "CHEMBL443537",
          "CHEMBL443640",
          "CHEMBL443745",
          "CHEMBL443848",
          "CHEMBL444081",
          "CHEMBL444082",
          "CHEMBL445912",
          "CHEMBL446371",
          "CHEMBL447012",
          "CHEMBL450273",
          "CHEMBL450997",
          "CHEMBL457155",
          "CHEMBL459683",
          "CHEMBL459684",
          "CHEMBL461945",
          "CHEMBL461946",
          "CHEMBL47394",
          "CHEMBL478737",
          "CHEMBL48550",
          "CHEMBL48609",
          "CHEMBL48654",
          "CHEMBL49258",
          "CHEMBL49333",
          "CHEMBL49425",
          "CHEMBL49750",
          "CHEMBL49751",
          "CHEMBL499411",
          "CHEMBL49955",
          "CHEMBL50101",
          "CHEMBL501132",
          "CHEMBL503392",
          "CHEMBL50526",
          "CHEMBL50667",
          "CHEMBL506966",
          "CHEMBL50803",
          "CHEMBL50830",
          "CHEMBL50974",
          "CHEMBL512569",
          "CHEMBL512758",
          "CHEMBL513281",
          "CHEMBL51377",
          "CHEMBL515494",
          "CHEMBL516292",
          "CHEMBL51649",
          "CHEMBL518500",
          "CHEMBL52118",
          "CHEMBL52573",
          "CHEMBL534687",
          "CHEMBL53523",
          "CHEMBL538101",
          "CHEMBL538373",
          "CHEMBL538435",
          "CHEMBL538776",
          "CHEMBL542119",
          "CHEMBL542128",
          "CHEMBL542949",
          "CHEMBL543416",
          "CHEMBL543652",
          "CHEMBL543841",
          "CHEMBL544444",
          "CHEMBL54522",
          "CHEMBL54524",
          "CHEMBL545554",
          "CHEMBL54748",
          "CHEMBL549582",
          "CHEMBL549643",
          "CHEMBL549709",
          "CHEMBL550113",
          "CHEMBL550399",
          "CHEMBL55087",
          "CHEMBL551405",
          "CHEMBL551526",
          "CHEMBL551605",
          "CHEMBL551606",
          "CHEMBL55161",
          "CHEMBL55210",
          "CHEMBL55233",
          "CHEMBL55327",
          "CHEMBL55386",
          "CHEMBL554013",
          "CHEMBL554978",
          "CHEMBL55576",
          "CHEMBL556197",
          "CHEMBL556294",
          "CHEMBL556386",
          "CHEMBL556728",
          "CHEMBL556912",
          "CHEMBL55726",
          "CHEMBL557316",
          "CHEMBL557364",
          "CHEMBL557516",
          "CHEMBL557654",
          "CHEMBL558365",
          "CHEMBL558367",
          "CHEMBL558418",
          "CHEMBL558846",
          "CHEMBL558847",
          "CHEMBL55912",
          "CHEMBL559539",
          "CHEMBL55963",
          "CHEMBL559678",
          "CHEMBL559936",
          "CHEMBL560070",
          "CHEMBL56042",
          "CHEMBL560588",
          "CHEMBL560589",
          "CHEMBL561190",
          "CHEMBL561267",
          "CHEMBL56136",
          "CHEMBL561388",
          "CHEMBL561591",
          "CHEMBL56162",
          "CHEMBL561734",
          "CHEMBL561873",
          "CHEMBL562133",
          "CHEMBL562134",
          "CHEMBL562191",
          "CHEMBL562390",
          "CHEMBL562391",
          "CHEMBL56242",
          "CHEMBL562573",
          "CHEMBL56264",
          "CHEMBL562750",
          "CHEMBL562975",
          "CHEMBL56342",
          "CHEMBL563439",
          "CHEMBL563440",
          "CHEMBL563530",
          "CHEMBL563702",
          "CHEMBL564055",
          "CHEMBL564058",
          "CHEMBL564122",
          "CHEMBL564263",
          "CHEMBL56469",
          "CHEMBL56496",
          "CHEMBL565173",
          "CHEMBL56605",
          "CHEMBL566268",
          "CHEMBL566475",
          "CHEMBL566476",
          "CHEMBL56685",
          "CHEMBL566906",
          "CHEMBL566918",
          "CHEMBL566919",
          "CHEMBL566934",
          "CHEMBL56713",
          "CHEMBL567138",
          "CHEMBL567542",
          "CHEMBL567748",
          "CHEMBL567956",
          "CHEMBL567986",
          "CHEMBL568170",
          "CHEMBL568217",
          "CHEMBL56852",
          "CHEMBL56876",
          "CHEMBL56907",
          "CHEMBL57041",
          "CHEMBL57080",
          "CHEMBL572111",
          "CHEMBL572333",
          "CHEMBL57368",
          "CHEMBL57405",
          "CHEMBL57550",
          "CHEMBL578159",
          "CHEMBL578583",
          "CHEMBL578586",
          "CHEMBL583023",
          "CHEMBL583408",
          "CHEMBL59091",
          "CHEMBL59258",
          "CHEMBL592955",
          "CHEMBL593265",
          "CHEMBL593985",
          "CHEMBL594012",
          "CHEMBL594037",
          "CHEMBL594184",
          "CHEMBL594202",
          "CHEMBL594209",
          "CHEMBL594220",
          "CHEMBL594497",
          "CHEMBL594510",
          "CHEMBL594572",
          "CHEMBL594664",
          "CHEMBL594720",
          "CHEMBL594724",
          "CHEMBL59476",
          "CHEMBL595073",
          "CHEMBL595074",
          "CHEMBL595075",
          "CHEMBL595377",
          "CHEMBL595591",
          "CHEMBL595605",
          "CHEMBL596517",
          "CHEMBL599872",
          "CHEMBL604276",
          "CHEMBL60521",
          "CHEMBL606670",
          "CHEMBL60749",
          "CHEMBL61291",
          "CHEMBL63952",
          "CHEMBL65148",
          "CHEMBL65589",
          "CHEMBL66128",
          "CHEMBL66520",
          "CHEMBL66579",
          "CHEMBL67023",
          "CHEMBL67695",
          "CHEMBL68161",
          "CHEMBL68311",
          "CHEMBL68577",
          "CHEMBL68841",
          "CHEMBL72250",
          "CHEMBL72575",
          "CHEMBL72774",
          "CHEMBL72889",
          "CHEMBL73033",
          "CHEMBL73255",
          "CHEMBL73644",
          "CHEMBL73830",
          "CHEMBL73833",
          "CHEMBL73926",
          "CHEMBL74147",
          "CHEMBL74332",
          "CHEMBL74344",
          "CHEMBL74575",
          "CHEMBL74598",
          "CHEMBL74648",
          "CHEMBL74651",
          "CHEMBL74769",
          "CHEMBL74813",
          "CHEMBL74947",
          "CHEMBL74965",
          "CHEMBL75220",
          "CHEMBL75477",
          "CHEMBL75506",
          "CHEMBL75519",
          "CHEMBL75526",
          "CHEMBL75615",
          "CHEMBL75785",
          "CHEMBL75936",
          "CHEMBL76180",
          "CHEMBL76333",
          "CHEMBL76445",
          "CHEMBL76471",
          "CHEMBL76522",
          "CHEMBL76669",
          "CHEMBL76688",
          "CHEMBL76746",
          "CHEMBL777",
          "CHEMBL77915",
          "CHEMBL7816",
          "CHEMBL78189",
          "CHEMBL7839",
          "CHEMBL78408",
          "CHEMBL78475",
          "CHEMBL79118",
          "CHEMBL79428",
          "CHEMBL79463",
          "CHEMBL79493",
          "CHEMBL7958",
          "CHEMBL79662",
          "CHEMBL79973",
          "CHEMBL80072",
          "CHEMBL80601",
          "CHEMBL80797",
          "CHEMBL81249",
          "CHEMBL81357",
          "CHEMBL81892",
          "CHEMBL81902",
          "CHEMBL82320",
          "CHEMBL82333",
          "CHEMBL82368",
          "CHEMBL82381",
          "CHEMBL82588",
          "CHEMBL82774",
          "CHEMBL82775",
          "CHEMBL82964",
          "CHEMBL83046",
          "CHEMBL83342",
          "CHEMBL83564",
          "CHEMBL83565",
          "CHEMBL83687",
          "CHEMBL83700",
          "CHEMBL83770",
          "CHEMBL83814",
          "CHEMBL83858",
          "CHEMBL84035",
          "CHEMBL84061",
          "CHEMBL84159",
          "CHEMBL84164",
          "CHEMBL84205",
          "CHEMBL84319",
          "CHEMBL84442",
          "CHEMBL84498",
          "CHEMBL84713",
          "CHEMBL84724",
          "CHEMBL84758",
          "CHEMBL84768",
          "CHEMBL84782",
          "CHEMBL84839",
          "CHEMBL85092",
          "CHEMBL85128",
          "CHEMBL85136",
          "CHEMBL85154",
          "CHEMBL85164",
          "CHEMBL85213",
          "CHEMBL85215",
          "CHEMBL85275",
          "CHEMBL85310",
          "CHEMBL85352",
          "CHEMBL85418",
          "CHEMBL85546",
          "CHEMBL85563",
          "CHEMBL85693",
          "CHEMBL85843",
          "CHEMBL85874",
          "CHEMBL85914",
          "CHEMBL85935",
          "CHEMBL86006",
          "CHEMBL86037",
          "CHEMBL86142",
          "CHEMBL86173",
          "CHEMBL86253",
          "CHEMBL86364",
          "CHEMBL88117",
          "CHEMBL88975",
          "CHEMBL89299",
          "CHEMBL89549",
          "CHEMBL90327",
          "CHEMBL90730",
          "CHEMBL91086",
          "CHEMBL91944",
          "CHEMBL92434",
          "CHEMBL92587",
          "CHEMBL93727",
          "CHEMBL94187",
          "CHEMBL95260",
          "CHEMBL95813",
          "CHEMBL9601",
          "CHEMBL9617",
          "CHEMBL9631",
          "CHEMBL9632",
          "CHEMBL9644",
          "CHEMBL9702",
          "CHEMBL9773",
          "CHEMBL9784",
          "CHEMBL9792",
          "CHEMBL97927",
          "CHEMBL9802",
          "CHEMBL9809",
          "CHEMBL9816",
          "CHEMBL98422",
          "CHEMBL9865",
          "CHEMBL9876",
          "CHEMBL9895",
          "CHEMBL9901",
          "CHEMBL9909",
          "CHEMBL9916",
          "CHEMBL9923",
          "CHEMBL9933",
          "CHEMBL9945",
          "CHEMBL99558",
          "CHEMBL9969",
          "CHEMBL9977",
          "CHEMBL9978",
          "CHEMBL9981",
          "CHEMBL9984",
          "CHEMBL9990",
          "CHEMBL9991",
          "CHEMBL9995"
        ],
        "number_of_missing_values": "0"
      },
      {
        "data_type": "numeric",
        "index": "1",
        "is_ignore": "false",
        "is_row_identifier": "false",
        "is_target": "false",
        "name": "SpMax7_Bh.m.",
        "number_of_missing_values": "0"
      },
      {
        "data_type": "numeric",
        "index": "2",
        "is_ignore": "false",
        "is_row_identifier": "false",
        "is_target": "false",
        "name": "ZM2Per",
        "number_of_missing_values": "0"
      },
      {
        "data_type": "numeric",
        "index": "3",
        "is_ignore": "false",
        "is_row_identifier": "false",
        "is_target": "false",
        "name": "Eig01_EA.dm.",
        "number_of_missing_values": "0"
      },
      {
        "data_type": "numeric",
        "index": "4",
        "is_ignore": "false",
        "is_row_identifier": "false",
        "is_target": "false",
        "name": "SpMax_EA.dm.",
        "number_of_missing_values": "0"
      },
      {
        "data_type": "numeric",
        "index": "5",
        "is_ignore": "false",
        "is_row_identifier": "false",
        "is_target": "false",
        "name": "Eig07_AEA.bo.",
        "number_of_missing_values": "0"
      },
      {
        "data_type": "numeric",
        "index": "6",
        "is_ignore": "false",
        "is_row_identifier": "false",
        "is_target": "false",
        "name": "SM14_EA.dm.",
        "number_of_missing_values": "0"
      },
      {
        "data_type": "numeric",
        "index": "7",
        "is_ignore": "false",
        "is_row_identifier": "false",
        "is_target": "false",
        "name": "SM12_EA.ed.",
        "number_of_missing_values": "0"
      },
      {
        "data_type": "numeric",
        "index": "8",
        "is_ignore": "false",
        "is_row_identifier": "false",
        "is_target": "false",
        "name": "Eig09_EA.bo.",
        "number_of_missing_values": "0"
      },
      {
        "data_type": "numeric",
        "index": "9",
        "is_ignore": "false",
        "is_row_identifier": "false",
        "is_target": "false",
        "name": "ZM2Kup",
        "number_of_missing_values": "0"
      },
      {
        "data_type": "numeric",
        "index": "10",
        "is_ignore": "false",
        "is_row_identifier": "false",
        "is_target": "false",
        "name": "ZM2MulPer",
        "number_of_missing_values": "0"
      },
      {
        "data_type": "numeric",
        "index": "11",
        "is_ignore": "false",
        "is_row_identifier": "false",
        "is_target": "false",
        "name": "Eig01_AEA.ed.",
        "number_of_missing_values": "0"
      },
      {
        "data_type": "numeric",
        "index": "12",
        "is_ignore": "false",
        "is_row_identifier": "false",
        "is_target": "false",
        "name": "SpMax_AEA.ed.",
        "number_of_missing_values": "0"
      },
      {
        "data_type": "numeric",
        "index": "13",
        "is_ignore": "false",
        "is_row_identifier": "false",
        "is_target": "false",
        "name": "SpMax8_Bh.v.",
        "number_of_missing_values": "0"
      },
      {
        "data_type": "numeric",
        "index": "14",
        "is_ignore": "false",
        "is_row_identifier": "false",
        "is_target": "false",
        "name": "SpMax4_Bh.m.",
        "number_of_missing_values": "0"
      },
      {
        "data_type": "numeric",
        "index": "15",
        "is_ignore": "false",
        "is_row_identifier": "false",
        "is_target": "false",
        "name": "Eig01_EA.ed.",
        "number_of_missing_values": "0"
      },
      {
        "data_type": "numeric",
        "index": "16",
        "is_ignore": "false",
        "is_row_identifier": "false",
        "is_target": "false",
        "name": "SM10_AEA.dm.",
        "number_of_missing_values": "0"
      },
      {
        "data_type": "numeric",
        "index": "17",
        "is_ignore": "false",
        "is_row_identifier": "false",
        "is_target": "false",
        "name": "SpMax_EA.ed.",
        "number_of_missing_values": "0"
      },
      {
        "data_type": "numeric",
        "index": "18",
        "is_ignore": "false",
        "is_row_identifier": "false",
        "is_target": "false",
        "name": "nSO2N",
        "number_of_missing_values": "0"
      },
      {
        "data_type": "numeric",
        "index": "19",
        "is_ignore": "false",
        "is_row_identifier": "false",
        "is_target": "false",
        "name": "C.003",
        "number_of_missing_values": "0"
      },
      {
        "data_type": "numeric",
        "index": "20",
        "is_ignore": "false",
        "is_row_identifier": "false",
        "is_target": "false",
        "name": "MATS3m",
        "number_of_missing_values": "0"
      },
      {
        "data_type": "numeric",
        "index": "21",
        "is_ignore": "false",
        "is_row_identifier": "false",
        "is_target": "false",
        "name": "C.007",
        "number_of_missing_values": "0"
      },
      {
        "data_type": "numeric",
        "index": "22",
        "is_ignore": "false",
        "is_row_identifier": "false",
        "is_target": "false",
        "name": "SpMax7_Bh.v.",
        "number_of_missing_values": "0"
      },
      {
        "data_type": "numeric",
        "index": "23",
        "is_ignore": "false",
        "is_row_identifier": "false",
        "is_target": "false",
        "name": "Eig14_EA.bo.",
        "number_of_missing_values": "0"
      },
      {
        "data_type": "numeric",
        "index": "24",
        "is_ignore": "false",
        "is_row_identifier": "false",
        "is_target": "false",
        "name": "Eig01_AEA.ri.",
        "number_of_missing_values": "0"
      },
      {
        "data_type": "numeric",
        "index": "25",
        "is_ignore": "false",
        "is_row_identifier": "false",
        "is_target": "false",
        "name": "SpMax_AEA.ri.",
        "number_of_missing_values": "0"
      },
      {
        "data_type": "numeric",
        "index": "26",
        "is_ignore": "false",
        "is_row_identifier": "false",
        "is_target": "false",
        "name": "Eig08_EA.bo.",
        "number_of_missing_values": "0"
      },
      {
        "data_type": "numeric",
        "index": "27",
        "is_ignore": "false",
        "is_row_identifier": "false",
        "is_target": "false",
        "name": "SM12_EA.dm.",
        "number_of_missing_values": "0"
      },
      {
        "data_type": "numeric",
        "index": "28",
        "is_ignore": "false",
        "is_row_identifier": "false",
        "is_target": "false",
        "name": "SpMax3_Bh.m.",
        "number_of_missing_values": "0"
      },
      {
        "data_type": "numeric",
        "index": "29",
        "is_ignore": "false",
        "is_row_identifier": "false",
        "is_target": "false",
        "name": "GATS3m",
        "number_of_missing_values": "0"
      },
      {
        "data_type": "numeric",
        "index": "30",
        "is_ignore": "false",
        "is_row_identifier": "false",
        "is_target": "false",
        "name": "Eig09_AEA.bo.",
        "number_of_missing_values": "0"
      },
      {
        "data_type": "numeric",
        "index": "31",
        "is_ignore": "false",
        "is_row_identifier": "false",
        "is_target": "false",
        "name": "SM06_AEA.bo.",
        "number_of_missing_values": "0"
      },
      {
        "data_type": "numeric",
        "index": "32",
        "is_ignore": "false",
        "is_row_identifier": "false",
        "is_target": "false",
        "name": "SM13_EA.ed.",
        "number_of_missing_values": "0"
      },
      {
        "data_type": "numeric",
        "index": "33",
        "is_ignore": "false",
        "is_row_identifier": "false",
        "is_target": "false",
        "name": "SpMax4_Bh.v.",
        "number_of_missing_values": "0"
      },
      {
        "data_type": "numeric",
        "index": "34",
        "is_ignore": "false",
        "is_row_identifier": "false",
        "is_target": "false",
        "name": "SM10_EA.dm.",
        "number_of_missing_values": "0"
      },
      {
        "data_type": "numeric",
        "index": "35",
        "is_ignore": "false",
        "is_row_identifier": "false",
        "is_target": "false",
        "name": "C.009",
        "number_of_missing_values": "0"
      },
      {
        "data_type": "numeric",
        "index": "36",
        "is_ignore": "false",
        "is_row_identifier": "false",
        "is_target": "false",
        "name": "Eig01_EA",
        "number_of_missing_values": "0"
      },
      {
        "data_type": "numeric",
        "index": "37",
        "is_ignore": "false",
        "is_row_identifier": "false",
        "is_target": "false",
        "name": "SM09_AEA.bo.",
        "number_of_missing_values": "0"
      },
      {
        "data_type": "numeric",
        "index": "38",
        "is_ignore": "false",
        "is_row_identifier": "false",
        "is_target": "false",
        "name": "SpMax_EA",
        "number_of_missing_values": "0"
      },
      {
        "data_type": "numeric",
        "index": "39",
        "is_ignore": "false",
        "is_row_identifier": "false",
        "is_target": "false",
        "name": "Eta_beta",
        "number_of_missing_values": "0"
      },
      {
        "data_type": "numeric",
        "index": "40",
        "is_ignore": "false",
        "is_row_identifier": "false",
        "is_target": "false",
        "name": "SM15_EA.ed.",
        "number_of_missing_values": "0"
      },
      {
        "data_type": "numeric",
        "index": "41",
        "is_ignore": "false",
        "is_row_identifier": "false",
        "is_target": "false",
        "name": "SpMax4_Bh.p.",
        "number_of_missing_values": "0"
      },
      {
        "data_type": "numeric",
        "index": "42",
        "is_ignore": "false",
        "is_row_identifier": "false",
        "is_target": "false",
        "name": "IC2",
        "number_of_missing_values": "0"
      },
      {
        "data_type": "numeric",
        "index": "43",
        "is_ignore": "false",
        "is_row_identifier": "false",
        "is_target": "false",
        "name": "Eig06_EA.bo.",
        "number_of_missing_values": "0"
      },
      {
        "data_type": "numeric",
        "index": "44",
        "is_ignore": "false",
        "is_row_identifier": "false",
        "is_target": "false",
        "name": "Eig06_EA.ri.",
        "number_of_missing_values": "0"
      },
      {
        "data_type": "numeric",
        "index": "45",
        "is_ignore": "false",
        "is_row_identifier": "false",
        "is_target": "false",
        "name": "Eig02_AEA.bo.",
        "number_of_missing_values": "0"
      },
      {
        "data_type": "numeric",
        "index": "46",
        "is_ignore": "false",
        "is_row_identifier": "false",
        "is_target": "false",
        "name": "NsssN",
        "number_of_missing_values": "0"
      },
      {
        "data_type": "numeric",
        "index": "47",
        "is_ignore": "false",
        "is_row_identifier": "false",
        "is_target": "false",
        "name": "SM05_EA.dm.",
        "number_of_missing_values": "0"
      },
      {
        "data_type": "numeric",
        "index": "48",
        "is_ignore": "false",
        "is_row_identifier": "false",
        "is_target": "false",
        "name": "SpMaxA_EA.ri.",
        "number_of_missing_values": "0"
      },
      {
        "data_type": "numeric",
        "index": "49",
        "is_ignore": "false",
        "is_row_identifier": "false",
        "is_target": "false",
        "name": "GGI2",
        "number_of_missing_values": "0"
      },
      {
        "data_type": "numeric",
        "index": "50",
        "is_ignore": "false",
        "is_row_identifier": "false",
        "is_target": "false",
        "name": "C.013",
        "number_of_missing_values": "0"
      },
      {
        "data_type": "numeric",
        "index": "51",
        "is_ignore": "false",
        "is_row_identifier": "false",
        "is_target": "false",
        "name": "F.083",
        "number_of_missing_values": "0"
      },
      {
        "data_type": "numeric",
        "index": "52",
        "is_ignore": "false",
        "is_row_identifier": "false",
        "is_target": "false",
        "name": "nCRX3",
        "number_of_missing_values": "0"
      },
      {
        "data_type": "numeric",
        "index": "53",
        "is_ignore": "false",
        "is_row_identifier": "false",
        "is_target": "false",
        "name": "SM07_AEA.bo.",
        "number_of_missing_values": "0"
      },
      {
        "data_type": "numeric",
        "index": "54",
        "is_ignore": "false",
        "is_row_identifier": "false",
        "is_target": "false",
        "name": "nR04",
        "number_of_missing_values": "0"
      },
      {
        "data_type": "numeric",
        "index": "55",
        "is_ignore": "false",
        "is_row_identifier": "false",
        "is_target": "false",
        "name": "SpMax4_Bh.e.",
        "number_of_missing_values": "0"
      },
      {
        "data_type": "numeric",
        "index": "56",
        "is_ignore": "false",
        "is_row_identifier": "false",
        "is_target": "false",
        "name": "P_VSA_e_6",
        "number_of_missing_values": "0"
      },
      {
        "data_type": "numeric",
        "index": "57",
        "is_ignore": "false",
        "is_row_identifier": "false",
        "is_target": "false",
        "name": "SpDiam_EA",
        "number_of_missing_values": "0"
      },
      {
        "data_type": "numeric",
        "index": "58",
        "is_ignore": "false",
        "is_row_identifier": "false",
        "is_target": "false",
        "name": "SpDiam_EA.dm.",
        "number_of_missing_values": "0"
      },
      {
        "data_type": "numeric",
        "index": "59",
        "is_ignore": "false",
        "is_row_identifier": "false",
        "is_target": "false",
        "name": "SpMax4_Bh.i.",
        "number_of_missing_values": "0"
      },
      {
        "data_type": "numeric",
        "index": "60",
        "is_ignore": "false",
        "is_row_identifier": "false",
        "is_target": "false",
        "name": "SM03_EA.dm.",
        "number_of_missing_values": "0"
      },
      {
        "data_type": "numeric",
        "index": "61",
        "is_ignore": "false",
        "is_row_identifier": "false",
        "is_target": "false",
        "name": "Eta_FL",
        "number_of_missing_values": "0"
      },
      {
        "data_type": "numeric",
        "index": "62",
        "is_ignore": "false",
        "is_row_identifier": "false",
        "is_target": "false",
        "name": "SpMax6_Bh.v.",
        "number_of_missing_values": "0"
      },
      {
        "data_type": "numeric",
        "index": "63",
        "is_ignore": "false",
        "is_row_identifier": "false",
        "is_target": "false",
        "name": "nBeta.Lactams",
        "number_of_missing_values": "0"
      },
      {
        "data_type": "numeric",
        "index": "64",
        "is_ignore": "false",
        "is_row_identifier": "false",
        "is_target": "false",
        "name": "O.058",
        "number_of_missing_values": "0"
      },
      {
        "data_type": "numeric",
        "index": "65",
        "is_ignore": "false",
        "is_row_identifier": "false",
        "is_target": "false",
        "name": "ATS4s",
        "number_of_missing_values": "0"
      },
      {
        "data_type": "numeric",
        "index": "66",
        "is_ignore": "false",
        "is_row_identifier": "false",
        "is_target": "false",
        "name": "CATS2D_04_AL",
        "number_of_missing_values": "0"
      },
      {
        "data_type": "numeric",
        "index": "67",
        "is_ignore": "false",
        "is_row_identifier": "false",
        "is_target": "false",
        "name": "MAXDN",
        "number_of_missing_values": "0"
      },
      {
        "data_type": "numeric",
        "index": "68",
        "is_ignore": "false",
        "is_row_identifier": "false",
        "is_target": "false",
        "name": "Eig06_AEA.ed.",
        "number_of_missing_values": "0"
      },
      {
        "data_type": "numeric",
        "index": "69",
        "is_ignore": "false",
        "is_row_identifier": "false",
        "is_target": "false",
        "name": "SpMin5_Bh.m.",
        "number_of_missing_values": "0"
      },
      {
        "data_type": "numeric",
        "index": "70",
        "is_ignore": "false",
        "is_row_identifier": "false",
        "is_target": "false",
        "name": "Eig04_EA.bo.",
        "number_of_missing_values": "0"
      },
      {
        "data_type": "numeric",
        "index": "71",
        "is_ignore": "false",
        "is_row_identifier": "false",
        "is_target": "false",
        "name": "SM14_AEA.ri.",
        "number_of_missing_values": "0"
      },
      {
        "data_type": "numeric",
        "index": "72",
        "is_ignore": "false",
        "is_row_identifier": "false",
        "is_target": "false",
        "name": "SpMin1_Bh.s.",
        "number_of_missing_values": "0"
      },
      {
        "data_type": "numeric",
        "index": "73",
        "is_ignore": "false",
        "is_row_identifier": "false",
        "is_target": "false",
        "name": "NdO",
        "number_of_missing_values": "0"
      },
      {
        "data_type": "numeric",
        "index": "74",
        "is_ignore": "false",
        "is_row_identifier": "false",
        "is_target": "false",
        "name": "SM11_EA.ed.",
        "number_of_missing_values": "0"
      },
      {
        "data_type": "numeric",
        "index": "75",
        "is_ignore": "false",
        "is_row_identifier": "false",
        "is_target": "false",
        "name": "Eig01_EA.ri.",
        "number_of_missing_values": "0"
      },
      {
        "data_type": "numeric",
        "index": "76",
        "is_ignore": "false",
        "is_row_identifier": "false",
        "is_target": "false",
        "name": "SpMax_EA.ri.",
        "number_of_missing_values": "0"
      },
      {
        "data_type": "numeric",
        "index": "77",
        "is_ignore": "false",
        "is_row_identifier": "false",
        "is_target": "false",
        "name": "P_VSA_p_1",
        "number_of_missing_values": "0"
      },
      {
        "data_type": "numeric",
        "index": "78",
        "is_ignore": "false",
        "is_row_identifier": "false",
        "is_target": "false",
        "name": "Eig01_AEA.dm.",
        "number_of_missing_values": "0"
      },
      {
        "data_type": "numeric",
        "index": "79",
        "is_ignore": "false",
        "is_row_identifier": "false",
        "is_target": "false",
        "name": "SpMax_AEA.dm.",
        "number_of_missing_values": "0"
      },
      {
        "data_type": "numeric",
        "index": "80",
        "is_ignore": "false",
        "is_row_identifier": "false",
        "is_target": "false",
        "name": "SpMax5_Bh.m.",
        "number_of_missing_values": "0"
      },
      {
        "data_type": "numeric",
        "index": "81",
        "is_ignore": "false",
        "is_row_identifier": "false",
        "is_target": "false",
        "name": "SpDiam_AEA.dm.",
        "number_of_missing_values": "0"
      },
      {
        "data_type": "numeric",
        "index": "82",
        "is_ignore": "false",
        "is_row_identifier": "false",
        "is_target": "false",
        "name": "Pol",
        "number_of_missing_values": "0"
      },
      {
        "data_type": "numeric",
        "index": "83",
        "is_ignore": "false",
        "is_row_identifier": "false",
        "is_target": "false",
        "name": "Eig05_AEA.ri.",
        "number_of_missing_values": "0"
      },
      {
        "data_type": "numeric",
        "index": "84",
        "is_ignore": "false",
        "is_row_identifier": "false",
        "is_target": "false",
        "name": "nX",
        "number_of_missing_values": "0"
      },
      {
        "data_type": "numeric",
        "index": "85",
        "is_ignore": "false",
        "is_row_identifier": "false",
        "is_target": "false",
        "name": "C.038",
        "number_of_missing_values": "0"
      },
      {
        "data_type": "numeric",
        "index": "86",
        "is_ignore": "false",
        "is_row_identifier": "false",
        "is_target": "false",
        "name": "ATS8m",
        "number_of_missing_values": "0"
      },
      {
        "data_type": "numeric",
        "index": "87",
        "is_ignore": "false",
        "is_row_identifier": "false",
        "is_target": "false",
        "name": "nRCO",
        "number_of_missing_values": "0"
      },
      {
        "data_type": "numeric",
        "index": "88",
        "is_ignore": "false",
        "is_row_identifier": "false",
        "is_target": "false",
        "name": "ECC",
        "number_of_missing_values": "0"
      },
      {
        "data_type": "numeric",
        "index": "89",
        "is_ignore": "false",
        "is_row_identifier": "false",
        "is_target": "false",
        "name": "SM08_EA.dm.",
        "number_of_missing_values": "0"
      },
      {
        "data_type": "numeric",
        "index": "90",
        "is_ignore": "false",
        "is_row_identifier": "false",
        "is_target": "false",
        "name": "CATS2D_06_AL",
        "number_of_missing_values": "0"
      },
      {
        "data_type": "numeric",
        "index": "91",
        "is_ignore": "false",
        "is_row_identifier": "false",
        "is_target": "false",
        "name": "CSI",
        "number_of_missing_values": "0"
      },
      {
        "data_type": "numeric",
        "index": "92",
        "is_ignore": "false",
        "is_row_identifier": "false",
        "is_target": "false",
        "name": "GGI8",
        "number_of_missing_values": "0"
      },
      {
        "data_type": "numeric",
        "index": "93",
        "is_ignore": "false",
        "is_row_identifier": "false",
        "is_target": "false",
        "name": "SM06_AEA.ed.",
        "number_of_missing_values": "0"
      },
      {
        "data_type": "numeric",
        "index": "94",
        "is_ignore": "false",
        "is_row_identifier": "false",
        "is_target": "false",
        "name": "GATS2m",
        "number_of_missing_values": "0"
      },
      {
        "data_type": "numeric",
        "index": "95",
        "is_ignore": "false",
        "is_row_identifier": "false",
        "is_target": "false",
        "name": "SM06_EA.bo.",
        "number_of_missing_values": "0"
      },
      {
        "data_type": "numeric",
        "index": "96",
        "is_ignore": "false",
        "is_row_identifier": "false",
        "is_target": "false",
        "name": "ATSC4e",
        "number_of_missing_values": "0"
      },
      {
        "data_type": "numeric",
        "index": "97",
        "is_ignore": "false",
        "is_row_identifier": "false",
        "is_target": "false",
        "name": "X3",
        "number_of_missing_values": "0"
      },
      {
        "data_type": "numeric",
        "index": "98",
        "is_ignore": "false",
        "is_row_identifier": "false",
        "is_target": "false",
        "name": "ATSC6s",
        "number_of_missing_values": "0"
      },
      {
        "data_type": "numeric",
        "index": "99",
        "is_ignore": "false",
        "is_row_identifier": "false",
        "is_target": "false",
        "name": "GATS2s",
        "number_of_missing_values": "0"
      },
      {
        "data_type": "numeric",
        "index": "100",
        "is_ignore": "false",
        "is_row_identifier": "false",
        "is_target": "false",
        "name": "Eta_F_A",
        "number_of_missing_values": "0"
      },
      {
        "data_type": "numeric",
        "index": "101",
        "is_ignore": "false",
        "is_row_identifier": "false",
        "is_target": "false",
        "name": "SpMax6_Bh.p.",
        "number_of_missing_values": "0"
      },
      {
        "data_type": "numeric",
        "index": "102",
        "is_ignore": "false",
        "is_row_identifier": "false",
        "is_target": "false",
        "name": "SM03_EA.bo.",
        "number_of_missing_values": "0"
      },
      {
        "data_type": "numeric",
        "index": "103",
        "is_ignore": "false",
        "is_row_identifier": "false",
        "is_target": "false",
        "name": "ATS6s",
        "number_of_missing_values": "0"
      },
      {
        "data_type": "numeric",
        "index": "104",
        "is_ignore": "false",
        "is_row_identifier": "false",
        "is_target": "false",
        "name": "SpDiam_EA.ed.",
        "number_of_missing_values": "0"
      },
      {
        "data_type": "numeric",
        "index": "105",
        "is_ignore": "false",
        "is_row_identifier": "false",
        "is_target": "false",
        "name": "Eig02_EA.ri.",
        "number_of_missing_values": "0"
      },
      {
        "data_type": "numeric",
        "index": "106",
        "is_ignore": "false",
        "is_row_identifier": "false",
        "is_target": "false",
        "name": "Eig07_EA",
        "number_of_missing_values": "0"
      },
      {
        "data_type": "numeric",
        "index": "107",
        "is_ignore": "false",
        "is_row_identifier": "false",
        "is_target": "false",
        "name": "SM15_AEA.bo.",
        "number_of_missing_values": "0"
      },
      {
        "data_type": "numeric",
        "index": "108",
        "is_ignore": "false",
        "is_row_identifier": "false",
        "is_target": "false",
        "name": "ATSC6p",
        "number_of_missing_values": "0"
      },
      {
        "data_type": "numeric",
        "index": "109",
        "is_ignore": "false",
        "is_row_identifier": "false",
        "is_target": "false",
        "name": "ZM1Per",
        "number_of_missing_values": "0"
      },
      {
        "data_type": "numeric",
        "index": "110",
        "is_ignore": "false",
        "is_row_identifier": "false",
        "is_target": "false",
        "name": "Wap",
        "number_of_missing_values": "0"
      },
      {
        "data_type": "numeric",
        "index": "111",
        "is_ignore": "false",
        "is_row_identifier": "false",
        "is_target": "false",
        "name": "SpMax5_Bh.v.",
        "number_of_missing_values": "0"
      },
      {
        "data_type": "numeric",
        "index": "112",
        "is_ignore": "false",
        "is_row_identifier": "false",
        "is_target": "false",
        "name": "SRW09",
        "number_of_missing_values": "0"
      },
      {
        "data_type": "numeric",
        "index": "113",
        "is_ignore": "false",
        "is_row_identifier": "false",
        "is_target": "false",
        "name": "SM08_AEA.bo.",
        "number_of_missing_values": "0"
      },
      {
        "data_type": "numeric",
        "index": "114",
        "is_ignore": "false",
        "is_row_identifier": "false",
        "is_target": "false",
        "name": "Eig01_EA.bo.",
        "number_of_missing_values": "0"
      },
      {
        "data_type": "numeric",
        "index": "115",
        "is_ignore": "false",
        "is_row_identifier": "false",
        "is_target": "false",
        "name": "SM11_AEA.ri.",
        "number_of_missing_values": "0"
      },
      {
        "data_type": "numeric",
        "index": "116",
        "is_ignore": "false",
        "is_row_identifier": "false",
        "is_target": "false",
        "name": "SpMax_EA.bo.",
        "number_of_missing_values": "0"
      },
      {
        "data_type": "numeric",
        "index": "117",
        "is_ignore": "false",
        "is_row_identifier": "false",
        "is_target": "false",
        "name": "SpMin4_Bh.m.",
        "number_of_missing_values": "0"
      },
      {
        "data_type": "numeric",
        "index": "118",
        "is_ignore": "false",
        "is_row_identifier": "false",
        "is_target": "false",
        "name": "NssNH",
        "number_of_missing_values": "0"
      },
      {
        "data_type": "numeric",
        "index": "119",
        "is_ignore": "false",
        "is_row_identifier": "false",
        "is_target": "false",
        "name": "ATS3s",
        "number_of_missing_values": "0"
      },
      {
        "data_type": "numeric",
        "index": "120",
        "is_ignore": "false",
        "is_row_identifier": "false",
        "is_target": "false",
        "name": "ATSC1i",
        "number_of_missing_values": "0"
      },
      {
        "data_type": "numeric",
        "index": "121",
        "is_ignore": "false",
        "is_row_identifier": "false",
        "is_target": "false",
        "name": "ATSC4s",
        "number_of_missing_values": "0"
      },
      {
        "data_type": "numeric",
        "index": "122",
        "is_ignore": "false",
        "is_row_identifier": "false",
        "is_target": "false",
        "name": "SM04_EA.bo.",
        "number_of_missing_values": "0"
      },
      {
        "data_type": "numeric",
        "index": "123",
        "is_ignore": "false",
        "is_row_identifier": "false",
        "is_target": "false",
        "name": "X3sol",
        "number_of_missing_values": "0"
      },
      {
        "data_type": "numeric",
        "index": "124",
        "is_ignore": "false",
        "is_row_identifier": "false",
        "is_target": "false",
        "name": "CATS2D_04_AA",
        "number_of_missing_values": "0"
      },
      {
        "data_type": "numeric",
        "index": "125",
        "is_ignore": "false",
        "is_row_identifier": "false",
        "is_target": "false",
        "name": "MATS1v",
        "number_of_missing_values": "0"
      },
      {
        "data_type": "numeric",
        "index": "126",
        "is_ignore": "false",
        "is_row_identifier": "false",
        "is_target": "false",
        "name": "ZM1MulPer",
        "number_of_missing_values": "0"
      },
      {
        "data_type": "numeric",
        "index": "127",
        "is_ignore": "false",
        "is_row_identifier": "false",
        "is_target": "false",
        "name": "GATS8m",
        "number_of_missing_values": "0"
      },
      {
        "data_type": "numeric",
        "index": "128",
        "is_ignore": "false",
        "is_row_identifier": "false",
        "is_target": "false",
        "name": "Eig02_AEA.ri.",
        "number_of_missing_values": "0"
      },
      {
        "data_type": "numeric",
        "index": "129",
        "is_ignore": "false",
        "is_row_identifier": "false",
        "is_target": "false",
        "name": "Eig10_AEA.ed.",
        "number_of_missing_values": "0"
      },
      {
        "data_type": "numeric",
        "index": "130",
        "is_ignore": "false",
        "is_row_identifier": "false",
        "is_target": "false",
        "name": "nPyrrolidines",
        "number_of_missing_values": "0"
      },
      {
        "data_type": "numeric",
        "index": "131",
        "is_ignore": "false",
        "is_row_identifier": "false",
        "is_target": "false",
        "name": "ATSC7s",
        "number_of_missing_values": "0"
      },
      {
        "data_type": "numeric",
        "index": "132",
        "is_ignore": "false",
        "is_row_identifier": "false",
        "is_target": "false",
        "name": "ZM1V",
        "number_of_missing_values": "0"
      },
      {
        "data_type": "numeric",
        "index": "133",
        "is_ignore": "false",
        "is_row_identifier": "false",
        "is_target": "false",
        "name": "IAC",
        "number_of_missing_values": "0"
      },
      {
        "data_type": "numeric",
        "index": "134",
        "is_ignore": "false",
        "is_row_identifier": "false",
        "is_target": "false",
        "name": "TIC0",
        "number_of_missing_values": "0"
      },
      {
        "data_type": "numeric",
        "index": "135",
        "is_ignore": "false",
        "is_row_identifier": "false",
        "is_target": "false",
        "name": "Mi",
        "number_of_missing_values": "0"
      },
      {
        "data_type": "numeric",
        "index": "136",
        "is_ignore": "false",
        "is_row_identifier": "false",
        "is_target": "false",
        "name": "SpMax8_Bh.m.",
        "number_of_missing_values": "0"
      },
      {
        "data_type": "numeric",
        "index": "137",
        "is_ignore": "false",
        "is_row_identifier": "false",
        "is_target": "false",
        "name": "SM08_AEA.ed.",
        "number_of_missing_values": "0"
      },
      {
        "data_type": "numeric",
        "index": "138",
        "is_ignore": "false",
        "is_row_identifier": "false",
        "is_target": "false",
        "name": "MPC03",
        "number_of_missing_values": "0"
      },
      {
        "data_type": "numeric",
        "index": "139",
        "is_ignore": "false",
        "is_row_identifier": "false",
        "is_target": "false",
        "name": "SM05_AEA.ed.",
        "number_of_missing_values": "0"
      },
      {
        "data_type": "numeric",
        "index": "140",
        "is_ignore": "false",
        "is_row_identifier": "false",
        "is_target": "false",
        "name": "Eig05_EA.ri.",
        "number_of_missing_values": "0"
      },
      {
        "data_type": "numeric",
        "index": "141",
        "is_ignore": "false",
        "is_row_identifier": "false",
        "is_target": "false",
        "name": "Eig14_AEA.ed.",
        "number_of_missing_values": "0"
      },
      {
        "data_type": "numeric",
        "index": "142",
        "is_ignore": "false",
        "is_row_identifier": "false",
        "is_target": "false",
        "name": "H.046",
        "number_of_missing_values": "0"
      },
      {
        "data_type": "numeric",
        "index": "143",
        "is_ignore": "false",
        "is_row_identifier": "false",
        "is_target": "false",
        "name": "Eig07_EA.bo.",
        "number_of_missing_values": "0"
      },
      {
        "data_type": "numeric",
        "index": "144",
        "is_ignore": "false",
        "is_row_identifier": "false",
        "is_target": "false",
        "name": "MSD",
        "number_of_missing_values": "0"
      },
      {
        "data_type": "numeric",
        "index": "145",
        "is_ignore": "false",
        "is_row_identifier": "false",
        "is_target": "false",
        "name": "RDSQ",
        "number_of_missing_values": "0"
      },
      {
        "data_type": "numeric",
        "index": "146",
        "is_ignore": "false",
        "is_row_identifier": "false",
        "is_target": "false",
        "name": "SM06_EA",
        "number_of_missing_values": "0"
      },
      {
        "data_type": "numeric",
        "index": "147",
        "is_ignore": "false",
        "is_row_identifier": "false",
        "is_target": "false",
        "name": "ATSC8s",
        "number_of_missing_values": "0"
      },
      {
        "data_type": "numeric",
        "index": "148",
        "is_ignore": "false",
        "is_row_identifier": "false",
        "is_target": "false",
        "name": "MATS1i",
        "number_of_missing_values": "0"
      },
      {
        "data_type": "numeric",
        "index": "149",
        "is_ignore": "false",
        "is_row_identifier": "false",
        "is_target": "false",
        "name": "Eig08_EA.ri.",
        "number_of_missing_values": "0"
      },
      {
        "data_type": "numeric",
        "index": "150",
        "is_ignore": "false",
        "is_row_identifier": "false",
        "is_target": "false",
        "name": "SM05_EA",
        "number_of_missing_values": "0"
      },
      {
        "data_type": "numeric",
        "index": "151",
        "is_ignore": "false",
        "is_row_identifier": "false",
        "is_target": "false",
        "name": "ON0",
        "number_of_missing_values": "0"
      },
      {
        "data_type": "numeric",
        "index": "152",
        "is_ignore": "false",
        "is_row_identifier": "false",
        "is_target": "false",
        "name": "SpMax1_Bh.s.",
        "number_of_missing_values": "0"
      },
      {
        "data_type": "numeric",
        "index": "153",
        "is_ignore": "false",
        "is_row_identifier": "false",
        "is_target": "false",
        "name": "SM03_EA.ed.",
        "number_of_missing_values": "0"
      },
      {
        "data_type": "numeric",
        "index": "154",
        "is_ignore": "false",
        "is_row_identifier": "false",
        "is_target": "false",
        "name": "MWC05",
        "number_of_missing_values": "0"
      },
      {
        "data_type": "numeric",
        "index": "155",
        "is_ignore": "false",
        "is_row_identifier": "false",
        "is_target": "false",
        "name": "SM07_EA",
        "number_of_missing_values": "0"
      },
      {
        "data_type": "numeric",
        "index": "156",
        "is_ignore": "false",
        "is_row_identifier": "false",
        "is_target": "false",
        "name": "piPC03",
        "number_of_missing_values": "0"
      },
      {
        "data_type": "numeric",
        "index": "157",
        "is_ignore": "false",
        "is_row_identifier": "false",
        "is_target": "false",
        "name": "X4",
        "number_of_missing_values": "0"
      },
      {
        "data_type": "numeric",
        "index": "158",
        "is_ignore": "false",
        "is_row_identifier": "false",
        "is_target": "false",
        "name": "Eig01_AEA.bo.",
        "number_of_missing_values": "0"
      },
      {
        "data_type": "numeric",
        "index": "159",
        "is_ignore": "false",
        "is_row_identifier": "false",
        "is_target": "false",
        "name": "SpMax_AEA.bo.",
        "number_of_missing_values": "0"
      },
      {
        "data_type": "numeric",
        "index": "160",
        "is_ignore": "false",
        "is_row_identifier": "false",
        "is_target": "false",
        "name": "Eig05_EA.ed.",
        "number_of_missing_values": "0"
      },
      {
        "data_type": "numeric",
        "index": "161",
        "is_ignore": "false",
        "is_row_identifier": "false",
        "is_target": "false",
        "name": "SM14_AEA.dm.",
        "number_of_missing_values": "0"
      },
      {
        "data_type": "numeric",
        "index": "162",
        "is_ignore": "false",
        "is_row_identifier": "false",
        "is_target": "false",
        "name": "SpDiam_EA.ri.",
        "number_of_missing_values": "0"
      },
      {
        "data_type": "numeric",
        "index": "163",
        "is_ignore": "false",
        "is_row_identifier": "false",
        "is_target": "false",
        "name": "Eig08_AEA.bo.",
        "number_of_missing_values": "0"
      },
      {
        "data_type": "numeric",
        "index": "164",
        "is_ignore": "false",
        "is_row_identifier": "false",
        "is_target": "false",
        "name": "SM10_EA.ed.",
        "number_of_missing_values": "0"
      },
      {
        "data_type": "numeric",
        "index": "165",
        "is_ignore": "false",
        "is_row_identifier": "false",
        "is_target": "false",
        "name": "TPC",
        "number_of_missing_values": "0"
      },
      {
        "data_type": "numeric",
        "index": "166",
        "is_ignore": "false",
        "is_row_identifier": "false",
        "is_target": "false",
        "name": "MWC04",
        "number_of_missing_values": "0"
      },
      {
        "data_type": "numeric",
        "index": "167",
        "is_ignore": "false",
        "is_row_identifier": "false",
        "is_target": "false",
        "name": "Eig02_EA.ed.",
        "number_of_missing_values": "0"
      },
      {
        "data_type": "numeric",
        "index": "168",
        "is_ignore": "false",
        "is_row_identifier": "false",
        "is_target": "false",
        "name": "SM11_AEA.dm.",
        "number_of_missing_values": "0"
      },
      {
        "data_type": "numeric",
        "index": "169",
        "is_ignore": "false",
        "is_row_identifier": "false",
        "is_target": "false",
        "name": "Eta_betaP",
        "number_of_missing_values": "0"
      },
      {
        "data_type": "numeric",
        "index": "170",
        "is_ignore": "false",
        "is_row_identifier": "false",
        "is_target": "false",
        "name": "nRCOOR",
        "number_of_missing_values": "0"
      },
      {
        "data_type": "numeric",
        "index": "171",
        "is_ignore": "false",
        "is_row_identifier": "false",
        "is_target": "false",
        "name": "Eig08_EA",
        "number_of_missing_values": "0"
      },
      {
        "data_type": "numeric",
        "index": "172",
        "is_ignore": "false",
        "is_row_identifier": "false",
        "is_target": "false",
        "name": "SM02_AEA.dm.",
        "number_of_missing_values": "0"
      },
      {
        "data_type": "numeric",
        "index": "173",
        "is_ignore": "false",
        "is_row_identifier": "false",
        "is_target": "false",
        "name": "Eig10_AEA.bo.",
        "number_of_missing_values": "0"
      },
      {
        "data_type": "numeric",
        "index": "174",
        "is_ignore": "false",
        "is_row_identifier": "false",
        "is_target": "false",
        "name": "MWC03",
        "number_of_missing_values": "0"
      },
      {
        "data_type": "numeric",
        "index": "175",
        "is_ignore": "false",
        "is_row_identifier": "false",
        "is_target": "false",
        "name": "ZM2",
        "number_of_missing_values": "0"
      },
      {
        "data_type": "numeric",
        "index": "176",
        "is_ignore": "false",
        "is_row_identifier": "false",
        "is_target": "false",
        "name": "GATS2p",
        "number_of_missing_values": "0"
      },
      {
        "data_type": "numeric",
        "index": "177",
        "is_ignore": "false",
        "is_row_identifier": "false",
        "is_target": "false",
        "name": "Eig15_AEA.ed.",
        "number_of_missing_values": "0"
      },
      {
        "data_type": "numeric",
        "index": "178",
        "is_ignore": "false",
        "is_row_identifier": "false",
        "is_target": "false",
        "name": "SpDiam_AEA.bo.",
        "number_of_missing_values": "0"
      },
      {
        "data_type": "numeric",
        "index": "179",
        "is_ignore": "false",
        "is_row_identifier": "false",
        "is_target": "false",
        "name": "SpMax5_Bh.i.",
        "number_of_missing_values": "0"
      },
      {
        "data_type": "numeric",
        "index": "180",
        "is_ignore": "false",
        "is_row_identifier": "false",
        "is_target": "false",
        "name": "ATSC5p",
        "number_of_missing_values": "0"
      },
      {
        "data_type": "numeric",
        "index": "181",
        "is_ignore": "false",
        "is_row_identifier": "false",
        "is_target": "false",
        "name": "ATSC6m",
        "number_of_missing_values": "0"
      },
      {
        "data_type": "numeric",
        "index": "182",
        "is_ignore": "false",
        "is_row_identifier": "false",
        "is_target": "false",
        "name": "Psi_e_0",
        "number_of_missing_values": "0"
      },
      {
        "data_type": "numeric",
        "index": "183",
        "is_ignore": "false",
        "is_row_identifier": "false",
        "is_target": "false",
        "name": "TIC2",
        "number_of_missing_values": "0"
      },
      {
        "data_type": "numeric",
        "index": "184",
        "is_ignore": "false",
        "is_row_identifier": "false",
        "is_target": "false",
        "name": "Eig13_EA.ri.",
        "number_of_missing_values": "0"
      },
      {
        "data_type": "numeric",
        "index": "185",
        "is_ignore": "false",
        "is_row_identifier": "false",
        "is_target": "false",
        "name": "Eig14_EA.ri.",
        "number_of_missing_values": "0"
      },
      {
        "data_type": "numeric",
        "index": "186",
        "is_ignore": "false",
        "is_row_identifier": "false",
        "is_target": "false",
        "name": "Psi_i_s",
        "number_of_missing_values": "0"
      },
      {
        "data_type": "numeric",
        "index": "187",
        "is_ignore": "false",
        "is_row_identifier": "false",
        "is_target": "false",
        "name": "SpMax2_Bh.v.",
        "number_of_missing_values": "0"
      },
      {
        "data_type": "numeric",
        "index": "188",
        "is_ignore": "false",
        "is_row_identifier": "false",
        "is_target": "false",
        "name": "Eig13_AEA.ri.",
        "number_of_missing_values": "0"
      },
      {
        "data_type": "numeric",
        "index": "189",
        "is_ignore": "false",
        "is_row_identifier": "false",
        "is_target": "false",
        "name": "ZM2Mad",
        "number_of_missing_values": "0"
      },
      {
        "data_type": "numeric",
        "index": "190",
        "is_ignore": "false",
        "is_row_identifier": "false",
        "is_target": "false",
        "name": "AECC",
        "number_of_missing_values": "0"
      },
      {
        "data_type": "numeric",
        "index": "191",
        "is_ignore": "false",
        "is_row_identifier": "false",
        "is_target": "false",
        "name": "Eig14_AEA.ri.",
        "number_of_missing_values": "0"
      },
      {
        "data_type": "numeric",
        "index": "192",
        "is_ignore": "false",
        "is_row_identifier": "false",
        "is_target": "false",
        "name": "IDE",
        "number_of_missing_values": "0"
      },
      {
        "data_type": "numeric",
        "index": "193",
        "is_ignore": "false",
        "is_row_identifier": "false",
        "is_target": "false",
        "name": "MATS8m",
        "number_of_missing_values": "0"
      },
      {
        "data_type": "numeric",
        "index": "194",
        "is_ignore": "false",
        "is_row_identifier": "false",
        "is_target": "false",
        "name": "Eig13_EA",
        "number_of_missing_values": "0"
      },
      {
        "data_type": "numeric",
        "index": "195",
        "is_ignore": "false",
        "is_row_identifier": "false",
        "is_target": "false",
        "name": "SM07_AEA.dm.",
        "number_of_missing_values": "0"
      },
      {
        "data_type": "numeric",
        "index": "196",
        "is_ignore": "false",
        "is_row_identifier": "false",
        "is_target": "false",
        "name": "SdO",
        "number_of_missing_values": "0"
      },
      {
        "data_type": "numeric",
        "index": "197",
        "is_ignore": "false",
        "is_row_identifier": "false",
        "is_target": "false",
        "name": "SpAD_AEA.bo.",
        "number_of_missing_values": "0"
      },
      {
        "data_type": "numeric",
        "index": "198",
        "is_ignore": "false",
        "is_row_identifier": "false",
        "is_target": "false",
        "name": "SM09_AEA.ed.",
        "number_of_missing_values": "0"
      },
      {
        "data_type": "numeric",
        "index": "199",
        "is_ignore": "false",
        "is_row_identifier": "false",
        "is_target": "false",
        "name": "SpAD_AEA.ri.",
        "number_of_missing_values": "0"
      },
      {
        "data_type": "numeric",
        "index": "200",
        "is_ignore": "false",
        "is_row_identifier": "false",
        "is_target": "false",
        "name": "SPI",
        "number_of_missing_values": "0"
      },
      {
        "data_type": "numeric",
        "index": "201",
        "is_ignore": "false",
        "is_row_identifier": "false",
        "is_target": "false",
        "name": "nR05",
        "number_of_missing_values": "0"
      },
      {
        "data_type": "numeric",
        "index": "202",
        "is_ignore": "false",
        "is_row_identifier": "false",
        "is_target": "false",
        "name": "ATS4p",
        "number_of_missing_values": "0"
      },
      {
        "data_type": "numeric",
        "index": "203",
        "is_ignore": "false",
        "is_row_identifier": "false",
        "is_target": "false",
        "name": "SpAD_EA.ri.",
        "number_of_missing_values": "0"
      },
      {
        "data_type": "numeric",
        "index": "204",
        "is_ignore": "false",
        "is_row_identifier": "false",
        "is_target": "false",
        "name": "Eig14_EA",
        "number_of_missing_values": "0"
      },
      {
        "data_type": "numeric",
        "index": "205",
        "is_ignore": "false",
        "is_row_identifier": "false",
        "is_target": "false",
        "name": "SM08_AEA.dm.",
        "number_of_missing_values": "0"
      },
      {
        "data_type": "numeric",
        "index": "206",
        "is_ignore": "false",
        "is_row_identifier": "false",
        "is_target": "false",
        "name": "P_VSA_i_4",
        "number_of_missing_values": "0"
      },
      {
        "data_type": "numeric",
        "index": "207",
        "is_ignore": "false",
        "is_row_identifier": "false",
        "is_target": "false",
        "name": "Eta_F",
        "number_of_missing_values": "0"
      },
      {
        "data_type": "numeric",
        "index": "208",
        "is_ignore": "false",
        "is_row_identifier": "false",
        "is_target": "false",
        "name": "SpAD_AEA.ed.",
        "number_of_missing_values": "0"
      },
      {
        "data_type": "numeric",
        "index": "209",
        "is_ignore": "false",
        "is_row_identifier": "false",
        "is_target": "false",
        "name": "Chi0_EA.ri.",
        "number_of_missing_values": "0"
      },
      {
        "data_type": "numeric",
        "index": "210",
        "is_ignore": "false",
        "is_row_identifier": "false",
        "is_target": "false",
        "name": "ATS1s",
        "number_of_missing_values": "0"
      },
      {
        "data_type": "numeric",
        "index": "211",
        "is_ignore": "false",
        "is_row_identifier": "false",
        "is_target": "false",
        "name": "HVcpx",
        "number_of_missing_values": "0"
      },
      {
        "data_type": "numeric",
        "index": "212",
        "is_ignore": "false",
        "is_row_identifier": "false",
        "is_target": "false",
        "name": "P_VSA_m_2",
        "number_of_missing_values": "0"
      },
      {
        "data_type": "numeric",
        "index": "213",
        "is_ignore": "false",
        "is_row_identifier": "false",
        "is_target": "true",
        "name": "pXC50",
        "number_of_missing_values": "0"
      }
    ]
  }
}